qpid-notifications mailing list archives

Site index · List index
Message view « Date » · « Thread »
Top « Date » · « Thread »
From Apache Jenkins Server <jenk...@builds.apache.org>
Subject Build failed in Jenkins: Qpid-Java-Artefact-Release #757
Date Sat, 13 Apr 2013 02:45:05 GMT
See <https://builds.apache.org/job/Qpid-Java-Artefact-Release/757/>

------------------------------------------
[...truncated 186 lines...]
     [echo] Running ant for module : broker-plugins/access-control

clean:
  [typedef] Could not load definitions from resource org/apache/maven/artifact/ant/antlib.xml.
It could not be found.
     [echo] Running ant for module : broker-plugins/management-http

clean:
  [typedef] Could not load definitions from resource org/apache/maven/artifact/ant/antlib.xml.
It could not be found.
     [echo] Running ant for module : broker-plugins/management-jmx

clean:
  [typedef] Could not load definitions from resource org/apache/maven/artifact/ant/antlib.xml.
It could not be found.
     [echo] Running ant for module : bdbstore

clean:
  [typedef] Could not load definitions from resource org/apache/maven/artifact/ant/antlib.xml.
It could not be found.
     [echo] Running ant for module : bdbstore/jmx

clean:
   [delete] Deleting directory /x1/jenkins/jenkins-slave/workspace/Qpid-Java-Artefact-Release/trunk/qpid/java/build
   [delete] Deleting directory /x1/jenkins/jenkins-slave/workspace/Qpid-Java-Artefact-Release/trunk/qpid/java/tasks/classes

download-ivy:
     [echo] Downloading ivy...
      [get] Getting: http://repo1.maven.org/maven2/org/apache/ivy/ivy/2.2.0/ivy-2.2.0.jar
      [get] To: /x1/jenkins/jenkins-slave/workspace/Qpid-Java-Artefact-Release/trunk/qpid/java/lib/ivy/ivy-2.2.0.jar

load-ivy:

configure-ivy:
[ivy:configure] :: Ivy 2.2.0 - 20100923230623 :: http://ant.apache.org/ivy/ ::
[ivy:configure] :: loading settings :: file = /x1/jenkins/jenkins-slave/workspace/Qpid-Java-Artefact-Release/trunk/qpid/java/ivysettings.retrieve.xml

retrieve-optional-dependencies:

retrieve-dependencies:
     [echo] Resolving and retrieving dependencies...
[ivy:resolve] :: resolving dependencies :: org/apache#qpid;0.23
[ivy:resolve] 	confs: [required]
[ivy:resolve] 	found biz.aQute#bnd;0.0.384 in m2repo
[ivy:resolve] 	found commons-beanutils#commons-beanutils-core;1.8.3 in m2repo
[ivy:resolve] 	found commons-cli#commons-cli;1.2 in chain
[ivy:resolve] 	found commons-codec#commons-codec;1.6 in chain
[ivy:resolve] 	found commons-collections#commons-collections;3.2.1 in chain
[ivy:resolve] 	found commons-configuration#commons-configuration;1.8 in m2repo
[ivy:resolve] 	found commons-digester#commons-digester;1.8.1 in m2repo
[ivy:resolve] 	found commons-lang#commons-lang;2.6 in chain
[ivy:resolve] 	found commons-logging#commons-logging;1.1.1 in chain
[ivy:resolve] 	found org.apache.derby#derby;10.8.2.2 in chain
[ivy:resolve] 	found org.apache.geronimo.framework#geronimo-kernel;2.2.1 in m2repo
[ivy:resolve] 	found org.apache.geronimo.specs#geronimo-ejb_3.0_spec;1.0.1 in m2repo
[ivy:resolve] 	found org.apache.geronimo.specs#geronimo-j2ee-connector_1.5_spec;2.0.0 in m2repo
[ivy:resolve] 	found org.apache.geronimo.specs#geronimo-jms_1.1_spec;1.0 in m2repo
[ivy:resolve] 	found org.apache.geronimo.specs#geronimo-jta_1.1_spec;1.1.1 in m2repo
[ivy:resolve] 	found org.apache.geronimo.specs#geronimo-servlet_2.5_spec;1.2 in m2repo
[ivy:resolve] 	found com.google.code.gson#gson;2.0 in m2repo
[ivy:resolve] 	found org.codehaus.jackson#jackson-core-asl;1.9.0 in m2repo
[ivy:resolve] 	found org.codehaus.jackson#jackson-mapper-asl;1.9.0 in m2repo
[ivy:resolve] 	found net.java.dev.javacc#javacc;5.0 in m2repo
[ivy:resolve] 	found junit#junit;3.8.1 in chain
[ivy:resolve] 	found org.python#jython-standalone;2.5.2 in m2repo
[ivy:resolve] 	found log4j#log4j;1.2.16 in chain
[ivy:resolve] 	found org.apache.maven#maven-ant-tasks;2.1.1 in m2repo
[ivy:resolve] 	found org.mockito#mockito-all;1.9.0 in m2repo
[ivy:resolve] 	found org.slf4j#slf4j-api;1.6.4 in m2repo
[ivy:resolve] 	found org.slf4j#slf4j-log4j12;1.6.4 in m2repo
[ivy:resolve] 	found org.eclipse.jetty#jetty-server;7.6.3.v20120416 in m2repo
[ivy:resolve] 	found org.eclipse.jetty#jetty-websocket;7.6.3.v20120416 in m2repo
[ivy:resolve] 	found org.eclipse.jetty#jetty-continuation;7.6.3.v20120416 in m2repo
[ivy:resolve] 	found org.eclipse.jetty#jetty-io;7.6.3.v20120416 in m2repo
[ivy:resolve] 	found org.eclipse.jetty#jetty-http;7.6.3.v20120416 in m2repo
[ivy:resolve] 	found org.eclipse.jetty#jetty-security;7.6.3.v20120416 in m2repo
[ivy:resolve] 	found org.eclipse.jetty#jetty-servlet;7.6.3.v20120416 in m2repo
[ivy:resolve] 	found org.eclipse.jetty#jetty-util;7.6.3.v20120416 in m2repo
[ivy:resolve] 	found org.dojotoolkit#dojo-war;1.7.2 in m2repo
[ivy:resolve] 	found xalan#xalan;2.7.0 in chain
[ivy:resolve] 	found velocity#velocity;1.4 in m2repo
[ivy:resolve] 	found velocity#velocity-dep;1.4 in public
[ivy:resolve] downloading http://repo1.maven.org/maven2/biz/aQute/bnd/0.0.384/bnd-0.0.384.jar
...
[ivy:resolve] .......................................... (652kB)
[ivy:resolve] downloading http://repo1.maven.org/maven2/commons-configuration/commons-configuration/1.8/commons-configuration-1.8.jar
...
[ivy:resolve] ....................................................................................
(346kB)
[ivy:resolve] .. (0kB)
[ivy:resolve] downloading http://repo1.maven.org/maven2/commons-digester/commons-digester/1.8.1/commons-digester-1.8.1.jar
...
[ivy:resolve] .................. (142kB)
[ivy:resolve] .. (0kB)
[ivy:resolve] 	[SUCCESSFUL ] commons-digester#commons-digester;1.8.1!commons-digester.jar
(80ms)
[ivy:resolve] downloading http://repo1.maven.org/maven2/org/apache/geronimo/framework/geronimo-kernel/2.2.1/geronimo-kernel-2.2.1.jar
...
[ivy:resolve] ................................... (406kB)
[ivy:resolve] .. (0kB)
[ivy:resolve] 	[SUCCESSFUL ] org.apache.geronimo.framework#geronimo-kernel;2.2.1!geronimo-kernel.jar
(48ms)
[ivy:resolve] downloading http://repo1.maven.org/maven2/org/apache/geronimo/specs/geronimo-ejb_3.0_spec/1.0.1/geronimo-ejb_3.0_spec-1.0.1.jar
...
[ivy:resolve] .. (31kB)
[ivy:resolve] .. (0kB)
[ivy:resolve] downloading http://repo1.maven.org/maven2/org/apache/geronimo/specs/geronimo-j2ee-connector_1.5_spec/2.0.0/geronimo-j2ee-connector_1.5_spec-2.0.0.jar
...
[ivy:resolve] ...... (36kB)
[ivy:resolve] .. (0kB)
[ivy:resolve] 	[SUCCESSFUL ] org.apache.geronimo.specs#geronimo-j2ee-connector_1.5_spec;2.0.0!geronimo-j2ee-connector_1.5_spec.jar
(89ms)
[ivy:resolve] downloading http://repo1.maven.org/maven2/org/apache/geronimo/specs/geronimo-jms_1.1_spec/1.0/geronimo-jms_1.1_spec-1.0.jar
...
[ivy:resolve] ... (27kB)
[ivy:resolve] .. (0kB)
[ivy:resolve] 	[SUCCESSFUL ] org.apache.geronimo.specs#geronimo-jms_1.1_spec;1.0!geronimo-jms_1.1_spec.jar
(70ms)
[ivy:resolve] downloading http://repo1.maven.org/maven2/org/apache/geronimo/specs/geronimo-jta_1.1_spec/1.1.1/geronimo-jta_1.1_spec-1.1.1.jar
...
[ivy:resolve] .. (15kB)
[ivy:resolve] .. (0kB)
[ivy:resolve] 	[SUCCESSFUL ] org.apache.geronimo.specs#geronimo-jta_1.1_spec;1.1.1!geronimo-jta_1.1_spec.jar
(29ms)
[ivy:resolve] downloading http://repo1.maven.org/maven2/org/apache/geronimo/specs/geronimo-servlet_2.5_spec/1.2/geronimo-servlet_2.5_spec-1.2.jar
...
[ivy:resolve] ...... (68kB)
[ivy:resolve] .. (0kB)
[ivy:resolve] 	[SUCCESSFUL ] org.apache.geronimo.specs#geronimo-servlet_2.5_spec;1.2!geronimo-servlet_2.5_spec.jar
(71ms)
[ivy:resolve] downloading http://repo1.maven.org/maven2/com/google/code/gson/gson/2.0/gson-2.0.jar
...
[ivy:resolve] .................... (198kB)
[ivy:resolve] .. (0kB)
[ivy:resolve] 	[SUCCESSFUL ] com.google.code.gson#gson;2.0!gson.jar (783ms)
[ivy:resolve] downloading http://repo1.maven.org/maven2/org/codehaus/jackson/jackson-core-asl/1.9.0/jackson-core-asl-1.9.0.jar
...
[ivy:resolve] ................. (222kB)
[ivy:resolve] .. (0kB)
[ivy:resolve] 	[SUCCESSFUL ] org.codehaus.jackson#jackson-core-asl;1.9.0!jackson-core-asl.jar
(192ms)
[ivy:resolve] downloading http://repo1.maven.org/maven2/org/codehaus/jackson/jackson-mapper-asl/1.9.0/jackson-mapper-asl-1.9.0.jar
...
[ivy:resolve] ...........................................................................................................................................................................................................................................
(746kB)
[ivy:resolve] .. (0kB)
[ivy:resolve] downloading http://repo1.maven.org/maven2/net/java/dev/javacc/javacc/5.0/javacc-5.0.jar
...
[ivy:resolve] ..................... (291kB)
[ivy:resolve] .. (0kB)
[ivy:resolve] 	[SUCCESSFUL ] net.java.dev.javacc#javacc;5.0!javacc.jar (79ms)
[ivy:resolve] downloading http://repo1.maven.org/maven2/org/python/jython-standalone/2.5.2/jython-standalone-2.5.2.jar
...
[ivy:resolve] ..................................................................................................................................................................................................................................................................................................................................................................................................................................................................................................................................................................................................................................................................................................................................................................................................................................................................................................................................................................................................................................................................................................................................................................................................................................................................................
[ivy:resolve] ...............................................................................................................................................................................................................................................................................................................................................................................................
[ivy:resolve] ............. (10040kB)
[ivy:resolve] downloading http://repo1.maven.org/maven2/org/eclipse/jetty/jetty-io/7.6.3.v20120416/jetty-io-7.6.3.v20120416.jar
...
[ivy:resolve] ............ (94kB)
[ivy:resolve] .. (0kB)
[ivy:resolve] downloading http://repo1.maven.org/maven2/org/eclipse/jetty/jetty-http/7.6.3.v20120416/jetty-http-7.6.3.v20120416.jar
...
[ivy:resolve] ........ (88kB)
[ivy:resolve] .. (0kB)
[ivy:resolve] 	[SUCCESSFUL ] org.eclipse.jetty#jetty-http;7.6.3.v20120416!jetty-http.jar (183ms)
[ivy:resolve] downloading http://repo1.maven.org/maven2/org/eclipse/jetty/jetty-security/7.6.3.v20120416/jetty-security-7.6.3.v20120416.jar
...
[ivy:resolve] ........... (81kB)
[ivy:resolve] .. (0kB)
[ivy:resolve] 	[SUCCESSFUL ] org.eclipse.jetty#jetty-security;7.6.3.v20120416!jetty-security.jar
(223ms)
[ivy:resolve] downloading http://repo1.maven.org/maven2/org/eclipse/jetty/jetty-servlet/7.6.3.v20120416/jetty-servlet-7.6.3.v20120416.jar
...
[ivy:resolve] ........ (85kB)
[ivy:resolve] .. (0kB)
[ivy:resolve] 	[SUCCESSFUL ] org.eclipse.jetty#jetty-servlet;7.6.3.v20120416!jetty-servlet.jar
(157ms)
[ivy:resolve] downloading http://repo1.maven.org/maven2/org/eclipse/jetty/jetty-util/7.6.3.v20120416/jetty-util-7.6.3.v20120416.jar
...
[ivy:resolve] ........................... (243kB)
[ivy:resolve] .. (0kB)
[ivy:resolve] 	[SUCCESSFUL ] org.eclipse.jetty#jetty-util;7.6.3.v20120416!jetty-util.jar (185ms)
[ivy:resolve] downloading http://repo1.maven.org/maven2/org/dojotoolkit/dojo-war/1.7.2/dojo-war-1.7.2.war
...
[ivy:resolve] ..................................................................................................................................................................................................................................................................................................................................................................................................................................................................................................................................................................................................................................
[ivy:resolve] ..................................................................................................................................
(8689kB)
[ivy:resolve] .. (0kB)
[ivy:resolve] 	[SUCCESSFUL ] org.dojotoolkit#dojo-war;1.7.2!dojo-war.war (2198ms)
[ivy:resolve] downloading http://repo1.maven.org/maven2/velocity/velocity/1.4/velocity-1.4.jar
...
[ivy:resolve] ........................... (352kB)
[ivy:resolve] .. (0kB)
[ivy:resolve] 	[SUCCESSFUL ] velocity#velocity;1.4!velocity.jar (132ms)
[ivy:resolve] downloading http://repo1.maven.org/maven2/velocity/velocity-dep/1.4/velocity-dep-1.4.jar
...
[ivy:resolve] ....................................... (505kB)
[ivy:resolve] .. (0kB)
[ivy:resolve] 	[SUCCESSFUL ] velocity#velocity-dep;1.4!velocity-dep.jar (185ms)
[ivy:resolve] :: resolution report :: resolve 26481ms :: artifacts dl 8565ms
	---------------------------------------------------------------------
	|                  |            modules            ||   artifacts   |
	|       conf       | number| search|dwnlded|evicted|| number|dwnlded|
	---------------------------------------------------------------------
	|     required     |   39  |   30  |   29  |   0   ||   39  |   16  |
	---------------------------------------------------------------------
[ivy:resolve] 
[ivy:resolve] :: problems summary ::
[ivy:resolve] :::: WARNINGS
[ivy:resolve] 	problem while downloading module descriptor: http://repo1.maven.org/maven2/org/eclipse/jetty/jetty-websocket/7.6.3.v20120416/jetty-websocket-7.6.3.v20120416.pom:
/home/jenkins/.ivy2/cache/org.eclipse.jetty/jetty-websocket/ivy-7.6.3.v20120416.xml.original.part
(No such file or directory) (184ms)
[ivy:resolve] 	problem while downloading module descriptor: http://repo1.maven.org/maven2/velocity/velocity-dep/1.4/velocity-dep-1.4.pom:
/home/jenkins/.ivy2/cache/velocity/velocity-dep/ivy-1.4.xml.original.part (No such file or
directory) (29ms)
[ivy:resolve] 		[FAILED     ] biz.aQute#bnd;0.0.384!bnd.jar: Downloaded file size doesn't
match expected Content Length for http://repo1.maven.org/maven2/biz/aQute/bnd/0.0.384/bnd-0.0.384.jar.
Please retry. (114ms)
[ivy:resolve] 		[FAILED     ] biz.aQute#bnd;0.0.384!bnd.jar: Downloaded file size doesn't
match expected Content Length for http://repo1.maven.org/maven2/biz/aQute/bnd/0.0.384/bnd-0.0.384.jar.
Please retry. (114ms)
[ivy:resolve] 	==== m2repo: tried
[ivy:resolve] 	  http://repo1.maven.org/maven2/biz/aQute/bnd/0.0.384/bnd-0.0.384.jar
[ivy:resolve] 		[FAILED     ] commons-configuration#commons-configuration;1.8!commons-configuration.jar:
impossible to move part file to definitive one: /home/jenkins/.ivy2/cache/commons-configuration/commons-configuration/jars/commons-configuration-1.8.jar.part
-> /home/jenkins/.ivy2/cache/commons-configuration/commons-configuration/jars/commons-configuration-1.8.jar
(68ms)
[ivy:resolve] 		[FAILED     ] commons-configuration#commons-configuration;1.8!commons-configuration.jar:
impossible to move part file to definitive one: /home/jenkins/.ivy2/cache/commons-configuration/commons-configuration/jars/commons-configuration-1.8.jar.part
-> /home/jenkins/.ivy2/cache/commons-configuration/commons-configuration/jars/commons-configuration-1.8.jar
(68ms)
[ivy:resolve] 	==== m2repo: tried
[ivy:resolve] 	  http://repo1.maven.org/maven2/commons-configuration/commons-configuration/1.8/commons-configuration-1.8.jar
[ivy:resolve] 		[FAILED     ] org.apache.geronimo.specs#geronimo-ejb_3.0_spec;1.0.1!geronimo-ejb_3.0_spec.jar:
/home/jenkins/.ivy2/cache/org.apache.geronimo.specs/geronimo-ejb_3.0_spec/jars/geronimo-ejb_3.0_spec-1.0.1.jar.part
(No such file or directory) (144ms)
[ivy:resolve] 		[FAILED     ] org.apache.geronimo.specs#geronimo-ejb_3.0_spec;1.0.1!geronimo-ejb_3.0_spec.jar:
/home/jenkins/.ivy2/cache/org.apache.geronimo.specs/geronimo-ejb_3.0_spec/jars/geronimo-ejb_3.0_spec-1.0.1.jar.part
(No such file or directory) (144ms)
[ivy:resolve] 	==== m2repo: tried
[ivy:resolve] 	  http://repo1.maven.org/maven2/org/apache/geronimo/specs/geronimo-ejb_3.0_spec/1.0.1/geronimo-ejb_3.0_spec-1.0.1.jar
[ivy:resolve] 		[FAILED     ] org.codehaus.jackson#jackson-mapper-asl;1.9.0!jackson-mapper-asl.jar:
/home/jenkins/.ivy2/cache/org.codehaus.jackson/jackson-mapper-asl/jars/jackson-mapper-asl-1.9.0.jar.part
(No such file or directory) (255ms)
[ivy:resolve] 		[FAILED     ] org.codehaus.jackson#jackson-mapper-asl;1.9.0!jackson-mapper-asl.jar:
/home/jenkins/.ivy2/cache/org.codehaus.jackson/jackson-mapper-asl/jars/jackson-mapper-asl-1.9.0.jar.part
(No such file or directory) (255ms)
[ivy:resolve] 	==== m2repo: tried
[ivy:resolve] 	  http://repo1.maven.org/maven2/org/codehaus/jackson/jackson-mapper-asl/1.9.0/jackson-mapper-asl-1.9.0.jar
[ivy:resolve] 		[FAILED     ] org.python#jython-standalone;2.5.2!jython-standalone.jar: Downloaded
file size doesn't match expected Content Length for http://repo1.maven.org/maven2/org/python/jython-standalone/2.5.2/jython-standalone-2.5.2.jar.
Please retry. (3075ms)
[ivy:resolve] 		[FAILED     ] org.python#jython-standalone;2.5.2!jython-standalone.jar: Downloaded
file size doesn't match expected Content Length for http://repo1.maven.org/maven2/org/python/jython-standalone/2.5.2/jython-standalone-2.5.2.jar.
Please retry. (3075ms)
[ivy:resolve] 	==== m2repo: tried
[ivy:resolve] 	  http://repo1.maven.org/maven2/org/python/jython-standalone/2.5.2/jython-standalone-2.5.2.jar
[ivy:resolve] 		[FAILED     ] org.eclipse.jetty#jetty-io;7.6.3.v20120416!jetty-io.jar: /home/jenkins/.ivy2/cache/org.eclipse.jetty/jetty-io/jars/jetty-io-7.6.3.v20120416.jar.part
(No such file or directory) (160ms)
[ivy:resolve] 		[FAILED     ] org.eclipse.jetty#jetty-io;7.6.3.v20120416!jetty-io.jar: /home/jenkins/.ivy2/cache/org.eclipse.jetty/jetty-io/jars/jetty-io-7.6.3.v20120416.jar.part
(No such file or directory) (160ms)
[ivy:resolve] 	==== m2repo: tried
[ivy:resolve] 	  http://repo1.maven.org/maven2/org/eclipse/jetty/jetty-io/7.6.3.v20120416/jetty-io-7.6.3.v20120416.jar
[ivy:resolve] 		::::::::::::::::::::::::::::::::::::::::::::::
[ivy:resolve] 		::              FAILED DOWNLOADS            ::
[ivy:resolve] 		:: ^ see resolution messages for details  ^ ::
[ivy:resolve] 		::::::::::::::::::::::::::::::::::::::::::::::
[ivy:resolve] 		:: biz.aQute#bnd;0.0.384!bnd.jar
[ivy:resolve] 		:: commons-configuration#commons-configuration;1.8!commons-configuration.jar
[ivy:resolve] 		:: org.apache.geronimo.specs#geronimo-ejb_3.0_spec;1.0.1!geronimo-ejb_3.0_spec.jar
[ivy:resolve] 		:: org.codehaus.jackson#jackson-mapper-asl;1.9.0!jackson-mapper-asl.jar
[ivy:resolve] 		:: org.python#jython-standalone;2.5.2!jython-standalone.jar
[ivy:resolve] 		:: org.eclipse.jetty#jetty-io;7.6.3.v20120416!jetty-io.jar
[ivy:resolve] 		::::::::::::::::::::::::::::::::::::::::::::::
[ivy:resolve] :::: ERRORS
[ivy:resolve] 	unknown resolver maven2
[ivy:resolve] 	unknown resolver maven2
[ivy:resolve] 	unknown resolver central
[ivy:resolve] 	unknown resolver central
[ivy:resolve] 	unknown resolver maven2
[ivy:resolve] 	unknown resolver default
[ivy:resolve] 	unknown resolver central
[ivy:resolve] 	unknown resolver central
[ivy:resolve] 	unknown resolver maven2
[ivy:resolve] 	unknown resolver maven2
[ivy:resolve] 	unknown resolver central
[ivy:resolve] 	unknown resolver central
[ivy:resolve] 	unknown resolver central
[ivy:resolve] 	unknown resolver central
[ivy:resolve] 	unknown resolver central
[ivy:resolve] 	unknown resolver central
[ivy:resolve] 	unknown resolver central
[ivy:resolve] 	unknown resolver central
[ivy:resolve] 	unknown resolver central
[ivy:resolve] 	unknown resolver central
[ivy:resolve] 	unknown resolver central
[ivy:resolve] 	unknown resolver central
[ivy:resolve] 	unknown resolver maven2
[ivy:resolve] 	unknown resolver maven2
[ivy:resolve] 	unknown resolver maven2
[ivy:resolve] 	unknown resolver default
[ivy:resolve] 	unknown resolver maven2
[ivy:resolve] 	unknown resolver default
[ivy:resolve] 	unknown resolver central
[ivy:resolve] 	unknown resolver central
[ivy:resolve] 
[ivy:resolve] :: USE VERBOSE OR DEBUG MESSAGE LEVEL FOR MORE DETAILS

BUILD FAILED
/x1/jenkins/jenkins-slave/workspace/Qpid-Java-Artefact-Release/trunk/qpid/java/common.xml:289:
impossible to resolve dependencies:
	resolve failed - see output for details

Total time: 38 seconds
Build step 'Invoke Ant' marked build as failure
Archiving artifacts

Mime
View raw message