qpid-notifications mailing list archives

Site index · List index
Message view « Date » · « Thread »
Top « Date » · « Thread »
From Apache Jenkins Server <jenk...@builds.apache.org>
Subject Build failed in Jenkins: Qpid-Java-Artefact-Release #748
Date Thu, 04 Apr 2013 03:45:49 GMT
See <https://builds.apache.org/job/Qpid-Java-Artefact-Release/748/changes>

Changes:

[gsim] QPID-4700: fix typo in mapping for 'to' field

[fadams] QPID-4699: Modification to C++ INSTALL guide

[orudyy] QPID-4696: Group broker attributes on editing UI, improve attribute descriptions,
add attributes units.
           Remove obsolete GroupPrincipalAccessor.
           Fix flow control attribute validation.
           Fix constant name for default group provider attribute.
           Remove redundant comments.

[chug] QPID-4575 Visual Studio 2012 - remove template arguments

[aconway] QPID-4697: Minor fixes to make distcheck

- add qmfengine.py to DIST.
- create directory qpid/bindings/perl if not already present.
- ssl_test: don't run python part of tests if python client not available.

[orudyy] QPID-4678: Update management operations to invoke ACL checks only once

[orudyy] QPID-4695: Add validation of configured object names and IDs

[robbie] QPID-4694: ensure that any IDs generated at startup are saved immediately, rather
than waiting for the user to edit something that prompts the save to occur

------------------------------------------
[...truncated 6335 lines...]
[ivy:resolve] 	found commons-collections#commons-collections;3.2.1 in public
[ivy:resolve] 	found commons-configuration#commons-configuration;1.8 in m2repo
[ivy:resolve] 	found commons-digester#commons-digester;1.8.1 in m2repo
[ivy:resolve] 	found commons-lang#commons-lang;2.6 in m2repo
[ivy:resolve] 	found commons-logging#commons-logging;1.1.1 in m2repo
[ivy:resolve] 	found org.apache.derby#derby;10.8.2.2 in m2repo
[ivy:resolve] 	found org.apache.geronimo.framework#geronimo-kernel;2.2.1 in m2repo
[ivy:resolve] 	found org.apache.geronimo.specs#geronimo-ejb_3.0_spec;1.0.1 in m2repo
[ivy:resolve] 	found org.apache.geronimo.specs#geronimo-j2ee-connector_1.5_spec;2.0.0 in m2repo
[ivy:resolve] 	found org.apache.geronimo.specs#geronimo-jms_1.1_spec;1.0 in m2repo
[ivy:resolve] 	found org.apache.geronimo.specs#geronimo-jta_1.1_spec;1.1.1 in m2repo
[ivy:resolve] 	found org.apache.geronimo.specs#geronimo-servlet_2.5_spec;1.2 in m2repo
[ivy:resolve] 	found com.google.code.gson#gson;2.0 in m2repo
[ivy:resolve] 	found org.codehaus.jackson#jackson-core-asl;1.9.0 in m2repo
[ivy:resolve] 	found org.codehaus.jackson#jackson-mapper-asl;1.9.0 in m2repo
[ivy:resolve] 	found net.java.dev.javacc#javacc;5.0 in m2repo
[ivy:resolve] 	found junit#junit;3.8.1 in m2repo
[ivy:resolve] 	found org.python#jython-standalone;2.5.2 in m2repo
[ivy:resolve] 	found log4j#log4j;1.2.16 in m2repo
[ivy:resolve] 	found org.apache.maven#maven-ant-tasks;2.1.1 in public
[ivy:resolve] 	found org.mockito#mockito-all;1.9.0 in m2repo
[ivy:resolve] 	found org.slf4j#slf4j-api;1.6.4 in m2repo
[ivy:resolve] 	found org.slf4j#slf4j-log4j12;1.6.4 in m2repo
[ivy:resolve] 	found org.eclipse.jetty#jetty-server;7.6.3.v20120416 in m2repo
[ivy:resolve] 	found org.eclipse.jetty#jetty-websocket;7.6.3.v20120416 in m2repo
[ivy:resolve] 	found org.eclipse.jetty#jetty-continuation;7.6.3.v20120416 in m2repo
[ivy:resolve] 	found org.eclipse.jetty#jetty-io;7.6.3.v20120416 in m2repo
[ivy:resolve] 	found org.eclipse.jetty#jetty-http;7.6.3.v20120416 in m2repo
[ivy:resolve] 	found org.eclipse.jetty#jetty-security;7.6.3.v20120416 in m2repo
[ivy:resolve] 	found org.eclipse.jetty#jetty-servlet;7.6.3.v20120416 in m2repo
[ivy:resolve] 	found org.eclipse.jetty#jetty-util;7.6.3.v20120416 in m2repo
[ivy:resolve] 	found org.dojotoolkit#dojo-war;1.7.2 in public
[ivy:resolve] 	found xalan#xalan;2.7.0 in m2repo
[ivy:resolve] 	found velocity#velocity;1.4 in m2repo
[ivy:resolve] 	found velocity#velocity-dep;1.4 in m2repo
[ivy:resolve] downloading http://repo1.maven.org/maven2/biz/aQute/bnd/0.0.384/bnd-0.0.384.jar
...
[ivy:resolve] ...............................................................................................................................
(652kB)
[ivy:resolve] .. (0kB)
[ivy:resolve] downloading http://repo1.maven.org/maven2/commons-beanutils/commons-beanutils-core/1.8.3/commons-beanutils-core-1.8.3.jar
...
[ivy:resolve] .................................. (201kB)
[ivy:resolve] .. (0kB)
[ivy:resolve] downloading http://repo1.maven.org/maven2/commons-cli/commons-cli/1.2/commons-cli-1.2.jar
...
[ivy:resolve] .......... (40kB)
[ivy:resolve] .. (0kB)
[ivy:resolve] downloading http://repo1.maven.org/maven2/commons-codec/commons-codec/1.6/commons-codec-1.6.jar
...
[ivy:resolve] ........................................................... (227kB)
[ivy:resolve] .. (0kB)
[ivy:resolve] downloading http://repo1.maven.org/maven2/commons-collections/commons-collections/3.2.1/commons-collections-3.2.1.jar
...
[ivy:resolve] .............................................................................................................................
(561kB)
[ivy:resolve] .. (0kB)
[ivy:resolve] 	[SUCCESSFUL ] commons-collections#commons-collections;3.2.1!commons-collections.jar
(48ms)
[ivy:resolve] downloading http://repo1.maven.org/maven2/commons-configuration/commons-configuration/1.8/commons-configuration-1.8.jar
...
[ivy:resolve] ............................................... (346kB)
[ivy:resolve] .. (0kB)
[ivy:resolve] 	[SUCCESSFUL ] commons-configuration#commons-configuration;1.8!commons-configuration.jar
(21ms)
[ivy:resolve] downloading http://repo1.maven.org/maven2/commons-digester/commons-digester/1.8.1/commons-digester-1.8.1.jar
...
[ivy:resolve] ......................... (142kB)
[ivy:resolve] .. (0kB)
[ivy:resolve] downloading http://repo1.maven.org/maven2/commons-lang/commons-lang/2.6/commons-lang-2.6.jar
...
[ivy:resolve] .................................................................................
(277kB)
[ivy:resolve] .. (0kB)
[ivy:resolve] 	[SUCCESSFUL ] commons-lang#commons-lang;2.6!commons-lang.jar (19ms)
[ivy:resolve] downloading http://repo1.maven.org/maven2/commons-logging/commons-logging/1.1.1/commons-logging-1.1.1.jar
...
[ivy:resolve] .................. (59kB)
[ivy:resolve] .. (0kB)
[ivy:resolve] 	[SUCCESSFUL ] commons-logging#commons-logging;1.1.1!commons-logging.jar (14ms)
[ivy:resolve] downloading http://repo1.maven.org/maven2/org/apache/derby/derby/10.8.2.2/derby-10.8.2.2.jar
...
[ivy:resolve] ..........................................................................................................................................................................................................................................................................................................................................................................................................................................................................................................................................................................................................................................................................................................
(2608kB)
[ivy:resolve] .. (0kB)
[ivy:resolve] downloading http://repo1.maven.org/maven2/org/apache/geronimo/framework/geronimo-kernel/2.2.1/geronimo-kernel-2.2.1.jar
...
[ivy:resolve] ...................................................................................................
(406kB)
[ivy:resolve] .. (0kB)
[ivy:resolve] 	[SUCCESSFUL ] org.apache.geronimo.framework#geronimo-kernel;2.2.1!geronimo-kernel.jar
(123ms)
[ivy:resolve] downloading http://repo1.maven.org/maven2/org/apache/geronimo/specs/geronimo-ejb_3.0_spec/1.0.1/geronimo-ejb_3.0_spec-1.0.1.jar
...
[ivy:resolve] .... (31kB)
[ivy:resolve] .. (0kB)
[ivy:resolve] 	[SUCCESSFUL ] org.apache.geronimo.specs#geronimo-ejb_3.0_spec;1.0.1!geronimo-ejb_3.0_spec.jar
(57ms)
[ivy:resolve] downloading http://repo1.maven.org/maven2/org/apache/geronimo/specs/geronimo-j2ee-connector_1.5_spec/2.0.0/geronimo-j2ee-connector_1.5_spec-2.0.0.jar
...
[ivy:resolve] ........ (36kB)
[ivy:resolve] .. (0kB)
[ivy:resolve] downloading http://repo1.maven.org/maven2/org/apache/geronimo/specs/geronimo-jms_1.1_spec/1.0/geronimo-jms_1.1_spec-1.0.jar
...
[ivy:resolve] ....... (27kB)
[ivy:resolve] .. (0kB)
[ivy:resolve] 	[SUCCESSFUL ] org.apache.geronimo.specs#geronimo-jms_1.1_spec;1.0!geronimo-jms_1.1_spec.jar
(11ms)
[ivy:resolve] downloading http://repo1.maven.org/maven2/org/apache/geronimo/specs/geronimo-jta_1.1_spec/1.1.1/geronimo-jta_1.1_spec-1.1.1.jar
...
[ivy:resolve] ... (15kB)
[ivy:resolve] .. (0kB)
[ivy:resolve] 	[SUCCESSFUL ] org.apache.geronimo.specs#geronimo-jta_1.1_spec;1.1.1!geronimo-jta_1.1_spec.jar
(53ms)
[ivy:resolve] downloading http://repo1.maven.org/maven2/org/apache/geronimo/specs/geronimo-servlet_2.5_spec/1.2/geronimo-servlet_2.5_spec-1.2.jar
...
[ivy:resolve] ............... (68kB)
[ivy:resolve] .. (0kB)
[ivy:resolve] 	[SUCCESSFUL ] org.apache.geronimo.specs#geronimo-servlet_2.5_spec;1.2!geronimo-servlet_2.5_spec.jar
(58ms)
[ivy:resolve] downloading http://repo1.maven.org/maven2/com/google/code/gson/gson/2.0/gson-2.0.jar
...
[ivy:resolve] ........................................................ (198kB)
[ivy:resolve] .. (0kB)
[ivy:resolve] downloading http://repo1.maven.org/maven2/org/mockito/mockito-all/1.9.0/mockito-all-1.9.0.jar
...
[ivy:resolve] ................................................................................................................................................................................................................................................
(1460kB)
[ivy:resolve] downloading http://repo1.maven.org/maven2/org/slf4j/slf4j-log4j12/1.6.4/slf4j-log4j12-1.6.4.jar
...
[ivy:resolve] .... (9kB)
[ivy:resolve] .. (0kB)
[ivy:resolve] downloading http://repo1.maven.org/maven2/org/eclipse/jetty/jetty-server/7.6.3.v20120416/jetty-server-7.6.3.v20120416.jar
...
[ivy:resolve] ................................................................. (304kB)
[ivy:resolve] .. (0kB)
[ivy:resolve] downloading http://repo1.maven.org/maven2/org/eclipse/jetty/jetty-websocket/7.6.3.v20120416/jetty-websocket-7.6.3.v20120416.jar
...
[ivy:resolve] .............................. (117kB)
[ivy:resolve] .. (0kB)
[ivy:resolve] 	[SUCCESSFUL ] org.eclipse.jetty#jetty-websocket;7.6.3.v20120416!jetty-websocket.jar
(198ms)
[ivy:resolve] downloading http://repo1.maven.org/maven2/org/eclipse/jetty/jetty-continuation/7.6.3.v20120416/jetty-continuation-7.6.3.v20120416.jar
...
[ivy:resolve] .... (19kB)
[ivy:resolve] .. (0kB)
[ivy:resolve] downloading http://repo1.maven.org/maven2/org/eclipse/jetty/jetty-io/7.6.3.v20120416/jetty-io-7.6.3.v20120416.jar
...
[ivy:resolve] ......................... (94kB)
[ivy:resolve] .. (0kB)
[ivy:resolve] 	[SUCCESSFUL ] org.eclipse.jetty#jetty-io;7.6.3.v20120416!jetty-io.jar (48ms)
[ivy:resolve] downloading http://repo1.maven.org/maven2/org/eclipse/jetty/jetty-http/7.6.3.v20120416/jetty-http-7.6.3.v20120416.jar
...
[ivy:resolve] ........................ (88kB)
[ivy:resolve] .. (0kB)
[ivy:resolve] 	[SUCCESSFUL ] org.eclipse.jetty#jetty-http;7.6.3.v20120416!jetty-http.jar (65ms)
[ivy:resolve] downloading http://repo1.maven.org/maven2/org/eclipse/jetty/jetty-security/7.6.3.v20120416/jetty-security-7.6.3.v20120416.jar
...
[ivy:resolve] .................... (81kB)
[ivy:resolve] .. (0kB)
[ivy:resolve] 	[SUCCESSFUL ] org.eclipse.jetty#jetty-security;7.6.3.v20120416!jetty-security.jar
(82ms)
[ivy:resolve] downloading http://repo1.maven.org/maven2/org/eclipse/jetty/jetty-servlet/7.6.3.v20120416/jetty-servlet-7.6.3.v20120416.jar
...
[ivy:resolve] .................. (85kB)
[ivy:resolve] .. (0kB)
[ivy:resolve] downloading http://repo1.maven.org/maven2/org/eclipse/jetty/jetty-util/7.6.3.v20120416/jetty-util-7.6.3.v20120416.jar
...
[ivy:resolve] .......................................................... (243kB)
[ivy:resolve] .. (0kB)
[ivy:resolve] 	[SUCCESSFUL ] org.eclipse.jetty#jetty-util;7.6.3.v20120416!jetty-util.jar (88ms)
[ivy:resolve] downloading http://repo1.maven.org/maven2/org/dojotoolkit/dojo-war/1.7.2/dojo-war-1.7.2.war
...
[ivy:resolve] ......................................................................................................................................................................................................................................................................................................................................................................................................................................................................................................................................................................................................................................................................................................................................................................................................................................................................................................................................................................................................................................................................................................................................................................................................................................................................................................................................................................................................................................................................................................................................................................................................................................................................................................................................................................................................................................
(8689kB)
[ivy:resolve] .. (0kB)
[ivy:resolve] 	[SUCCESSFUL ] org.dojotoolkit#dojo-war;1.7.2!dojo-war.war (2062ms)
[ivy:resolve] downloading http://repo1.maven.org/maven2/xalan/xalan/2.7.0/xalan-2.7.0.jar
...
[ivy:resolve] .................................................................................................................................................................................................................................................................................................................................................................................................................................................................................................................................................................................................................................................................................................................................................................................
(2666kB)
[ivy:resolve] .. (0kB)
[ivy:resolve] 	[SUCCESSFUL ] xalan#xalan;2.7.0!xalan.jar (115ms)
[ivy:resolve] downloading http://repo1.maven.org/maven2/velocity/velocity/1.4/velocity-1.4.jar
...
[ivy:resolve] ..........................................................................................
(352kB)
[ivy:resolve] .. (0kB)
[ivy:resolve] 	[SUCCESSFUL ] velocity#velocity;1.4!velocity.jar (61ms)
[ivy:resolve] downloading http://repo1.maven.org/maven2/velocity/velocity-dep/1.4/velocity-dep-1.4.jar
...
[ivy:resolve] .............................................................................................................................................
(505kB)
[ivy:resolve] .. (0kB)
[ivy:resolve] :: resolution report :: resolve 39236ms :: artifacts dl 5194ms
	---------------------------------------------------------------------
	|                  |            modules            ||   artifacts   |
	|       conf       | number| search|dwnlded|evicted|| number|dwnlded|
	---------------------------------------------------------------------
	|     required     |   39  |   38  |   34  |   0   ||   39  |   17  |
	---------------------------------------------------------------------
[ivy:resolve] 
[ivy:resolve] :: problems summary ::
[ivy:resolve] :::: WARNINGS
[ivy:resolve] 	problem while downloading module descriptor: http://repo1.maven.org/maven2/biz/aQute/bnd/0.0.384/bnd-0.0.384.pom:
impossible to move part file to definitive one: /home/jenkins/.ivy2/cache/biz.aQute/bnd/ivy-0.0.384.xml.original.part
-> /home/jenkins/.ivy2/cache/biz.aQute/bnd/ivy-0.0.384.xml.original (176ms)
[ivy:resolve] 	problem while downloading module descriptor: http://repo1.maven.org/maven2/commons-collections/commons-collections/3.2.1/commons-collections-3.2.1.pom:
/home/jenkins/.ivy2/cache/commons-collections/commons-collections/ivy-3.2.1.xml.original.part
(No such file or directory) (11ms)
[ivy:resolve] 	problem while downloading module descriptor: http://repo1.maven.org/maven2/org/apache/geronimo/framework/modules/2.2.1/modules-2.2.1.pom:
/home/jenkins/.ivy2/cache/org.apache.geronimo.framework/modules/ivy-2.2.1.xml.original.part
(No such file or directory) (1131ms)
[ivy:resolve] 	problem while downloading module descriptor: http://repo1.maven.org/maven2/org/apache/geronimo/framework/framework/2.2.1/framework-2.2.1.pom:
/home/jenkins/.ivy2/cache/org.apache.geronimo.framework/framework/ivy-2.2.1.xml.original.part
(No such file or directory) (133ms)
[ivy:resolve] 	problem while downloading module descriptor: http://repo1.maven.org/maven2/org/python/jython-standalone/2.5.2/jython-standalone-2.5.2.pom:
impossible to move part file to definitive one: /home/jenkins/.ivy2/cache/org.python/jython-standalone/ivy-2.5.2.xml.original.part
-> /home/jenkins/.ivy2/cache/org.python/jython-standalone/ivy-2.5.2.xml.original (17ms)
[ivy:resolve] 	problem while downloading module descriptor: http://repo1.maven.org/maven2/org/apache/maven/maven-ant-tasks/2.1.1/maven-ant-tasks-2.1.1.pom:
/home/jenkins/.ivy2/cache/org.apache.maven/maven-ant-tasks/ivy-2.1.1.xml.original.part (No
such file or directory) (90ms)
[ivy:resolve] 	problem while downloading module descriptor: http://repo1.maven.org/maven2/org/eclipse/jetty/jetty-continuation/7.6.3.v20120416/jetty-continuation-7.6.3.v20120416.pom:
impossible to move part file to definitive one: /home/jenkins/.ivy2/cache/org.eclipse.jetty/jetty-continuation/ivy-7.6.3.v20120416.xml.original.part
-> /home/jenkins/.ivy2/cache/org.eclipse.jetty/jetty-continuation/ivy-7.6.3.v20120416.xml.original
(89ms)
[ivy:resolve] 	problem while downloading module descriptor: http://repo1.maven.org/maven2/org/eclipse/jetty/jetty-http/7.6.3.v20120416/jetty-http-7.6.3.v20120416.pom:
/home/jenkins/.ivy2/cache/org.eclipse.jetty/jetty-http/ivy-7.6.3.v20120416.xml.original.part
(No such file or directory) (59ms)
[ivy:resolve] 	problem while downloading module descriptor: http://repo1.maven.org/maven2/org/dojotoolkit/dojo-war/1.7.2/dojo-war-1.7.2.pom:
/home/jenkins/.ivy2/cache/org.dojotoolkit/dojo-war/ivy-1.7.2.xml.original.part (No such file
or directory) (662ms)
[ivy:resolve] 	problem while downloading module descriptor: http://repo1.maven.org/maven2/org/dojotoolkit/dojo-maven/1.7.2/dojo-maven-1.7.2.pom:
/home/jenkins/.ivy2/cache/org.dojotoolkit/dojo-maven/ivy-1.7.2.xml.original.part (No such
file or directory) (398ms)
[ivy:resolve] 		[FAILED     ] biz.aQute#bnd;0.0.384!bnd.jar: /home/jenkins/.ivy2/cache/biz.aQute/bnd/jars/bnd-0.0.384.jar.part
(No such file or directory) (146ms)
[ivy:resolve] 		[FAILED     ] biz.aQute#bnd;0.0.384!bnd.jar: /home/jenkins/.ivy2/cache/biz.aQute/bnd/jars/bnd-0.0.384.jar.part
(No such file or directory) (146ms)
[ivy:resolve] 	==== m2repo: tried
[ivy:resolve] 	  http://repo1.maven.org/maven2/biz/aQute/bnd/0.0.384/bnd-0.0.384.jar
[ivy:resolve] 		[FAILED     ] commons-beanutils#commons-beanutils-core;1.8.3!commons-beanutils-core.jar:
impossible to move part file to definitive one: /home/jenkins/.ivy2/cache/commons-beanutils/commons-beanutils-core/jars/commons-beanutils-core-1.8.3.jar.part
-> /home/jenkins/.ivy2/cache/commons-beanutils/commons-beanutils-core/jars/commons-beanutils-core-1.8.3.jar
(57ms)
[ivy:resolve] 		[FAILED     ] commons-beanutils#commons-beanutils-core;1.8.3!commons-beanutils-core.jar:
impossible to move part file to definitive one: /home/jenkins/.ivy2/cache/commons-beanutils/commons-beanutils-core/jars/commons-beanutils-core-1.8.3.jar.part
-> /home/jenkins/.ivy2/cache/commons-beanutils/commons-beanutils-core/jars/commons-beanutils-core-1.8.3.jar
(57ms)
[ivy:resolve] 	==== m2repo: tried
[ivy:resolve] 	  http://repo1.maven.org/maven2/commons-beanutils/commons-beanutils-core/1.8.3/commons-beanutils-core-1.8.3.jar
[ivy:resolve] 		[FAILED     ] commons-cli#commons-cli;1.2!commons-cli.jar: /home/jenkins/.ivy2/cache/commons-cli/commons-cli/jars/commons-cli-1.2.jar.part
(No such file or directory) (11ms)
[ivy:resolve] 		[FAILED     ] commons-cli#commons-cli;1.2!commons-cli.jar: /home/jenkins/.ivy2/cache/commons-cli/commons-cli/jars/commons-cli-1.2.jar.part
(No such file or directory) (11ms)
[ivy:resolve] 	==== m2repo: tried
[ivy:resolve] 	  http://repo1.maven.org/maven2/commons-cli/commons-cli/1.2/commons-cli-1.2.jar
[ivy:resolve] 		[FAILED     ] commons-codec#commons-codec;1.6!commons-codec.jar: /home/jenkins/.ivy2/cache/commons-codec/commons-codec/jars/commons-codec-1.6.jar.part
(No such file or directory) (74ms)
[ivy:resolve] 		[FAILED     ] commons-codec#commons-codec;1.6!commons-codec.jar: /home/jenkins/.ivy2/cache/commons-codec/commons-codec/jars/commons-codec-1.6.jar.part
(No such file or directory) (74ms)
[ivy:resolve] 	==== m2repo: tried
[ivy:resolve] 	  http://repo1.maven.org/maven2/commons-codec/commons-codec/1.6/commons-codec-1.6.jar
[ivy:resolve] 		[FAILED     ] commons-digester#commons-digester;1.8.1!commons-digester.jar:
impossible to move part file to definitive one: /home/jenkins/.ivy2/cache/commons-digester/commons-digester/jars/commons-digester-1.8.1.jar.part
-> /home/jenkins/.ivy2/cache/commons-digester/commons-digester/jars/commons-digester-1.8.1.jar
(167ms)
[ivy:resolve] 		[FAILED     ] commons-digester#commons-digester;1.8.1!commons-digester.jar:
impossible to move part file to definitive one: /home/jenkins/.ivy2/cache/commons-digester/commons-digester/jars/commons-digester-1.8.1.jar.part
-> /home/jenkins/.ivy2/cache/commons-digester/commons-digester/jars/commons-digester-1.8.1.jar
(167ms)
[ivy:resolve] 	==== m2repo: tried
[ivy:resolve] 	  http://repo1.maven.org/maven2/commons-digester/commons-digester/1.8.1/commons-digester-1.8.1.jar
[ivy:resolve] 		[FAILED     ] org.apache.derby#derby;10.8.2.2!derby.jar: impossible to move
part file to definitive one: /home/jenkins/.ivy2/cache/org.apache.derby/derby/jars/derby-10.8.2.2.jar.part
-> /home/jenkins/.ivy2/cache/org.apache.derby/derby/jars/derby-10.8.2.2.jar (110ms)
[ivy:resolve] 		[FAILED     ] org.apache.derby#derby;10.8.2.2!derby.jar: impossible to move
part file to definitive one: /home/jenkins/.ivy2/cache/org.apache.derby/derby/jars/derby-10.8.2.2.jar.part
-> /home/jenkins/.ivy2/cache/org.apache.derby/derby/jars/derby-10.8.2.2.jar (110ms)
[ivy:resolve] 	==== m2repo: tried
[ivy:resolve] 	  http://repo1.maven.org/maven2/org/apache/derby/derby/10.8.2.2/derby-10.8.2.2.jar
[ivy:resolve] 		[FAILED     ] org.apache.geronimo.specs#geronimo-j2ee-connector_1.5_spec;2.0.0!geronimo-j2ee-connector_1.5_spec.jar:
/home/jenkins/.ivy2/cache/org.apache.geronimo.specs/geronimo-j2ee-connector_1.5_spec/jars/geronimo-j2ee-connector_1.5_spec-2.0.0.jar.part
(No such file or directory) (98ms)
[ivy:resolve] 		[FAILED     ] org.apache.geronimo.specs#geronimo-j2ee-connector_1.5_spec;2.0.0!geronimo-j2ee-connector_1.5_spec.jar:
/home/jenkins/.ivy2/cache/org.apache.geronimo.specs/geronimo-j2ee-connector_1.5_spec/jars/geronimo-j2ee-connector_1.5_spec-2.0.0.jar.part
(No such file or directory) (98ms)
[ivy:resolve] 	==== m2repo: tried
[ivy:resolve] 	  http://repo1.maven.org/maven2/org/apache/geronimo/specs/geronimo-j2ee-connector_1.5_spec/2.0.0/geronimo-j2ee-connector_1.5_spec-2.0.0.jar
[ivy:resolve] 		[FAILED     ] com.google.code.gson#gson;2.0!gson.jar: /home/jenkins/.ivy2/cache/com.google.code.gson/gson/jars/gson-2.0.jar.part
(No such file or directory) (1180ms)
[ivy:resolve] 		[FAILED     ] com.google.code.gson#gson;2.0!gson.jar: /home/jenkins/.ivy2/cache/com.google.code.gson/gson/jars/gson-2.0.jar.part
(No such file or directory) (1180ms)
[ivy:resolve] 	==== m2repo: tried
[ivy:resolve] 	  http://repo1.maven.org/maven2/com/google/code/gson/gson/2.0/gson-2.0.jar
[ivy:resolve] 		[FAILED     ] org.mockito#mockito-all;1.9.0!mockito-all.jar: Downloaded file
size doesn't match expected Content Length for http://repo1.maven.org/maven2/org/mockito/mockito-all/1.9.0/mockito-all-1.9.0.jar.
Please retry. (30ms)
[ivy:resolve] 		[FAILED     ] org.mockito#mockito-all;1.9.0!mockito-all.jar: Downloaded file
size doesn't match expected Content Length for http://repo1.maven.org/maven2/org/mockito/mockito-all/1.9.0/mockito-all-1.9.0.jar.
Please retry. (30ms)
[ivy:resolve] 	==== m2repo: tried
[ivy:resolve] 	  http://repo1.maven.org/maven2/org/mockito/mockito-all/1.9.0/mockito-all-1.9.0.jar
[ivy:resolve] 		[FAILED     ] org.slf4j#slf4j-log4j12;1.6.4!slf4j-log4j12.jar: /home/jenkins/.ivy2/cache/org.slf4j/slf4j-log4j12/jars/slf4j-log4j12-1.6.4.jar.part
(No such file or directory) (10ms)
[ivy:resolve] 		[FAILED     ] org.slf4j#slf4j-log4j12;1.6.4!slf4j-log4j12.jar: /home/jenkins/.ivy2/cache/org.slf4j/slf4j-log4j12/jars/slf4j-log4j12-1.6.4.jar.part
(No such file or directory) (10ms)
[ivy:resolve] 	==== m2repo: tried
[ivy:resolve] 	  http://repo1.maven.org/maven2/org/slf4j/slf4j-log4j12/1.6.4/slf4j-log4j12-1.6.4.jar
[ivy:resolve] 		[FAILED     ] org.eclipse.jetty#jetty-server;7.6.3.v20120416!jetty-server.jar:
impossible to move part file to definitive one: /home/jenkins/.ivy2/cache/org.eclipse.jetty/jetty-server/jars/jetty-server-7.6.3.v20120416.jar.part
-> /home/jenkins/.ivy2/cache/org.eclipse.jetty/jetty-server/jars/jetty-server-7.6.3.v20120416.jar
(62ms)
[ivy:resolve] 		[FAILED     ] org.eclipse.jetty#jetty-server;7.6.3.v20120416!jetty-server.jar:
impossible to move part file to definitive one: /home/jenkins/.ivy2/cache/org.eclipse.jetty/jetty-server/jars/jetty-server-7.6.3.v20120416.jar.part
-> /home/jenkins/.ivy2/cache/org.eclipse.jetty/jetty-server/jars/jetty-server-7.6.3.v20120416.jar
(62ms)
[ivy:resolve] 	==== m2repo: tried
[ivy:resolve] 	  http://repo1.maven.org/maven2/org/eclipse/jetty/jetty-server/7.6.3.v20120416/jetty-server-7.6.3.v20120416.jar
[ivy:resolve] 		[FAILED     ] org.eclipse.jetty#jetty-continuation;7.6.3.v20120416!jetty-continuation.jar:
/home/jenkins/.ivy2/cache/org.eclipse.jetty/jetty-continuation/jars/jetty-continuation-7.6.3.v20120416.jar.part
(No such file or directory) (32ms)
[ivy:resolve] 		[FAILED     ] org.eclipse.jetty#jetty-continuation;7.6.3.v20120416!jetty-continuation.jar:
/home/jenkins/.ivy2/cache/org.eclipse.jetty/jetty-continuation/jars/jetty-continuation-7.6.3.v20120416.jar.part
(No such file or directory) (32ms)
[ivy:resolve] 	==== m2repo: tried
[ivy:resolve] 	  http://repo1.maven.org/maven2/org/eclipse/jetty/jetty-continuation/7.6.3.v20120416/jetty-continuation-7.6.3.v20120416.jar
[ivy:resolve] 		[FAILED     ] org.eclipse.jetty#jetty-servlet;7.6.3.v20120416!jetty-servlet.jar:
impossible to move part file to definitive one: /home/jenkins/.ivy2/cache/org.eclipse.jetty/jetty-servlet/jars/jetty-servlet-7.6.3.v20120416.jar.part
-> /home/jenkins/.ivy2/cache/org.eclipse.jetty/jetty-servlet/jars/jetty-servlet-7.6.3.v20120416.jar
(46ms)
[ivy:resolve] 		[FAILED     ] org.eclipse.jetty#jetty-servlet;7.6.3.v20120416!jetty-servlet.jar:
impossible to move part file to definitive one: /home/jenkins/.ivy2/cache/org.eclipse.jetty/jetty-servlet/jars/jetty-servlet-7.6.3.v20120416.jar.part
-> /home/jenkins/.ivy2/cache/org.eclipse.jetty/jetty-servlet/jars/jetty-servlet-7.6.3.v20120416.jar
(46ms)
[ivy:resolve] 	==== m2repo: tried
[ivy:resolve] 	  http://repo1.maven.org/maven2/org/eclipse/jetty/jetty-servlet/7.6.3.v20120416/jetty-servlet-7.6.3.v20120416.jar
[ivy:resolve] 		[FAILED     ] velocity#velocity-dep;1.4!velocity-dep.jar: impossible to move
part file to definitive one: /home/jenkins/.ivy2/cache/velocity/velocity-dep/jars/velocity-dep-1.4.jar.part
-> /home/jenkins/.ivy2/cache/velocity/velocity-dep/jars/velocity-dep-1.4.jar (27ms)
[ivy:resolve] 		[FAILED     ] velocity#velocity-dep;1.4!velocity-dep.jar: impossible to move
part file to definitive one: /home/jenkins/.ivy2/cache/velocity/velocity-dep/jars/velocity-dep-1.4.jar.part
-> /home/jenkins/.ivy2/cache/velocity/velocity-dep/jars/velocity-dep-1.4.jar (27ms)
[ivy:resolve] 	==== m2repo: tried
[ivy:resolve] 	  http://repo1.maven.org/maven2/velocity/velocity-dep/1.4/velocity-dep-1.4.jar
[ivy:resolve] 		::::::::::::::::::::::::::::::::::::::::::::::
[ivy:resolve] 		::              FAILED DOWNLOADS            ::
[ivy:resolve] 		:: ^ see resolution messages for details  ^ ::
[ivy:resolve] 		::::::::::::::::::::::::::::::::::::::::::::::
[ivy:resolve] 		:: biz.aQute#bnd;0.0.384!bnd.jar
[ivy:resolve] 		:: commons-beanutils#commons-beanutils-core;1.8.3!commons-beanutils-core.jar
[ivy:resolve] 		:: commons-cli#commons-cli;1.2!commons-cli.jar
[ivy:resolve] 		:: commons-codec#commons-codec;1.6!commons-codec.jar
[ivy:resolve] 		:: commons-digester#commons-digester;1.8.1!commons-digester.jar
[ivy:resolve] 		:: org.apache.derby#derby;10.8.2.2!derby.jar
[ivy:resolve] 		:: org.apache.geronimo.specs#geronimo-j2ee-connector_1.5_spec;2.0.0!geronimo-j2ee-connector_1.5_spec.jar
[ivy:resolve] 		:: com.google.code.gson#gson;2.0!gson.jar
[ivy:resolve] 		:: org.mockito#mockito-all;1.9.0!mockito-all.jar
[ivy:resolve] 		:: org.slf4j#slf4j-log4j12;1.6.4!slf4j-log4j12.jar
[ivy:resolve] 		:: org.eclipse.jetty#jetty-server;7.6.3.v20120416!jetty-server.jar
[ivy:resolve] 		:: org.eclipse.jetty#jetty-continuation;7.6.3.v20120416!jetty-continuation.jar
[ivy:resolve] 		:: org.eclipse.jetty#jetty-servlet;7.6.3.v20120416!jetty-servlet.jar
[ivy:resolve] 		:: velocity#velocity-dep;1.4!velocity-dep.jar
[ivy:resolve] 		::::::::::::::::::::::::::::::::::::::::::::::
[ivy:resolve] 
[ivy:resolve] :: USE VERBOSE OR DEBUG MESSAGE LEVEL FOR MORE DETAILS

BUILD FAILED
<https://builds.apache.org/job/Qpid-Java-Artefact-Release/ws/trunk/qpid/java/common.xml>:289:
impossible to resolve dependencies:
	resolve failed - see output for details

Total time: 47 seconds
Build step 'Invoke Ant' marked build as failure
Archiving artifacts

Mime
View raw message