qpid-notifications mailing list archives

Site index · List index
Message view « Date » · « Thread »
Top « Date » · « Thread »
From Apache Jenkins Server <jenk...@builds.apache.org>
Subject Build failed in Jenkins: Qpid-proton-jni #80
Date Mon, 15 Apr 2013 07:52:53 GMT
See <https://builds.apache.org/job/Qpid-proton-jni/80/>

------------------------------------------
Started by user kwall
Building remotely on ubuntu6 in workspace <https://builds.apache.org/job/Qpid-proton-jni/ws/>
Cleaning up <https://builds.apache.org/job/Qpid-proton-jni/ws/proton>
Deleting <https://builds.apache.org/job/Qpid-proton-jni/ws/proton/build>
Deleting <https://builds.apache.org/job/Qpid-proton-jni/ws/proton/proton-c/src/protocol.pyc>
Deleting <https://builds.apache.org/job/Qpid-proton-jni/ws/proton/proton-c/mllib/__init__.pyc>
Deleting <https://builds.apache.org/job/Qpid-proton-jni/ws/proton/proton-c/mllib/dom.pyc>
Deleting <https://builds.apache.org/job/Qpid-proton-jni/ws/proton/proton-c/mllib/parsers.pyc>
Deleting <https://builds.apache.org/job/Qpid-proton-jni/ws/proton/proton-c/mllib/transforms.pyc>
Updating https://svn.apache.org/repos/asf/qpid/proton/trunk
At revision 1467889
no change for https://svn.apache.org/repos/asf/qpid/proton/trunk since the previous build
[Qpid-proton-jni] $ /bin/bash -e /tmp/hudson6412242172709147123.sh
No LSB modules are available.
Arch: x86_64 Uname: Linux quirinus.apache.org 3.2.0-35-generic #55-Ubuntu SMP Wed Dec 5 17:42:16
UTC 2012 x86_64 x86_64 x86_64 GNU/Linux lsb_release: Distributor ID: Ubuntu Description: Ubuntu
12.04.1 LTS Release: 12.04 Codename: precise
Java home: /usr/lib/jvm/java-6-openjdk-amd64
=============
Listing pertinent packages
=============
-- The C compiler identification is GNU
-- Check for working C compiler: /usr/bin/gcc
-- Check for working C compiler: /usr/bin/gcc -- works
-- Detecting C compiler ABI info
-- Detecting C compiler ABI info - done
-- PN_VERSION: 0.4
-- Could NOT find Java (missing:  Java_JAVA_EXECUTABLE Java_JAR_EXECUTABLE Java_JAVAC_EXECUTABLE
Java_JAVAH_EXECUTABLE Java_JAVADOC_EXECUTABLE) 
-- checking for module 'openssl'
--   found openssl, version 1.0.1
-- Found OpenSSL: /usr/lib/x86_64-linux-gnu/libssl.so;/usr/lib/x86_64-linux-gnu/libcrypto.so
(found version "1..1")
-- Looking for clock_gettime
-- Looking for clock_gettime - not found.
-- Looking for clock_gettime in rt
-- Looking for clock_gettime in rt - found
-- Looking for uuid_generate
-- Looking for uuid_generate - not found.
-- Looking for uuid_generate in uuid
-- Looking for uuid_generate in uuid - found
-- Looking for strerror_r
-- Looking for strerror_r - found
-- Looking for atoll
-- Looking for atoll - found
-- Found SWIG: /usr/bin/swig2.0 (found version "2.0.4")
-- Found PythonLibs: /usr/lib/libpython2.7.so 
-- Found Ruby: /usr/bin/ruby (found version "1.8.7")
-- Found Perl: /usr/bin/perl 
-- Could NOT find PerlLibs (missing:  PERL_LIBRARY) (found version "5.14.2")
-- Found PythonInterp: /usr/bin/python (found version "2.7.3")
-- Could NOT find Doxygen (missing:  DOXYGEN_EXECUTABLE) 
-- Can't locate the valgrind command; no run-time error detection
-- Cannot find both Java and Maven: testing disabled for Proton-J and JNI Bindings
-- Configuring done
-- Generating done
-- Build files have been written to: <https://builds.apache.org/job/Qpid-proton-jni/ws/proton/build>
[  3%] Generating protocol.h
[  6%] Generating encodings.h
Scanning dependencies of target qpid-proton
[  9%] Building C object proton-c/CMakeFiles/qpid-proton.dir/src/util.c.o
[ 12%] Building C object proton-c/CMakeFiles/qpid-proton.dir/src/error.c.o
[ 15%] Building C object proton-c/CMakeFiles/qpid-proton.dir/src/buffer.c.o
[ 18%] Building C object proton-c/CMakeFiles/qpid-proton.dir/src/parser.c.o
[ 21%] Building C object proton-c/CMakeFiles/qpid-proton.dir/src/scanner.c.o
[ 24%] Building C object proton-c/CMakeFiles/qpid-proton.dir/src/types.c.o
[ 27%] Building C object proton-c/CMakeFiles/qpid-proton.dir/src/framing/framing.c.o
[ 30%] Building C object proton-c/CMakeFiles/qpid-proton.dir/src/codec/codec.c.o
[ 33%] Building C object proton-c/CMakeFiles/qpid-proton.dir/src/dispatcher/dispatcher.c.o
[ 36%] Building C object proton-c/CMakeFiles/qpid-proton.dir/src/engine/engine.c.o
[ 39%] Building C object proton-c/CMakeFiles/qpid-proton.dir/src/message/message.c.o
[ 42%] Building C object proton-c/CMakeFiles/qpid-proton.dir/src/sasl/sasl.c.o
[ 45%] Building C object proton-c/CMakeFiles/qpid-proton.dir/src/messenger/messenger.c.o
[ 48%] Building C object proton-c/CMakeFiles/qpid-proton.dir/src/messenger/store.c.o
[ 51%] Building C object proton-c/CMakeFiles/qpid-proton.dir/src/posix/driver.c.o
[ 54%] Building C object proton-c/CMakeFiles/qpid-proton.dir/src/platform.c.o
[ 57%] Building C object proton-c/CMakeFiles/qpid-proton.dir/src/ssl/openssl.c.o
Linking C shared library libqpid-proton.so
[ 57%] Built target qpid-proton
Scanning dependencies of target proton
[ 60%] Building C object proton-c/CMakeFiles/proton.dir/src/proton.c.o
Linking C executable proton
[ 60%] Built target proton
Scanning dependencies of target proton-dump
[ 63%] Building C object proton-c/CMakeFiles/proton-dump.dir/src/proton-dump.c.o
Linking C executable proton-dump
[ 63%] Built target proton-dump
[ 66%] Swig source
<https://builds.apache.org/job/Qpid-proton-jni/ws/proton/proton-c/include/proton/engine.h>:72:
Warning 451: Setting a const char * variable may leak memory.
Scanning dependencies of target _cproton
[ 66%] Swig source
<https://builds.apache.org/job/Qpid-proton-jni/ws/proton/proton-c/include/proton/engine.h>:72:
Warning 451: Setting a const char * variable may leak memory.
[ 69%] Building C object proton-c/bindings/python/CMakeFiles/_cproton.dir/pythonPYTHON_wrap.c.o
Linking C shared module _cproton.so
[ 69%] Built target _cproton
[ 72%] Swig source
<https://builds.apache.org/job/Qpid-proton-jni/ws/proton/proton-c/include/proton/types.h>:45:
Warning 801: Wrong class name (corrected to `Pn_decimal128_t')
<https://builds.apache.org/job/Qpid-proton-jni/ws/proton/proton-c/include/proton/types.h>:45:
Warning 801: Wrong class name (corrected to `Pn_decimal128_t')
<https://builds.apache.org/job/Qpid-proton-jni/ws/proton/proton-c/include/proton/types.h>:48:
Warning 801: Wrong class name (corrected to `Pn_uuid_t')
<https://builds.apache.org/job/Qpid-proton-jni/ws/proton/proton-c/include/proton/types.h>:48:
Warning 801: Wrong class name (corrected to `Pn_uuid_t')
<https://builds.apache.org/job/Qpid-proton-jni/ws/proton/proton-c/include/proton/types.h>:52:
Warning 801: Wrong class name (corrected to `Pn_bytes_t')
<https://builds.apache.org/job/Qpid-proton-jni/ws/proton/proton-c/include/proton/types.h>:52:
Warning 801: Wrong class name (corrected to `Pn_bytes_t')
<https://builds.apache.org/job/Qpid-proton-jni/ws/proton/proton-c/include/proton/engine.h>:70:
Warning 801: Wrong class name (corrected to `Pn_delivery_tag_t')
<https://builds.apache.org/job/Qpid-proton-jni/ws/proton/proton-c/include/proton/engine.h>:70:
Warning 801: Wrong class name (corrected to `Pn_delivery_tag_t')
<https://builds.apache.org/job/Qpid-proton-jni/ws/proton/proton-c/include/proton/engine.h>:72:
Warning 451: Setting a const char * variable may leak memory.
<https://builds.apache.org/job/Qpid-proton-jni/ws/proton/proton-c/include/proton/codec.h>:69:
Warning 801: Wrong class name (corrected to `Pn_atom_t')
<https://builds.apache.org/job/Qpid-proton-jni/ws/proton/proton-c/include/proton/codec.h>:69:
Warning 801: Wrong class name (corrected to `Pn_atom_t')
<https://builds.apache.org/job/Qpid-proton-jni/ws/proton/proton-c/include/proton/codec.h>:91:
Warning 801: Wrong class name (corrected to `Pn_atom_t_u')
<https://builds.apache.org/job/Qpid-proton-jni/ws/proton/proton-c/include/proton/codec.h>:91:
Warning 801: Wrong class name (corrected to `Pn_atom_t_u')
Scanning dependencies of target cproton-ruby
[ 75%] Building C object proton-c/bindings/ruby/CMakeFiles/cproton-ruby.dir/rubyRUBY_wrap.c.o
Linking C shared module cproton.so
[ 75%] Built target cproton-ruby
[ 78%] Swig source
<https://builds.apache.org/job/Qpid-proton-jni/ws/proton/proton-c/include/proton/engine.h>:72:
Warning 451: Setting a const char * variable may leak memory.
Scanning dependencies of target cproton
[ 81%] Building C object proton-c/bindings/php/CMakeFiles/cproton.dir/phpPHP_wrap.c.o
Linking C shared module cproton.so
[ 81%] Built target cproton
Scanning dependencies of target recv
[ 84%] Building C object proton-c/examples/messenger/c/CMakeFiles/recv.dir/recv.c.o
Linking C executable recv
[ 84%] Built target recv
Scanning dependencies of target send
[ 87%] Building C object proton-c/examples/messenger/c/CMakeFiles/send.dir/send.c.o
Linking C executable send
[ 87%] Built target send
Scanning dependencies of target msgr-recv
[ 90%] Building C object tests/tools/apps/c/CMakeFiles/msgr-recv.dir/msgr-recv.c.o
[ 93%] Building C object tests/tools/apps/c/CMakeFiles/msgr-recv.dir/msgr-common.c.o
Linking C executable msgr-recv
[ 93%] Built target msgr-recv
Scanning dependencies of target msgr-send
[ 96%] Building C object tests/tools/apps/c/CMakeFiles/msgr-send.dir/msgr-send.c.o
[100%] Building C object tests/tools/apps/c/CMakeFiles/msgr-send.dir/msgr-common.c.o
Linking C executable msgr-send
[100%] Built target msgr-send
Parsing POMs
[proton] $ /usr/lib/jvm/java-6-openjdk-amd64/bin/java -XX:MaxPermSize=500m -Xmx2G -Xms1G -Djava.awt.headless=true
-cp /home/jenkins/jenkins-slave/maven3-agent.jar:/home/hudson/tools/maven/apache-maven-3.0.2/boot/plexus-classworlds-2.4.jar
org.jvnet.hudson.maven3.agent.Maven3Main /home/hudson/tools/maven/apache-maven-3.0.2 /home/jenkins/jenkins-slave/slave.jar
/home/jenkins/jenkins-slave/maven3-interceptor.jar 44799
ERROR: Failed to parse POMs
java.io.IOException: Cannot run program "/usr/lib/jvm/java-6-openjdk-amd64/bin/java" (in directory
"<https://builds.apache.org/job/Qpid-proton-jni/ws/proton")>: java.io.IOException: error=2,
No such file or directory
	at java.lang.ProcessBuilder.start(ProcessBuilder.java:459)
	at hudson.Proc$LocalProc.<init>(Proc.java:244)
	at hudson.Proc$LocalProc.<init>(Proc.java:216)
	at hudson.Launcher$LocalLauncher.launch(Launcher.java:763)
	at hudson.Launcher$ProcStarter.start(Launcher.java:353)
	at hudson.Launcher$RemoteLaunchCallable.call(Launcher.java:988)
	at hudson.Launcher$RemoteLaunchCallable.call(Launcher.java:955)
	at hudson.remoting.UserRequest.perform(UserRequest.java:118)
	at hudson.remoting.UserRequest.perform(UserRequest.java:48)
	at hudson.remoting.Request$2.run(Request.java:326)
	at hudson.remoting.InterceptingExecutorService$1.call(InterceptingExecutorService.java:72)
	at java.util.concurrent.FutureTask$Sync.innerRun(FutureTask.java:303)
	at java.util.concurrent.FutureTask.run(FutureTask.java:138)
	at java.util.concurrent.ThreadPoolExecutor$Worker.runTask(ThreadPoolExecutor.java:886)
	at java.util.concurrent.ThreadPoolExecutor$Worker.run(ThreadPoolExecutor.java:908)
	at java.lang.Thread.run(Thread.java:619)
Caused by: java.io.IOException: java.io.IOException: error=2, No such file or directory
	at java.lang.UNIXProcess.<init>(UNIXProcess.java:148)
	at java.lang.ProcessImpl.start(ProcessImpl.java:65)
	at java.lang.ProcessBuilder.start(ProcessBuilder.java:452)
	... 15 more

Mime
View raw message