qpid-notifications mailing list archives

Site index · List index
Message view « Date » · « Thread »
Top « Date » · « Thread »
From Apache Jenkins Server <jenk...@builds.apache.org>
Subject Build failed in Jenkins: Qpid-Java-Artefact-Release-0.22 #3
Date Thu, 04 Apr 2013 03:45:49 GMT
See <https://builds.apache.org/job/Qpid-Java-Artefact-Release-0.22/3/>

------------------------------------------
[...truncated 6393 lines...]
[ivy:resolve] ............................................................... (346kB)
[ivy:resolve] .. (0kB)
[ivy:resolve] downloading http://repo1.maven.org/maven2/commons-digester/commons-digester/1.8.1/commons-digester-1.8.1.jar
...
[ivy:resolve] ................................ (142kB)
[ivy:resolve] .. (0kB)
[ivy:resolve] 	[SUCCESSFUL ] commons-digester#commons-digester;1.8.1!commons-digester.jar
(167ms)
[ivy:resolve] downloading http://repo1.maven.org/maven2/commons-lang/commons-lang/2.6/commons-lang-2.6.jar
...
[ivy:resolve] ........................................................................ (277kB)
[ivy:resolve] .. (0kB)
[ivy:resolve] downloading http://repo1.maven.org/maven2/commons-logging/commons-logging/1.1.1/commons-logging-1.1.1.jar
...
[ivy:resolve] .............. (59kB)
[ivy:resolve] .. (0kB)
[ivy:resolve] downloading http://repo1.maven.org/maven2/org/apache/derby/derby/10.8.2.2/derby-10.8.2.2.jar
...
[ivy:resolve] ....................................................................................................................................................................................................................................................................................................................................................................................................................................................................................................................................................................................................................................................................................
(2608kB)
[ivy:resolve] .. (0kB)
[ivy:resolve] 	[SUCCESSFUL ] org.apache.derby#derby;10.8.2.2!derby.jar (109ms)
[ivy:resolve] downloading http://repo1.maven.org/maven2/org/apache/geronimo/framework/geronimo-kernel/2.2.1/geronimo-kernel-2.2.1.jar
...
[ivy:resolve] ...................................................................................................................
(406kB)
[ivy:resolve] .. (0kB)
[ivy:resolve] downloading http://repo1.maven.org/maven2/org/apache/geronimo/specs/geronimo-ejb_3.0_spec/1.0.1/geronimo-ejb_3.0_spec-1.0.1.jar
...
[ivy:resolve] ...... (31kB)
[ivy:resolve] .. (0kB)
[ivy:resolve] downloading http://repo1.maven.org/maven2/org/apache/geronimo/specs/geronimo-j2ee-connector_1.5_spec/2.0.0/geronimo-j2ee-connector_1.5_spec-2.0.0.jar
...
[ivy:resolve] ....... (36kB)
[ivy:resolve] .. (0kB)
[ivy:resolve] 	[SUCCESSFUL ] org.apache.geronimo.specs#geronimo-j2ee-connector_1.5_spec;2.0.0!geronimo-j2ee-connector_1.5_spec.jar
(98ms)
[ivy:resolve] downloading http://repo1.maven.org/maven2/org/apache/geronimo/specs/geronimo-jms_1.1_spec/1.0/geronimo-jms_1.1_spec-1.0.jar
...
[ivy:resolve] ....... (27kB)
[ivy:resolve] .. (0kB)
[ivy:resolve] downloading http://repo1.maven.org/maven2/org/apache/geronimo/specs/geronimo-jta_1.1_spec/1.1.1/geronimo-jta_1.1_spec-1.1.1.jar
...
[ivy:resolve] .. (15kB)
[ivy:resolve] .. (0kB)
[ivy:resolve] downloading http://repo1.maven.org/maven2/org/apache/geronimo/specs/geronimo-servlet_2.5_spec/1.2/geronimo-servlet_2.5_spec-1.2.jar
...
[ivy:resolve] ................. (68kB)
[ivy:resolve] .. (0kB)
[ivy:resolve] downloading http://repo1.maven.org/maven2/com/google/code/gson/gson/2.0/gson-2.0.jar
...
[ivy:resolve] .................................................................. (198kB)
[ivy:resolve] .. (0kB)
[ivy:resolve] 	[SUCCESSFUL ] com.google.code.gson#gson;2.0!gson.jar (222ms)
[ivy:resolve] downloading http://repo1.maven.org/maven2/org/codehaus/jackson/jackson-core-asl/1.9.0/jackson-core-asl-1.9.0.jar
...
[ivy:resolve] .............................................. (222kB)
[ivy:resolve] .. (0kB)
[ivy:resolve] 	[SUCCESSFUL ] org.codehaus.jackson#jackson-core-asl;1.9.0!jackson-core-asl.jar
(152ms)
[ivy:resolve] downloading http://repo1.maven.org/maven2/org/codehaus/jackson/jackson-mapper-asl/1.9.0/jackson-mapper-asl-1.9.0.jar
...
[ivy:resolve] .......................................................................................................................................
(746kB)
[ivy:resolve] .. (0kB)
[ivy:resolve] 	[SUCCESSFUL ] org.codehaus.jackson#jackson-mapper-asl;1.9.0!jackson-mapper-asl.jar
(61ms)
[ivy:resolve] downloading http://repo1.maven.org/maven2/net/java/dev/javacc/javacc/5.0/javacc-5.0.jar
...
[ivy:resolve] ................................................ (291kB)
[ivy:resolve] .. (0kB)
[ivy:resolve] 	[SUCCESSFUL ] net.java.dev.javacc#javacc;5.0!javacc.jar (181ms)
[ivy:resolve] downloading http://repo1.maven.org/maven2/junit/junit/3.8.1/junit-3.8.1.jar
...
[ivy:resolve] ......................... (118kB)
[ivy:resolve] .. (0kB)
[ivy:resolve] 	[SUCCESSFUL ] junit#junit;3.8.1!junit.jar (16ms)
[ivy:resolve] downloading http://repo1.maven.org/maven2/org/python/jython-standalone/2.5.2/jython-standalone-2.5.2.jar
...
[ivy:resolve] ............................................................................................................................................................................................................................................................................................................................................................................................................................................................................................................................................................................................................................................................................................................................................................................................................................................................................................................................................................................................................................................................................................................................................................................................................................................................................................................................................................................................................................................................................................................................................................................................................................................................................................................................................................................................................................................
(10040kB)
[ivy:resolve] .. (0kB)
[ivy:resolve] 	[SUCCESSFUL ] org.python#jython-standalone;2.5.2!jython-standalone.jar (308ms)
[ivy:resolve] downloading http://repo1.maven.org/maven2/log4j/log4j/1.2.16/log4j-1.2.16.jar
...
[ivy:resolve] ................................................................................................
(470kB)
[ivy:resolve] .. (0kB)
[ivy:resolve] 	[SUCCESSFUL ] log4j#log4j;1.2.16!log4j.jar(bundle) (28ms)
[ivy:resolve] downloading http://repo1.maven.org/maven2/org/apache/maven/maven-ant-tasks/2.1.1/maven-ant-tasks-2.1.1.jar
...
[ivy:resolve] ..................................................................................................................................................................................................................................
(1283kB)
[ivy:resolve] .. (0kB)
[ivy:resolve] 	[SUCCESSFUL ] org.apache.maven#maven-ant-tasks;2.1.1!maven-ant-tasks.jar (178ms)
[ivy:resolve] downloading http://repo1.maven.org/maven2/org/mockito/mockito-all/1.9.0/mockito-all-1.9.0.jar
...
[ivy:resolve] .........................................................................................................................................................................................................................................
(1460kB)
[ivy:resolve] .. (0kB)
[ivy:resolve] downloading http://repo1.maven.org/maven2/org/slf4j/slf4j-api/1.6.4/slf4j-api-1.6.4.jar
...
[ivy:resolve] ...... (25kB)
[ivy:resolve] .. (0kB)
[ivy:resolve] 	[SUCCESSFUL ] org.slf4j#slf4j-api;1.6.4!slf4j-api.jar (17ms)
[ivy:resolve] downloading http://repo1.maven.org/maven2/org/slf4j/slf4j-log4j12/1.6.4/slf4j-log4j12-1.6.4.jar
...
[ivy:resolve] .. (9kB)
[ivy:resolve] .. (0kB)
[ivy:resolve] 	[SUCCESSFUL ] org.slf4j#slf4j-log4j12;1.6.4!slf4j-log4j12.jar (15ms)
[ivy:resolve] downloading http://repo1.maven.org/maven2/org/eclipse/jetty/jetty-server/7.6.3.v20120416/jetty-server-7.6.3.v20120416.jar
...
[ivy:resolve] .......................................................................... (304kB)
[ivy:resolve] .. (0kB)
[ivy:resolve] 	[SUCCESSFUL ] org.eclipse.jetty#jetty-server;7.6.3.v20120416!jetty-server.jar
(62ms)
[ivy:resolve] downloading http://repo1.maven.org/maven2/org/eclipse/jetty/jetty-websocket/7.6.3.v20120416/jetty-websocket-7.6.3.v20120416.jar
...
[ivy:resolve] ................................ (117kB)
[ivy:resolve] .. (0kB)
[ivy:resolve] downloading http://repo1.maven.org/maven2/org/eclipse/jetty/jetty-continuation/7.6.3.v20120416/jetty-continuation-7.6.3.v20120416.jar
...
[ivy:resolve] ... (19kB)
[ivy:resolve] .. (0kB)
[ivy:resolve] 	[SUCCESSFUL ] org.eclipse.jetty#jetty-continuation;7.6.3.v20120416!jetty-continuation.jar
(31ms)
[ivy:resolve] downloading http://repo1.maven.org/maven2/org/eclipse/jetty/jetty-io/7.6.3.v20120416/jetty-io-7.6.3.v20120416.jar
...
[ivy:resolve] .................... (94kB)
[ivy:resolve] .. (0kB)
[ivy:resolve] downloading http://repo1.maven.org/maven2/org/eclipse/jetty/jetty-http/7.6.3.v20120416/jetty-http-7.6.3.v20120416.jar
...
[ivy:resolve] ..................... (88kB)
[ivy:resolve] .. (0kB)
[ivy:resolve] downloading http://repo1.maven.org/maven2/org/eclipse/jetty/jetty-security/7.6.3.v20120416/jetty-security-7.6.3.v20120416.jar
...
[ivy:resolve] ......................... (81kB)
[ivy:resolve] .. (0kB)
[ivy:resolve] downloading http://repo1.maven.org/maven2/org/eclipse/jetty/jetty-servlet/7.6.3.v20120416/jetty-servlet-7.6.3.v20120416.jar
...
[ivy:resolve] ...................... (85kB)
[ivy:resolve] .. (0kB)
[ivy:resolve] 	[SUCCESSFUL ] org.eclipse.jetty#jetty-servlet;7.6.3.v20120416!jetty-servlet.jar
(46ms)
[ivy:resolve] downloading http://repo1.maven.org/maven2/org/eclipse/jetty/jetty-util/7.6.3.v20120416/jetty-util-7.6.3.v20120416.jar
...
[ivy:resolve] ....................................................................... (243kB)
[ivy:resolve] .. (0kB)
[ivy:resolve] downloading http://repo1.maven.org/maven2/org/dojotoolkit/dojo-war/1.7.2/dojo-war-1.7.2.war
...
[ivy:resolve] ...................................................................................................................................................................................................................................................................................................................................................................................................................................................................................................................................................................................................................................................................................................................................................................................................................................................................................................................................................................................................................................................................................................................................................................................................................................................................................................................................................................................................................................................................................................................................................................................................................................................................................................................................................................................
(8689kB)
[ivy:resolve] .. (0kB)
[ivy:resolve] downloading http://repo1.maven.org/maven2/xalan/xalan/2.7.0/xalan-2.7.0.jar
...
[ivy:resolve] ..........................................................................................................................................................................................................................................................................................................................................................................................................................................................................................................................................................................................................................................................................................................................................................................................................
(2666kB)
[ivy:resolve] .. (0kB)
[ivy:resolve] downloading http://repo1.maven.org/maven2/velocity/velocity/1.4/velocity-1.4.jar
...
[ivy:resolve] .........................................................................................
(352kB)
[ivy:resolve] .. (0kB)
[ivy:resolve] downloading http://repo1.maven.org/maven2/velocity/velocity-dep/1.4/velocity-dep-1.4.jar
...
[ivy:resolve] ...............................................................................................................................................
(505kB)
[ivy:resolve] .. (0kB)
[ivy:resolve] 	[SUCCESSFUL ] velocity#velocity-dep;1.4!velocity-dep.jar (27ms)
[ivy:resolve] :: resolution report :: resolve 39132ms :: artifacts dl 5294ms
	---------------------------------------------------------------------
	|                  |            modules            ||   artifacts   |
	|       conf       | number| search|dwnlded|evicted|| number|dwnlded|
	---------------------------------------------------------------------
	|     required     |   39  |   38  |   36  |   0   ||   39  |   21  |
	---------------------------------------------------------------------
[ivy:resolve] 
[ivy:resolve] :: problems summary ::
[ivy:resolve] :::: WARNINGS
[ivy:resolve] 	problem while downloading module descriptor: http://repo1.maven.org/maven2/commons-configuration/commons-configuration/1.8/commons-configuration-1.8.pom:
/home/jenkins/.ivy2/cache/commons-configuration/commons-configuration/ivy-1.8.xml.original.part
(No such file or directory) (48ms)
[ivy:resolve] 	problem while downloading module descriptor: http://repo1.maven.org/maven2/org/apache/derby/derby/10.8.2.2/derby-10.8.2.2.pom:
/home/jenkins/.ivy2/cache/org.apache.derby/derby/ivy-10.8.2.2.xml.original.part (No such file
or directory) (51ms)
[ivy:resolve] 	problem while downloading module descriptor: http://repo1.maven.org/maven2/org/apache/geronimo/framework/geronimo-kernel/2.2.1/geronimo-kernel-2.2.1.pom:
/home/jenkins/.ivy2/cache/org.apache.geronimo.framework/geronimo-kernel/ivy-2.2.1.xml.original.part
(No such file or directory) (201ms)
[ivy:resolve] 	problem while downloading module descriptor: http://repo1.maven.org/maven2/org/apache/geronimo/geronimo/2.2.1/geronimo-2.2.1.pom:
impossible to move part file to definitive one: /home/jenkins/.ivy2/cache/org.apache.geronimo/geronimo/ivy-2.2.1.xml.original.part
-> /home/jenkins/.ivy2/cache/org.apache.geronimo/geronimo/ivy-2.2.1.xml.original (802ms)
[ivy:resolve] 	problem while downloading module descriptor: http://repo1.maven.org/maven2/org/apache/geronimo/specs/geronimo-ejb_3.0_spec/1.0.1/geronimo-ejb_3.0_spec-1.0.1.pom:
impossible to move part file to definitive one: /home/jenkins/.ivy2/cache/org.apache.geronimo.specs/geronimo-ejb_3.0_spec/ivy-1.0.1.xml.original.part
-> /home/jenkins/.ivy2/cache/org.apache.geronimo.specs/geronimo-ejb_3.0_spec/ivy-1.0.1.xml.original
(36ms)
[ivy:resolve] 	problem while downloading module descriptor: http://repo1.maven.org/maven2/org/apache/geronimo/specs/geronimo-jms_1.1_spec/1.0/geronimo-jms_1.1_spec-1.0.pom:
/home/jenkins/.ivy2/cache/org.apache.geronimo.specs/geronimo-jms_1.1_spec/ivy-1.0.xml.original.part
(No such file or directory) (15ms)
[ivy:resolve] 	problem while downloading module descriptor: http://repo1.maven.org/maven2/org/apache/geronimo/specs/geronimo-jta_1.1_spec/1.1.1/geronimo-jta_1.1_spec-1.1.1.pom:
impossible to move part file to definitive one: /home/jenkins/.ivy2/cache/org.apache.geronimo.specs/geronimo-jta_1.1_spec/ivy-1.1.1.xml.original.part
-> /home/jenkins/.ivy2/cache/org.apache.geronimo.specs/geronimo-jta_1.1_spec/ivy-1.1.1.xml.original
(23ms)
[ivy:resolve] 	problem while downloading module descriptor: http://repo1.maven.org/maven2/com/google/code/gson/gson/2.0/gson-2.0.pom:
/home/jenkins/.ivy2/cache/com.google.code.gson/gson/ivy-2.0.xml.original.part (No such file
or directory) (364ms)
[ivy:resolve] 	problem while downloading module descriptor: http://repo1.maven.org/maven2/org/codehaus/jackson/jackson-core-asl/1.9.0/jackson-core-asl-1.9.0.pom:
impossible to move part file to definitive one: /home/jenkins/.ivy2/cache/org.codehaus.jackson/jackson-core-asl/ivy-1.9.0.xml.original.part
-> /home/jenkins/.ivy2/cache/org.codehaus.jackson/jackson-core-asl/ivy-1.9.0.xml.original
(56ms)
[ivy:resolve] 	problem while downloading module descriptor: http://repo1.maven.org/maven2/org/codehaus/jackson/jackson-mapper-asl/1.9.0/jackson-mapper-asl-1.9.0.pom:
/home/jenkins/.ivy2/cache/org.codehaus.jackson/jackson-mapper-asl/ivy-1.9.0.xml.original.part
(No such file or directory) (24ms)
[ivy:resolve] 	problem while downloading module descriptor: http://repo1.maven.org/maven2/net/java/dev/javacc/javacc/5.0/javacc-5.0.pom:
/home/jenkins/.ivy2/cache/net.java.dev.javacc/javacc/ivy-5.0.xml.original.part (No such file
or directory) (185ms)
[ivy:resolve] 	problem while downloading module descriptor: http://repo1.maven.org/maven2/org/slf4j/slf4j-api/1.6.4/slf4j-api-1.6.4.pom:
/home/jenkins/.ivy2/cache/org.slf4j/slf4j-api/ivy-1.6.4.xml.original.part (No such file or
directory) (10ms)
[ivy:resolve] 	problem while downloading module descriptor: http://repo1.maven.org/maven2/org/eclipse/jetty/jetty-parent/19/jetty-parent-19.pom:
/home/jenkins/.ivy2/cache/org.eclipse.jetty/jetty-parent/ivy-19.xml.original.part (No such
file or directory) (12ms)
[ivy:resolve] 	problem while downloading module descriptor: http://repo1.maven.org/maven2/org/eclipse/jetty/jetty-websocket/7.6.3.v20120416/jetty-websocket-7.6.3.v20120416.pom:
/home/jenkins/.ivy2/cache/org.eclipse.jetty/jetty-websocket/ivy-7.6.3.v20120416.xml.original.part
(No such file or directory) (254ms)
[ivy:resolve] 	problem while downloading module descriptor: http://repo1.maven.org/maven2/org/eclipse/jetty/jetty-servlet/7.6.3.v20120416/jetty-servlet-7.6.3.v20120416.pom:
/home/jenkins/.ivy2/cache/org.eclipse.jetty/jetty-servlet/ivy-7.6.3.v20120416.xml.original.part
(No such file or directory) (50ms)
[ivy:resolve] 	problem while downloading module descriptor: http://repo1.maven.org/maven2/org/eclipse/jetty/jetty-util/7.6.3.v20120416/jetty-util-7.6.3.v20120416.pom:
/home/jenkins/.ivy2/cache/org.eclipse.jetty/jetty-util/ivy-7.6.3.v20120416.xml.original.part
(No such file or directory) (412ms)
[ivy:resolve] 		[FAILED     ] commons-collections#commons-collections;3.2.1!commons-collections.jar:
impossible to move part file to definitive one: /home/jenkins/.ivy2/cache/commons-collections/commons-collections/jars/commons-collections-3.2.1.jar.part
-> /home/jenkins/.ivy2/cache/commons-collections/commons-collections/jars/commons-collections-3.2.1.jar
(86ms)
[ivy:resolve] 		[FAILED     ] commons-collections#commons-collections;3.2.1!commons-collections.jar:
impossible to move part file to definitive one: /home/jenkins/.ivy2/cache/commons-collections/commons-collections/jars/commons-collections-3.2.1.jar.part
-> /home/jenkins/.ivy2/cache/commons-collections/commons-collections/jars/commons-collections-3.2.1.jar
(86ms)
[ivy:resolve] 	==== m2repo: tried
[ivy:resolve] 	  http://repo1.maven.org/maven2/commons-collections/commons-collections/3.2.1/commons-collections-3.2.1.jar
[ivy:resolve] 		[FAILED     ] commons-configuration#commons-configuration;1.8!commons-configuration.jar:
/home/jenkins/.ivy2/cache/commons-configuration/commons-configuration/jars/commons-configuration-1.8.jar.part
(No such file or directory) (21ms)
[ivy:resolve] 		[FAILED     ] commons-configuration#commons-configuration;1.8!commons-configuration.jar:
/home/jenkins/.ivy2/cache/commons-configuration/commons-configuration/jars/commons-configuration-1.8.jar.part
(No such file or directory) (21ms)
[ivy:resolve] 	==== public: tried
[ivy:resolve] 	  http://repo1.maven.org/maven2/commons-configuration/commons-configuration/1.8/commons-configuration-1.8.jar
[ivy:resolve] 		[FAILED     ] commons-lang#commons-lang;2.6!commons-lang.jar: impossible to
move part file to definitive one: /home/jenkins/.ivy2/cache/commons-lang/commons-lang/jars/commons-lang-2.6.jar.part
-> /home/jenkins/.ivy2/cache/commons-lang/commons-lang/jars/commons-lang-2.6.jar (19ms)
[ivy:resolve] 		[FAILED     ] commons-lang#commons-lang;2.6!commons-lang.jar: impossible to
move part file to definitive one: /home/jenkins/.ivy2/cache/commons-lang/commons-lang/jars/commons-lang-2.6.jar.part
-> /home/jenkins/.ivy2/cache/commons-lang/commons-lang/jars/commons-lang-2.6.jar (19ms)
[ivy:resolve] 	==== m2repo: tried
[ivy:resolve] 	  http://repo1.maven.org/maven2/commons-lang/commons-lang/2.6/commons-lang-2.6.jar
[ivy:resolve] 		[FAILED     ] commons-logging#commons-logging;1.1.1!commons-logging.jar: /home/jenkins/.ivy2/cache/commons-logging/commons-logging/jars/commons-logging-1.1.1.jar.part
(No such file or directory) (13ms)
[ivy:resolve] 		[FAILED     ] commons-logging#commons-logging;1.1.1!commons-logging.jar: /home/jenkins/.ivy2/cache/commons-logging/commons-logging/jars/commons-logging-1.1.1.jar.part
(No such file or directory) (13ms)
[ivy:resolve] 	==== m2repo: tried
[ivy:resolve] 	  http://repo1.maven.org/maven2/commons-logging/commons-logging/1.1.1/commons-logging-1.1.1.jar
[ivy:resolve] 		[FAILED     ] org.apache.geronimo.framework#geronimo-kernel;2.2.1!geronimo-kernel.jar:
/home/jenkins/.ivy2/cache/org.apache.geronimo.framework/geronimo-kernel/jars/geronimo-kernel-2.2.1.jar.part
(No such file or directory) (145ms)
[ivy:resolve] 		[FAILED     ] org.apache.geronimo.framework#geronimo-kernel;2.2.1!geronimo-kernel.jar:
/home/jenkins/.ivy2/cache/org.apache.geronimo.framework/geronimo-kernel/jars/geronimo-kernel-2.2.1.jar.part
(No such file or directory) (145ms)
[ivy:resolve] 	==== public: tried
[ivy:resolve] 	  http://repo1.maven.org/maven2/org/apache/geronimo/framework/geronimo-kernel/2.2.1/geronimo-kernel-2.2.1.jar
[ivy:resolve] 		[FAILED     ] org.apache.geronimo.specs#geronimo-ejb_3.0_spec;1.0.1!geronimo-ejb_3.0_spec.jar:
impossible to move part file to definitive one: /home/jenkins/.ivy2/cache/org.apache.geronimo.specs/geronimo-ejb_3.0_spec/jars/geronimo-ejb_3.0_spec-1.0.1.jar.part
-> /home/jenkins/.ivy2/cache/org.apache.geronimo.specs/geronimo-ejb_3.0_spec/jars/geronimo-ejb_3.0_spec-1.0.1.jar
(35ms)
[ivy:resolve] 		[FAILED     ] org.apache.geronimo.specs#geronimo-ejb_3.0_spec;1.0.1!geronimo-ejb_3.0_spec.jar:
impossible to move part file to definitive one: /home/jenkins/.ivy2/cache/org.apache.geronimo.specs/geronimo-ejb_3.0_spec/jars/geronimo-ejb_3.0_spec-1.0.1.jar.part
-> /home/jenkins/.ivy2/cache/org.apache.geronimo.specs/geronimo-ejb_3.0_spec/jars/geronimo-ejb_3.0_spec-1.0.1.jar
(35ms)
[ivy:resolve] 	==== public: tried
[ivy:resolve] 	  http://repo1.maven.org/maven2/org/apache/geronimo/specs/geronimo-ejb_3.0_spec/1.0.1/geronimo-ejb_3.0_spec-1.0.1.jar
[ivy:resolve] 		[FAILED     ] org.apache.geronimo.specs#geronimo-jms_1.1_spec;1.0!geronimo-jms_1.1_spec.jar:
/home/jenkins/.ivy2/cache/org.apache.geronimo.specs/geronimo-jms_1.1_spec/jars/geronimo-jms_1.1_spec-1.0.jar.part
(No such file or directory) (14ms)
[ivy:resolve] 		[FAILED     ] org.apache.geronimo.specs#geronimo-jms_1.1_spec;1.0!geronimo-jms_1.1_spec.jar:
/home/jenkins/.ivy2/cache/org.apache.geronimo.specs/geronimo-jms_1.1_spec/jars/geronimo-jms_1.1_spec-1.0.jar.part
(No such file or directory) (14ms)
[ivy:resolve] 	==== public: tried
[ivy:resolve] 	  http://repo1.maven.org/maven2/org/apache/geronimo/specs/geronimo-jms_1.1_spec/1.0/geronimo-jms_1.1_spec-1.0.jar
[ivy:resolve] 		[FAILED     ] org.apache.geronimo.specs#geronimo-jta_1.1_spec;1.1.1!geronimo-jta_1.1_spec.jar:
/home/jenkins/.ivy2/cache/org.apache.geronimo.specs/geronimo-jta_1.1_spec/jars/geronimo-jta_1.1_spec-1.1.1.jar.part
(No such file or directory) (50ms)
[ivy:resolve] 		[FAILED     ] org.apache.geronimo.specs#geronimo-jta_1.1_spec;1.1.1!geronimo-jta_1.1_spec.jar:
/home/jenkins/.ivy2/cache/org.apache.geronimo.specs/geronimo-jta_1.1_spec/jars/geronimo-jta_1.1_spec-1.1.1.jar.part
(No such file or directory) (50ms)
[ivy:resolve] 	==== m2repo: tried
[ivy:resolve] 	  http://repo1.maven.org/maven2/org/apache/geronimo/specs/geronimo-jta_1.1_spec/1.1.1/geronimo-jta_1.1_spec-1.1.1.jar
[ivy:resolve] 		[FAILED     ] org.apache.geronimo.specs#geronimo-servlet_2.5_spec;1.2!geronimo-servlet_2.5_spec.jar:
/home/jenkins/.ivy2/cache/org.apache.geronimo.specs/geronimo-servlet_2.5_spec/jars/geronimo-servlet_2.5_spec-1.2.jar.part
(No such file or directory) (60ms)
[ivy:resolve] 		[FAILED     ] org.apache.geronimo.specs#geronimo-servlet_2.5_spec;1.2!geronimo-servlet_2.5_spec.jar:
/home/jenkins/.ivy2/cache/org.apache.geronimo.specs/geronimo-servlet_2.5_spec/jars/geronimo-servlet_2.5_spec-1.2.jar.part
(No such file or directory) (60ms)
[ivy:resolve] 	==== m2repo: tried
[ivy:resolve] 	  http://repo1.maven.org/maven2/org/apache/geronimo/specs/geronimo-servlet_2.5_spec/1.2/geronimo-servlet_2.5_spec-1.2.jar
[ivy:resolve] 		[FAILED     ] org.mockito#mockito-all;1.9.0!mockito-all.jar: invalid sha1:
expected=d13863fbd7c0bc32845c9d8a261d03b61bf28194 computed=c836ce868828425d743205bb7730d047efd79142
(43ms)
[ivy:resolve] 		[FAILED     ] org.mockito#mockito-all;1.9.0!mockito-all.jar: invalid sha1:
expected=d13863fbd7c0bc32845c9d8a261d03b61bf28194 computed=c836ce868828425d743205bb7730d047efd79142
(43ms)
[ivy:resolve] 	==== m2repo: tried
[ivy:resolve] 	  http://repo1.maven.org/maven2/org/mockito/mockito-all/1.9.0/mockito-all-1.9.0.jar
[ivy:resolve] 		[FAILED     ] org.eclipse.jetty#jetty-websocket;7.6.3.v20120416!jetty-websocket.jar:
impossible to move part file to definitive one: /home/jenkins/.ivy2/cache/org.eclipse.jetty/jetty-websocket/jars/jetty-websocket-7.6.3.v20120416.jar.part
-> /home/jenkins/.ivy2/cache/org.eclipse.jetty/jetty-websocket/jars/jetty-websocket-7.6.3.v20120416.jar
(198ms)
[ivy:resolve] 		[FAILED     ] org.eclipse.jetty#jetty-websocket;7.6.3.v20120416!jetty-websocket.jar:
impossible to move part file to definitive one: /home/jenkins/.ivy2/cache/org.eclipse.jetty/jetty-websocket/jars/jetty-websocket-7.6.3.v20120416.jar.part
-> /home/jenkins/.ivy2/cache/org.eclipse.jetty/jetty-websocket/jars/jetty-websocket-7.6.3.v20120416.jar
(198ms)
[ivy:resolve] 	==== public: tried
[ivy:resolve] 	  http://repo1.maven.org/maven2/org/eclipse/jetty/jetty-websocket/7.6.3.v20120416/jetty-websocket-7.6.3.v20120416.jar
[ivy:resolve] 		[FAILED     ] org.eclipse.jetty#jetty-io;7.6.3.v20120416!jetty-io.jar: impossible
to move part file to definitive one: /home/jenkins/.ivy2/cache/org.eclipse.jetty/jetty-io/jars/jetty-io-7.6.3.v20120416.jar.part
-> /home/jenkins/.ivy2/cache/org.eclipse.jetty/jetty-io/jars/jetty-io-7.6.3.v20120416.jar
(49ms)
[ivy:resolve] 		[FAILED     ] org.eclipse.jetty#jetty-io;7.6.3.v20120416!jetty-io.jar: impossible
to move part file to definitive one: /home/jenkins/.ivy2/cache/org.eclipse.jetty/jetty-io/jars/jetty-io-7.6.3.v20120416.jar.part
-> /home/jenkins/.ivy2/cache/org.eclipse.jetty/jetty-io/jars/jetty-io-7.6.3.v20120416.jar
(49ms)
[ivy:resolve] 	==== m2repo: tried
[ivy:resolve] 	  http://repo1.maven.org/maven2/org/eclipse/jetty/jetty-io/7.6.3.v20120416/jetty-io-7.6.3.v20120416.jar
[ivy:resolve] 		[FAILED     ] org.eclipse.jetty#jetty-http;7.6.3.v20120416!jetty-http.jar:
impossible to move part file to definitive one: /home/jenkins/.ivy2/cache/org.eclipse.jetty/jetty-http/jars/jetty-http-7.6.3.v20120416.jar.part
-> /home/jenkins/.ivy2/cache/org.eclipse.jetty/jetty-http/jars/jetty-http-7.6.3.v20120416.jar
(65ms)
[ivy:resolve] 		[FAILED     ] org.eclipse.jetty#jetty-http;7.6.3.v20120416!jetty-http.jar:
impossible to move part file to definitive one: /home/jenkins/.ivy2/cache/org.eclipse.jetty/jetty-http/jars/jetty-http-7.6.3.v20120416.jar.part
-> /home/jenkins/.ivy2/cache/org.eclipse.jetty/jetty-http/jars/jetty-http-7.6.3.v20120416.jar
(65ms)
[ivy:resolve] 	==== m2repo: tried
[ivy:resolve] 	  http://repo1.maven.org/maven2/org/eclipse/jetty/jetty-http/7.6.3.v20120416/jetty-http-7.6.3.v20120416.jar
[ivy:resolve] 		[FAILED     ] org.eclipse.jetty#jetty-security;7.6.3.v20120416!jetty-security.jar:
impossible to move part file to definitive one: /home/jenkins/.ivy2/cache/org.eclipse.jetty/jetty-security/jars/jetty-security-7.6.3.v20120416.jar.part
-> /home/jenkins/.ivy2/cache/org.eclipse.jetty/jetty-security/jars/jetty-security-7.6.3.v20120416.jar
(82ms)
[ivy:resolve] 		[FAILED     ] org.eclipse.jetty#jetty-security;7.6.3.v20120416!jetty-security.jar:
impossible to move part file to definitive one: /home/jenkins/.ivy2/cache/org.eclipse.jetty/jetty-security/jars/jetty-security-7.6.3.v20120416.jar.part
-> /home/jenkins/.ivy2/cache/org.eclipse.jetty/jetty-security/jars/jetty-security-7.6.3.v20120416.jar
(82ms)
[ivy:resolve] 	==== m2repo: tried
[ivy:resolve] 	  http://repo1.maven.org/maven2/org/eclipse/jetty/jetty-security/7.6.3.v20120416/jetty-security-7.6.3.v20120416.jar
[ivy:resolve] 		[FAILED     ] org.eclipse.jetty#jetty-util;7.6.3.v20120416!jetty-util.jar:
impossible to move part file to definitive one: /home/jenkins/.ivy2/cache/org.eclipse.jetty/jetty-util/jars/jetty-util-7.6.3.v20120416.jar.part
-> /home/jenkins/.ivy2/cache/org.eclipse.jetty/jetty-util/jars/jetty-util-7.6.3.v20120416.jar
(89ms)
[ivy:resolve] 		[FAILED     ] org.eclipse.jetty#jetty-util;7.6.3.v20120416!jetty-util.jar:
impossible to move part file to definitive one: /home/jenkins/.ivy2/cache/org.eclipse.jetty/jetty-util/jars/jetty-util-7.6.3.v20120416.jar.part
-> /home/jenkins/.ivy2/cache/org.eclipse.jetty/jetty-util/jars/jetty-util-7.6.3.v20120416.jar
(89ms)
[ivy:resolve] 	==== m2repo: tried
[ivy:resolve] 	  http://repo1.maven.org/maven2/org/eclipse/jetty/jetty-util/7.6.3.v20120416/jetty-util-7.6.3.v20120416.jar
[ivy:resolve] 		[FAILED     ] org.dojotoolkit#dojo-war;1.7.2!dojo-war.war: impossible to move
part file to definitive one: /home/jenkins/.ivy2/cache/org.dojotoolkit/dojo-war/wars/dojo-war-1.7.2.war.part
-> /home/jenkins/.ivy2/cache/org.dojotoolkit/dojo-war/wars/dojo-war-1.7.2.war (2070ms)
[ivy:resolve] 		[FAILED     ] org.dojotoolkit#dojo-war;1.7.2!dojo-war.war: impossible to move
part file to definitive one: /home/jenkins/.ivy2/cache/org.dojotoolkit/dojo-war/wars/dojo-war-1.7.2.war.part
-> /home/jenkins/.ivy2/cache/org.dojotoolkit/dojo-war/wars/dojo-war-1.7.2.war (2070ms)
[ivy:resolve] 	==== m2repo: tried
[ivy:resolve] 	  http://repo1.maven.org/maven2/org/dojotoolkit/dojo-war/1.7.2/dojo-war-1.7.2.war
[ivy:resolve] 		[FAILED     ] xalan#xalan;2.7.0!xalan.jar: impossible to move part file to
definitive one: /home/jenkins/.ivy2/cache/xalan/xalan/jars/xalan-2.7.0.jar.part -> /home/jenkins/.ivy2/cache/xalan/xalan/jars/xalan-2.7.0.jar
(106ms)
[ivy:resolve] 		[FAILED     ] xalan#xalan;2.7.0!xalan.jar: impossible to move part file to
definitive one: /home/jenkins/.ivy2/cache/xalan/xalan/jars/xalan-2.7.0.jar.part -> /home/jenkins/.ivy2/cache/xalan/xalan/jars/xalan-2.7.0.jar
(106ms)
[ivy:resolve] 	==== m2repo: tried
[ivy:resolve] 	  http://repo1.maven.org/maven2/xalan/xalan/2.7.0/xalan-2.7.0.jar
[ivy:resolve] 		[FAILED     ] velocity#velocity;1.4!velocity.jar: impossible to move part
file to definitive one: /home/jenkins/.ivy2/cache/velocity/velocity/jars/velocity-1.4.jar.part
-> /home/jenkins/.ivy2/cache/velocity/velocity/jars/velocity-1.4.jar (61ms)
[ivy:resolve] 		[FAILED     ] velocity#velocity;1.4!velocity.jar: impossible to move part
file to definitive one: /home/jenkins/.ivy2/cache/velocity/velocity/jars/velocity-1.4.jar.part
-> /home/jenkins/.ivy2/cache/velocity/velocity/jars/velocity-1.4.jar (61ms)
[ivy:resolve] 	==== m2repo: tried
[ivy:resolve] 	  http://repo1.maven.org/maven2/velocity/velocity/1.4/velocity-1.4.jar
[ivy:resolve] 		::::::::::::::::::::::::::::::::::::::::::::::
[ivy:resolve] 		::              FAILED DOWNLOADS            ::
[ivy:resolve] 		:: ^ see resolution messages for details  ^ ::
[ivy:resolve] 		::::::::::::::::::::::::::::::::::::::::::::::
[ivy:resolve] 		:: commons-collections#commons-collections;3.2.1!commons-collections.jar
[ivy:resolve] 		:: commons-configuration#commons-configuration;1.8!commons-configuration.jar
[ivy:resolve] 		:: commons-lang#commons-lang;2.6!commons-lang.jar
[ivy:resolve] 		:: commons-logging#commons-logging;1.1.1!commons-logging.jar
[ivy:resolve] 		:: org.apache.geronimo.framework#geronimo-kernel;2.2.1!geronimo-kernel.jar
[ivy:resolve] 		:: org.apache.geronimo.specs#geronimo-ejb_3.0_spec;1.0.1!geronimo-ejb_3.0_spec.jar
[ivy:resolve] 		:: org.apache.geronimo.specs#geronimo-jms_1.1_spec;1.0!geronimo-jms_1.1_spec.jar
[ivy:resolve] 		:: org.apache.geronimo.specs#geronimo-jta_1.1_spec;1.1.1!geronimo-jta_1.1_spec.jar
[ivy:resolve] 		:: org.apache.geronimo.specs#geronimo-servlet_2.5_spec;1.2!geronimo-servlet_2.5_spec.jar
[ivy:resolve] 		:: org.mockito#mockito-all;1.9.0!mockito-all.jar
[ivy:resolve] 		:: org.eclipse.jetty#jetty-websocket;7.6.3.v20120416!jetty-websocket.jar
[ivy:resolve] 		:: org.eclipse.jetty#jetty-io;7.6.3.v20120416!jetty-io.jar
[ivy:resolve] 		:: org.eclipse.jetty#jetty-http;7.6.3.v20120416!jetty-http.jar
[ivy:resolve] 		:: org.eclipse.jetty#jetty-security;7.6.3.v20120416!jetty-security.jar
[ivy:resolve] 		:: org.eclipse.jetty#jetty-util;7.6.3.v20120416!jetty-util.jar
[ivy:resolve] 		:: org.dojotoolkit#dojo-war;1.7.2!dojo-war.war
[ivy:resolve] 		:: xalan#xalan;2.7.0!xalan.jar
[ivy:resolve] 		:: velocity#velocity;1.4!velocity.jar
[ivy:resolve] 		::::::::::::::::::::::::::::::::::::::::::::::
[ivy:resolve] 
[ivy:resolve] :: USE VERBOSE OR DEBUG MESSAGE LEVEL FOR MORE DETAILS

BUILD FAILED
<https://builds.apache.org/job/Qpid-Java-Artefact-Release-0.22/ws/0.22/qpid/java/common.xml>:289:
impossible to resolve dependencies:
	resolve failed - see output for details

Total time: 47 seconds
Build step 'Invoke Ant' marked build as failure
Archiving artifacts

Mime
View raw message