qpid-notifications mailing list archives

Site index · List index
Message view « Date » · « Thread »
Top « Date » · « Thread »
From Apache Jenkins Server <jenk...@builds.apache.org>
Subject Build failed in Jenkins: Qpid-Java-Artefact-Release-0.20 #45
Date Sat, 05 Jan 2013 23:35:18 GMT
See <https://builds.apache.org/job/Qpid-Java-Artefact-Release-0.20/45/>

------------------------------------------
[...truncated 50 lines...]
   [delete] Deleting directory /zonestorage/hudson_solaris/home/hudson/hudson-slave/workspace/Qpid-Java-Artefact-Release-0.20/0.20/qpid/java/build/results/amqp-1-0-client-jms
     [echo] Running ant for module : tools
   [delete] Deleting: /zonestorage/hudson_solaris/home/hudson/hudson-slave/workspace/Qpid-Java-Artefact-Release-0.20/0.20/qpid/java/build/scratch/test-java-mms.0-10.properties

clean:
   [delete] Deleting directory /zonestorage/hudson_solaris/home/hudson/hudson-slave/workspace/Qpid-Java-Artefact-Release-0.20/0.20/qpid/java/build/scratch/tools
   [delete] Deleting directory /zonestorage/hudson_solaris/home/hudson/hudson-slave/workspace/Qpid-Java-Artefact-Release-0.20/0.20/qpid/java/build/results/tools
     [echo] Running ant for module : client/example
   [delete] Deleting: /zonestorage/hudson_solaris/home/hudson/hudson-slave/workspace/Qpid-Java-Artefact-Release-0.20/0.20/qpid/java/build/scratch/test-java-mms.0-10.properties

clean:
     [echo] Running ant for module : management/example
   [delete] Deleting: /zonestorage/hudson_solaris/home/hudson/hudson-slave/workspace/Qpid-Java-Artefact-Release-0.20/0.20/qpid/java/build/scratch/test-java-mms.0-10.properties

clean:
   [delete] Deleting directory /zonestorage/hudson_solaris/home/hudson/hudson-slave/workspace/Qpid-Java-Artefact-Release-0.20/0.20/qpid/java/build/scratch/management/example
   [delete] Deleting directory /zonestorage/hudson_solaris/home/hudson/hudson-slave/workspace/Qpid-Java-Artefact-Release-0.20/0.20/qpid/java/build/results/management/example
     [echo] Running ant for module : amqp-1-0-client/example
   [delete] Deleting: /zonestorage/hudson_solaris/home/hudson/hudson-slave/workspace/Qpid-Java-Artefact-Release-0.20/0.20/qpid/java/build/scratch/test-java-mms.0-10.properties

clean:
     [echo] Running ant for module : amqp-1-0-client-jms/example
   [delete] Deleting: /zonestorage/hudson_solaris/home/hudson/hudson-slave/workspace/Qpid-Java-Artefact-Release-0.20/0.20/qpid/java/build/scratch/test-java-mms.0-10.properties

clean:
     [echo] Running ant for module : jca
   [delete] Deleting: /zonestorage/hudson_solaris/home/hudson/hudson-slave/workspace/Qpid-Java-Artefact-Release-0.20/0.20/qpid/java/build/scratch/test-java-mms.0-10.properties

clean:
   [delete] Deleting directory /zonestorage/hudson_solaris/home/hudson/hudson-slave/workspace/Qpid-Java-Artefact-Release-0.20/0.20/qpid/java/build/scratch/jca
   [delete] Deleting directory /zonestorage/hudson_solaris/home/hudson/hudson-slave/workspace/Qpid-Java-Artefact-Release-0.20/0.20/qpid/java/build/results/jca
     [echo] Running ant for module : systests
   [delete] Deleting: /zonestorage/hudson_solaris/home/hudson/hudson-slave/workspace/Qpid-Java-Artefact-Release-0.20/0.20/qpid/java/build/scratch/test-java-mms.0-10.properties

clean:
   [delete] Deleting directory /zonestorage/hudson_solaris/home/hudson/hudson-slave/workspace/Qpid-Java-Artefact-Release-0.20/0.20/qpid/java/build/scratch/systests
   [delete] Deleting directory /zonestorage/hudson_solaris/home/hudson/hudson-slave/workspace/Qpid-Java-Artefact-Release-0.20/0.20/qpid/java/build/results/systests
     [echo] Running ant for module : perftests
   [delete] Deleting: /zonestorage/hudson_solaris/home/hudson/hudson-slave/workspace/Qpid-Java-Artefact-Release-0.20/0.20/qpid/java/build/scratch/test-java-mms.0-10.properties

clean:
   [delete] Deleting directory /zonestorage/hudson_solaris/home/hudson/hudson-slave/workspace/Qpid-Java-Artefact-Release-0.20/0.20/qpid/java/build/scratch/perftests
   [delete] Deleting directory /zonestorage/hudson_solaris/home/hudson/hudson-slave/workspace/Qpid-Java-Artefact-Release-0.20/0.20/qpid/java/build/results/perftests
     [echo] Running ant for module : broker-plugins/access-control
   [delete] Deleting: /zonestorage/hudson_solaris/home/hudson/hudson-slave/workspace/Qpid-Java-Artefact-Release-0.20/0.20/qpid/java/build/scratch/test-java-mms.0-10.properties

clean:
   [delete] Deleting directory /zonestorage/hudson_solaris/home/hudson/hudson-slave/workspace/Qpid-Java-Artefact-Release-0.20/0.20/qpid/java/build/scratch/broker-plugins/access-control
   [delete] Deleting directory /zonestorage/hudson_solaris/home/hudson/hudson-slave/workspace/Qpid-Java-Artefact-Release-0.20/0.20/qpid/java/build/results/broker-plugins/access-control
     [echo] Running ant for module : broker-plugins/management-http
   [delete] Deleting: /zonestorage/hudson_solaris/home/hudson/hudson-slave/workspace/Qpid-Java-Artefact-Release-0.20/0.20/qpid/java/build/scratch/test-java-mms.0-10.properties

clean:
   [delete] Deleting directory /zonestorage/hudson_solaris/home/hudson/hudson-slave/workspace/Qpid-Java-Artefact-Release-0.20/0.20/qpid/java/build/scratch/broker-plugins/management-http
   [delete] Deleting directory /zonestorage/hudson_solaris/home/hudson/hudson-slave/workspace/Qpid-Java-Artefact-Release-0.20/0.20/qpid/java/build/results/broker-plugins/management-http
     [echo] Running ant for module : broker-plugins/management-jmx
   [delete] Deleting: /zonestorage/hudson_solaris/home/hudson/hudson-slave/workspace/Qpid-Java-Artefact-Release-0.20/0.20/qpid/java/build/scratch/test-java-mms.0-10.properties

clean:
   [delete] Deleting directory /zonestorage/hudson_solaris/home/hudson/hudson-slave/workspace/Qpid-Java-Artefact-Release-0.20/0.20/qpid/java/build/scratch/broker-plugins/management-jmx
   [delete] Deleting directory /zonestorage/hudson_solaris/home/hudson/hudson-slave/workspace/Qpid-Java-Artefact-Release-0.20/0.20/qpid/java/build/results/broker-plugins/management-jmx
     [echo] Running ant for module : bdbstore
   [delete] Deleting: /zonestorage/hudson_solaris/home/hudson/hudson-slave/workspace/Qpid-Java-Artefact-Release-0.20/0.20/qpid/java/build/scratch/test-java-mms.0-10.properties

clean:
   [delete] Deleting directory /zonestorage/hudson_solaris/home/hudson/hudson-slave/workspace/Qpid-Java-Artefact-Release-0.20/0.20/qpid/java/build/scratch/bdbstore
   [delete] Deleting directory /zonestorage/hudson_solaris/home/hudson/hudson-slave/workspace/Qpid-Java-Artefact-Release-0.20/0.20/qpid/java/build/results/bdbstore
     [echo] Running ant for module : bdbstore/jmx
   [delete] Deleting: /zonestorage/hudson_solaris/home/hudson/hudson-slave/workspace/Qpid-Java-Artefact-Release-0.20/0.20/qpid/java/build/scratch/test-java-mms.0-10.properties

clean:
   [delete] Deleting directory /zonestorage/hudson_solaris/home/hudson/hudson-slave/workspace/Qpid-Java-Artefact-Release-0.20/0.20/qpid/java/build
   [delete] Deleting directory /zonestorage/hudson_solaris/home/hudson/hudson-slave/workspace/Qpid-Java-Artefact-Release-0.20/0.20/qpid/java/tasks/classes

download-ivy:

load-ivy:

configure-ivy:
[ivy:configure] :: Ivy 2.2.0 - 20100923230623 :: http://ant.apache.org/ivy/ ::
[ivy:configure] :: loading settings :: file = /zonestorage/hudson_solaris/home/hudson/hudson-slave/workspace/Qpid-Java-Artefact-Release-0.20/0.20/qpid/java/ivysettings.retrieve.xml

retrieve-optional-dependencies:

retrieve-dependencies:
     [echo] Resolving and retrieving dependencies...
[ivy:resolve] :: resolving dependencies :: org/apache#qpid;0.20
[ivy:resolve] 	confs: [required]
[ivy:resolve] 	found biz.aQute#bnd;0.0.384 in m2repo
[ivy:resolve] 	found commons-beanutils#commons-beanutils-core;1.8.3 in m2repo
[ivy:resolve] 	found commons-cli#commons-cli;1.2 in chain
[ivy:resolve] 	found commons-codec#commons-codec;1.6 in chain
[ivy:resolve] 	found commons-collections#commons-collections;3.2.1 in chain
[ivy:resolve] 	found commons-configuration#commons-configuration;1.8 in m2repo
[ivy:resolve] 	found commons-digester#commons-digester;1.8.1 in m2repo
[ivy:resolve] 	found commons-lang#commons-lang;2.6 in chain
[ivy:resolve] 	found commons-logging#commons-logging;1.1.1 in chain
[ivy:resolve] 	found org.apache.derby#derby;10.8.2.2 in chain
[ivy:resolve] 	found org.apache.geronimo.framework#geronimo-kernel;2.2.1 in m2repo
[ivy:resolve] 	found org.apache.geronimo.specs#geronimo-ejb_3.0_spec;1.0.1 in m2repo
[ivy:resolve] 	found org.apache.geronimo.specs#geronimo-j2ee-connector_1.5_spec;2.0.0 in m2repo
[ivy:resolve] 	found org.apache.geronimo.specs#geronimo-jms_1.1_spec;1.0 in m2repo
[ivy:resolve] 	found org.apache.geronimo.specs#geronimo-jta_1.1_spec;1.1.1 in m2repo
[ivy:resolve] 	found org.apache.geronimo.specs#geronimo-servlet_2.5_spec;1.2 in m2repo
[ivy:resolve] 	found com.google.code.gson#gson;2.0 in m2repo
[ivy:resolve] 	found org.codehaus.jackson#jackson-core-asl;1.9.0 in m2repo
[ivy:resolve] 	found org.codehaus.jackson#jackson-mapper-asl;1.9.0 in m2repo
[ivy:resolve] 	found net.java.dev.javacc#javacc;5.0 in m2repo
[ivy:resolve] 	found junit#junit;3.8.1 in chain
[ivy:resolve] 	found org.python#jython-standalone;2.5.2 in chain
[ivy:resolve] 	found log4j#log4j;1.2.16 in chain
[ivy:resolve] 	found org.apache.maven#maven-ant-tasks;2.1.1 in m2repo
[ivy:resolve] 	found org.mockito#mockito-all;1.9.0 in m2repo
[ivy:resolve] 	found org.slf4j#slf4j-api;1.6.4 in chain
[ivy:resolve] 	found org.slf4j#slf4j-log4j12;1.6.4 in m2repo
[ivy:resolve] 	found org.eclipse.jetty#jetty-server;7.6.3.v20120416 in m2repo
[ivy:resolve] 	found org.eclipse.jetty#jetty-websocket;7.6.3.v20120416 in m2repo
[ivy:resolve] 	found org.eclipse.jetty#jetty-continuation;7.6.3.v20120416 in m2repo
[ivy:resolve] 	found org.eclipse.jetty#jetty-io;7.6.3.v20120416 in m2repo
[ivy:resolve] 	found org.eclipse.jetty#jetty-http;7.6.3.v20120416 in m2repo
[ivy:resolve] 	found org.eclipse.jetty#jetty-security;7.6.3.v20120416 in m2repo
[ivy:resolve] 	found org.eclipse.jetty#jetty-servlet;7.6.3.v20120416 in m2repo
[ivy:resolve] 	found org.eclipse.jetty#jetty-util;7.6.3.v20120416 in m2repo
[ivy:resolve] 	found org.dojotoolkit#dojo-war;1.7.2 in m2repo
[ivy:resolve] 	found xalan#xalan;2.7.0 in chain
[ivy:resolve] :: resolution report :: resolve 5466ms :: artifacts dl 1525ms
	---------------------------------------------------------------------
	|                  |            modules            ||   artifacts   |
	|       conf       | number| search|dwnlded|evicted|| number|dwnlded|
	---------------------------------------------------------------------
	|     required     |   37  |   0   |   0   |   0   ||   37  |   0   |
	---------------------------------------------------------------------
[ivy:resolve] 
[ivy:resolve] :: problems summary ::
[ivy:resolve] :::: ERRORS
[ivy:resolve] 	unknown resolver default
[ivy:resolve] 	unknown resolver default
[ivy:resolve] 	unknown resolver default
[ivy:resolve] 	unknown resolver default
[ivy:resolve] 	unknown resolver default
[ivy:resolve] 	unknown resolver default
[ivy:resolve] 	unknown resolver default
[ivy:resolve] 	unknown resolver default
[ivy:resolve] 	unknown resolver default
[ivy:resolve] 	unknown resolver default
[ivy:resolve] 	unknown resolver default
[ivy:resolve] 	unknown resolver default
[ivy:resolve] 
[ivy:resolve] :: USE VERBOSE OR DEBUG MESSAGE LEVEL FOR MORE DETAILS
[ivy:retrieve] :: retrieving :: org/apache#qpid [sync]
[ivy:retrieve] 	confs: [required]
[ivy:retrieve] 	0 artifacts copied, 37 already retrieved (0kB/203ms)

build:
    [mkdir] Created dir: /zonestorage/hudson_solaris/home/hudson/hudson-slave/workspace/Qpid-Java-Artefact-Release-0.20/0.20/qpid/java/tasks/classes
    [javac] Compiling 5 source files to /zonestorage/hudson_solaris/home/hudson/hudson-slave/workspace/Qpid-Java-Artefact-Release-0.20/0.20/qpid/java/tasks/classes
    [javac] Note: /zonestorage/hudson_solaris/home/hudson/hudson-slave/workspace/Qpid-Java-Artefact-Release-0.20/0.20/qpid/java/tasks/src/org/apache/qpid/tasks/BaseTask.java
uses unchecked or unsafe operations.
    [javac] Note: Recompile with -Xlint:unchecked for details.
     [echo] Running ant for module : common

prepare:
    [mkdir] Created dir: /zonestorage/hudson_solaris/home/hudson/hudson-slave/workspace/Qpid-Java-Artefact-Release-0.20/0.20/qpid/java/build/bin
    [mkdir] Created dir: /zonestorage/hudson_solaris/home/hudson/hudson-slave/workspace/Qpid-Java-Artefact-Release-0.20/0.20/qpid/java/build/etc
    [mkdir] Created dir: /zonestorage/hudson_solaris/home/hudson/hudson-slave/workspace/Qpid-Java-Artefact-Release-0.20/0.20/qpid/java/build/lib
    [mkdir] Created dir: /zonestorage/hudson_solaris/home/hudson/hudson-slave/workspace/Qpid-Java-Artefact-Release-0.20/0.20/qpid/java/build/results
    [mkdir] Created dir: /zonestorage/hudson_solaris/home/hudson/hudson-slave/workspace/Qpid-Java-Artefact-Release-0.20/0.20/qpid/java/build/scratch/broker-plugins/lib
    [mkdir] Created dir: /zonestorage/hudson_solaris/home/hudson/hudson-slave/workspace/Qpid-Java-Artefact-Release-0.20/0.20/qpid/java/build/scratch/common/classes
    [mkdir] Created dir: /zonestorage/hudson_solaris/home/hudson/hudson-slave/workspace/Qpid-Java-Artefact-Release-0.20/0.20/qpid/java/build/scratch/common/src
    [mkdir] Created dir: /zonestorage/hudson_solaris/home/hudson/hudson-slave/workspace/Qpid-Java-Artefact-Release-0.20/0.20/qpid/java/build/api/common
    [mkdir] Created dir: /zonestorage/hudson_solaris/home/hudson/hudson-slave/workspace/Qpid-Java-Artefact-Release-0.20/0.20/qpid/java/build/test-api/common
    [mkdir] Created dir: /zonestorage/hudson_solaris/home/hudson/hudson-slave/workspace/Qpid-Java-Artefact-Release-0.20/0.20/qpid/java/build/scratch/common/test/classes
    [mkdir] Created dir: /zonestorage/hudson_solaris/home/hudson/hudson-slave/workspace/Qpid-Java-Artefact-Release-0.20/0.20/qpid/java/build/results/common

compile_gentools:

compile:

check_gentool_deps:

gentools:
    [mkdir] Created dir: /zonestorage/hudson_solaris/home/hudson/hudson-slave/workspace/Qpid-Java-Artefact-Release-0.20/0.20/qpid/java/build/scratch/common/src/org/apache/qpid/framing

BUILD FAILED
/zonestorage/hudson_solaris/home/hudson/hudson-slave/workspace/Qpid-Java-Artefact-Release-0.20/0.20/qpid/java/build.xml:170:
The following error occurred while executing this line:
/zonestorage/hudson_solaris/home/hudson/hudson-slave/workspace/Qpid-Java-Artefact-Release-0.20/0.20/qpid/java/build.xml:65:
The following error occurred while executing this line:
/zonestorage/hudson_solaris/home/hudson/hudson-slave/workspace/Qpid-Java-Artefact-Release-0.20/0.20/qpid/java/common/build.xml:67:
java.io.IOException: Cannot run program "/zonestorage/hudson_solaris/home/hudson/tools/java/jdk1.6.0_22/jre/bin/java"
(in directory "/zonestorage/hudson_solaris/home/hudson/hudson-slave/workspace/Qpid-Java-Artefact-Release-0.20/0.20/qpid/gentools/src"):
error=12, Not enough space
	at java.lang.ProcessBuilder.start(ProcessBuilder.java:460)
	at java.lang.Runtime.exec(Runtime.java:593)
	at org.apache.tools.ant.taskdefs.Execute$Java13CommandLauncher.exec(Execute.java:862)
	at org.apache.tools.ant.taskdefs.Execute.launch(Execute.java:481)
	at org.apache.tools.ant.taskdefs.Execute.execute(Execute.java:495)
	at org.apache.tools.ant.taskdefs.Java.fork(Java.java:791)
	at org.apache.tools.ant.taskdefs.Java.executeJava(Java.java:214)
	at org.apache.tools.ant.taskdefs.Java.executeJava(Java.java:135)
	at org.apache.tools.ant.taskdefs.Java.execute(Java.java:108)
	at org.apache.tools.ant.UnknownElement.execute(UnknownElement.java:291)
	at sun.reflect.GeneratedMethodAccessor4.invoke(Unknown Source)
	at sun.reflect.DelegatingMethodAccessorImpl.invoke(DelegatingMethodAccessorImpl.java:25)
	at java.lang.reflect.Method.invoke(Method.java:597)
	at org.apache.tools.ant.dispatch.DispatchUtils.execute(DispatchUtils.java:106)
	at org.apache.tools.ant.Task.perform(Task.java:348)
	at org.apache.tools.ant.Target.execute(Target.java:390)
	at org.apache.tools.ant.Target.performTasks(Target.java:411)
	at org.apache.tools.ant.Project.executeSortedTargets(Project.java:1399)
	at org.apache.tools.ant.helper.SingleCheckExecutor.executeTargets(SingleCheckExecutor.java:38)
	at org.apache.tools.ant.Project.executeTargets(Project.java:1251)
	at org.apache.tools.ant.taskdefs.Ant.execute(Ant.java:442)
	at org.apache.tools.ant.taskdefs.SubAnt.execute(SubAnt.java:302)
	at org.apache.tools.ant.taskdefs.SubAnt.execute(SubAnt.java:221)
	at org.apache.tools.ant.UnknownElement.execute(UnknownElement.java:291)
	at sun.reflect.GeneratedMethodAccessor4.invoke(Unknown Source)
	at sun.reflect.DelegatingMethodAccessorImpl.invoke(DelegatingMethodAccessorImpl.java:25)
	at java.lang.reflect.Method.invoke(Method.java:597)
	at org.apache.tools.ant.dispatch.DispatchUtils.execute(DispatchUtils.java:106)
	at org.apache.tools.ant.Task.perform(Task.java:348)
	at org.apache.tools.ant.taskdefs.Sequential.execute(Sequential.java:68)
	at org.apache.tools.ant.UnknownElement.execute(UnknownElement.java:291)
	at sun.reflect.GeneratedMethodAccessor4.invoke(Unknown Source)
	at sun.reflect.DelegatingMethodAccessorImpl.invoke(DelegatingMethodAccessorImpl.java:25)
	at java.lang.reflect.Method.invoke(Method.java:597)
	at org.apache.tools.ant.dispatch.DispatchUtils.execute(DispatchUtils.java:106)
	at org.apache.tools.ant.Task.perform(Task.java:348)
	at org.apache.tools.ant.taskdefs.MacroInstance.execute(MacroInstance.java:398)
	at org.apache.tools.ant.UnknownElement.execute(UnknownElement.java:291)
	at sun.reflect.GeneratedMethodAccessor4.invoke(Unknown Source)
	at sun.reflect.DelegatingMethodAccessorImpl.invoke(DelegatingMethodAccessorImpl.java:25)
	at java.lang.reflect.Method.invoke(Method.java:597)
	at org.apache.tools.ant.dispatch.DispatchUtils.execute(DispatchUtils.java:106)
	at org.apache.tools.ant.Task.perform(Task.java:348)
	at org.apache.tools.ant.Target.execute(Target.java:390)
	at org.apache.tools.ant.Target.performTasks(Target.java:411)
	at org.apache.tools.ant.Project.executeSortedTargets(Project.java:1399)
	at org.apache.tools.ant.Project.executeTarget(Project.java:1368)
	at org.apache.tools.ant.helper.DefaultExecutor.executeTargets(DefaultExecutor.java:41)
	at org.apache.tools.ant.Project.executeTargets(Project.java:1251)
	at org.apache.tools.ant.Main.runBuild(Main.java:809)
	at org.apache.tools.ant.Main.startAnt(Main.java:217)
	at org.apache.tools.ant.launch.Launcher.run(Launcher.java:280)
	at org.apache.tools.ant.launch.Launcher.main(Launcher.java:109)
Caused by: java.io.IOException: error=12, Not enough space
	at java.lang.UNIXProcess.forkAndExec(Native Method)
	at java.lang.UNIXProcess.<init>(UNIXProcess.java:53)
	at java.lang.ProcessImpl.start(ProcessImpl.java:65)
	at java.lang.ProcessBuilder.start(ProcessBuilder.java:453)
	... 52 more

Total time: 1 minute 35 seconds
Build step 'Invoke Ant' marked build as failure
Archiving artifacts

Mime
View raw message