qpid-notifications mailing list archives

Site index · List index
Message view « Date » · « Thread »
Top « Date » · « Thread »
From Apache Jenkins Server <jenk...@builds.apache.org>
Subject Build failed in Jenkins: Qpid-Java-Artefact-Release-0.20 #43
Date Thu, 03 Jan 2013 23:43:33 GMT
See <https://builds.apache.org/job/Qpid-Java-Artefact-Release-0.20/43/>

------------------------------------------
[...truncated 160 lines...]
[ivy:resolve] 	found org.apache.derby#derby;10.8.2.2 in chain
[ivy:resolve] 	found org.apache.geronimo.framework#geronimo-kernel;2.2.1 in m2repo
[ivy:resolve] 	found org.apache.geronimo.specs#geronimo-ejb_3.0_spec;1.0.1 in m2repo
[ivy:resolve] 	found org.apache.geronimo.specs#geronimo-j2ee-connector_1.5_spec;2.0.0 in m2repo
[ivy:resolve] 	found org.apache.geronimo.specs#geronimo-jms_1.1_spec;1.0 in m2repo
[ivy:resolve] 	found org.apache.geronimo.specs#geronimo-jta_1.1_spec;1.1.1 in m2repo
[ivy:resolve] 	found org.apache.geronimo.specs#geronimo-servlet_2.5_spec;1.2 in m2repo
[ivy:resolve] 	found com.google.code.gson#gson;2.0 in m2repo
[ivy:resolve] 	found org.codehaus.jackson#jackson-core-asl;1.9.0 in m2repo
[ivy:resolve] 	found org.codehaus.jackson#jackson-mapper-asl;1.9.0 in m2repo
[ivy:resolve] 	found net.java.dev.javacc#javacc;5.0 in m2repo
[ivy:resolve] 	found junit#junit;3.8.1 in chain
[ivy:resolve] 	found org.python#jython-standalone;2.5.2 in chain
[ivy:resolve] 	found log4j#log4j;1.2.16 in chain
[ivy:resolve] 	found org.apache.maven#maven-ant-tasks;2.1.1 in m2repo
[ivy:resolve] 	found org.mockito#mockito-all;1.9.0 in m2repo
[ivy:resolve] 	found org.slf4j#slf4j-api;1.6.4 in chain
[ivy:resolve] 	found org.slf4j#slf4j-log4j12;1.6.4 in m2repo
[ivy:resolve] 	found org.eclipse.jetty#jetty-server;7.6.3.v20120416 in m2repo
[ivy:resolve] 	found org.eclipse.jetty#jetty-websocket;7.6.3.v20120416 in m2repo
[ivy:resolve] 	found org.eclipse.jetty#jetty-continuation;7.6.3.v20120416 in m2repo
[ivy:resolve] 	found org.eclipse.jetty#jetty-io;7.6.3.v20120416 in m2repo
[ivy:resolve] 	found org.eclipse.jetty#jetty-http;7.6.3.v20120416 in m2repo
[ivy:resolve] 	found org.eclipse.jetty#jetty-security;7.6.3.v20120416 in m2repo
[ivy:resolve] 	found org.eclipse.jetty#jetty-servlet;7.6.3.v20120416 in m2repo
[ivy:resolve] 	found org.eclipse.jetty#jetty-util;7.6.3.v20120416 in m2repo
[ivy:resolve] 	found org.dojotoolkit#dojo-war;1.7.2 in m2repo
[ivy:resolve] 	found xalan#xalan;2.7.0 in chain
[ivy:resolve] :: resolution report :: resolve 6381ms :: artifacts dl 785ms
	---------------------------------------------------------------------
	|                  |            modules            ||   artifacts   |
	|       conf       | number| search|dwnlded|evicted|| number|dwnlded|
	---------------------------------------------------------------------
	|     required     |   37  |   0   |   0   |   0   ||   37  |   0   |
	---------------------------------------------------------------------
[ivy:retrieve] :: retrieving :: org/apache#qpid [sync]
[ivy:retrieve] 	confs: [required]
[ivy:retrieve] 	0 artifacts copied, 37 already retrieved (0kB/15ms)

build:
    [mkdir] Created dir: /zonestorage/hudson_solaris/home/hudson/hudson-slave/workspace/Qpid-Java-Artefact-Release-0.20/0.20/qpid/java/tasks/classes
    [javac] Compiling 5 source files to /zonestorage/hudson_solaris/home/hudson/hudson-slave/workspace/Qpid-Java-Artefact-Release-0.20/0.20/qpid/java/tasks/classes
    [javac] Note: /zonestorage/hudson_solaris/home/hudson/hudson-slave/workspace/Qpid-Java-Artefact-Release-0.20/0.20/qpid/java/tasks/src/org/apache/qpid/tasks/BaseTask.java
uses unchecked or unsafe operations.
    [javac] Note: Recompile with -Xlint:unchecked for details.
     [echo] Running ant for module : common

prepare:
    [mkdir] Created dir: /zonestorage/hudson_solaris/home/hudson/hudson-slave/workspace/Qpid-Java-Artefact-Release-0.20/0.20/qpid/java/build/bin
    [mkdir] Created dir: /zonestorage/hudson_solaris/home/hudson/hudson-slave/workspace/Qpid-Java-Artefact-Release-0.20/0.20/qpid/java/build/etc
    [mkdir] Created dir: /zonestorage/hudson_solaris/home/hudson/hudson-slave/workspace/Qpid-Java-Artefact-Release-0.20/0.20/qpid/java/build/lib
    [mkdir] Created dir: /zonestorage/hudson_solaris/home/hudson/hudson-slave/workspace/Qpid-Java-Artefact-Release-0.20/0.20/qpid/java/build/results
    [mkdir] Created dir: /zonestorage/hudson_solaris/home/hudson/hudson-slave/workspace/Qpid-Java-Artefact-Release-0.20/0.20/qpid/java/build/scratch/broker-plugins/lib
    [mkdir] Created dir: /zonestorage/hudson_solaris/home/hudson/hudson-slave/workspace/Qpid-Java-Artefact-Release-0.20/0.20/qpid/java/build/scratch/common/classes
    [mkdir] Created dir: /zonestorage/hudson_solaris/home/hudson/hudson-slave/workspace/Qpid-Java-Artefact-Release-0.20/0.20/qpid/java/build/scratch/common/src
    [mkdir] Created dir: /zonestorage/hudson_solaris/home/hudson/hudson-slave/workspace/Qpid-Java-Artefact-Release-0.20/0.20/qpid/java/build/api/common
    [mkdir] Created dir: /zonestorage/hudson_solaris/home/hudson/hudson-slave/workspace/Qpid-Java-Artefact-Release-0.20/0.20/qpid/java/build/test-api/common
    [mkdir] Created dir: /zonestorage/hudson_solaris/home/hudson/hudson-slave/workspace/Qpid-Java-Artefact-Release-0.20/0.20/qpid/java/build/scratch/common/test/classes
    [mkdir] Created dir: /zonestorage/hudson_solaris/home/hudson/hudson-slave/workspace/Qpid-Java-Artefact-Release-0.20/0.20/qpid/java/build/results/common

compile_gentools:

compile:

check_gentool_deps:

gentools:
    [mkdir] Created dir: /zonestorage/hudson_solaris/home/hudson/hudson-slave/workspace/Qpid-Java-Artefact-Release-0.20/0.20/qpid/java/build/scratch/common/src/org/apache/qpid/framing
     [java] XML files: [/zonestorage/hudson_solaris/home/hudson/hudson-slave/workspace/Qpid-Java-Artefact-Release-0.20/0.20/qpid/specs/amqp.0-8.xml,
/zonestorage/hudson_solaris/home/hudson/hudson-slave/workspace/Qpid-Java-Artefact-Release-0.20/0.20/qpid/specs/amqp.0-9.xml,
/zonestorage/hudson_solaris/home/hudson/hudson-slave/workspace/Qpid-Java-Artefact-Release-0.20/0.20/qpid/specs/amqp0-9-1.stripped.xml]
     [java]   "/zonestorage/hudson_solaris/home/hudson/hudson-slave/workspace/Qpid-Java-Artefact-Release-0.20/0.20/qpid/specs/amqp.0-8.xml":
Found version 8-0.
     [java]   "/zonestorage/hudson_solaris/home/hudson/hudson-slave/workspace/Qpid-Java-Artefact-Release-0.20/0.20/qpid/specs/amqp.0-9.xml":
Found version 0-9.
     [java]   "/zonestorage/hudson_solaris/home/hudson/hudson-slave/workspace/Qpid-Java-Artefact-Release-0.20/0.20/qpid/specs/amqp0-9-1.stripped.xml":
Found version 0-91.
     [java] Looking for template files in directory: /zonestorage/hudson_solaris/home/hudson/hudson-slave/workspace/Qpid-Java-Artefact-Release-0.20/0.20/qpid/java/common/templates/model
     [java] Looking for version specific template files in directory: /zonestorage/hudson_solaris/home/hudson/hudson-slave/workspace/Qpid-Java-Artefact-Release-0.20/0.20/qpid/java/common/templates/model/version
     [java] model template file(s):
     [java]   /zonestorage/hudson_solaris/home/hudson/hudson-slave/workspace/Qpid-Java-Artefact-Release-0.20/0.20/qpid/java/common/templates/model/ServerMethodDispatcherInterface.vm
     [java] model template file(s):
     [java]   /zonestorage/hudson_solaris/home/hudson/hudson-slave/workspace/Qpid-Java-Artefact-Release-0.20/0.20/qpid/java/common/templates/model/ProtocolVersionListClass.vm
     [java] model template file(s):
     [java]   /zonestorage/hudson_solaris/home/hudson/hudson-slave/workspace/Qpid-Java-Artefact-Release-0.20/0.20/qpid/java/common/templates/model/MethodDispatcherInterface.vm
     [java] model template file(s):
     [java]   /zonestorage/hudson_solaris/home/hudson/hudson-slave/workspace/Qpid-Java-Artefact-Release-0.20/0.20/qpid/java/common/templates/model/ClientMethodDispatcherInterface.vm
     [java] model template file(s):
     [java]   /zonestorage/hudson_solaris/home/hudson/hudson-slave/workspace/Qpid-Java-Artefact-Release-0.20/0.20/qpid/java/common/templates/model/MethodRegistryClass.vm
     [java] model template file(s):
     [java]   /zonestorage/hudson_solaris/home/hudson/hudson-slave/workspace/Qpid-Java-Artefact-Release-0.20/0.20/qpid/java/common/templates/model/version/ClientMethodDispatcherInterface.vm
     [java] model template file(s):
     [java]   /zonestorage/hudson_solaris/home/hudson/hudson-slave/workspace/Qpid-Java-Artefact-Release-0.20/0.20/qpid/java/common/templates/model/version/MethodRegistryClass.vm
     [java] model template file(s):
     [java]   /zonestorage/hudson_solaris/home/hudson/hudson-slave/workspace/Qpid-Java-Artefact-Release-0.20/0.20/qpid/java/common/templates/model/version/AmqpConstantsClass.vm
     [java] model template file(s):
     [java]   /zonestorage/hudson_solaris/home/hudson/hudson-slave/workspace/Qpid-Java-Artefact-Release-0.20/0.20/qpid/java/common/templates/model/version/ServerMethodDispatcherInterface.vm
     [java] model template file(s):
     [java]   /zonestorage/hudson_solaris/home/hudson/hudson-slave/workspace/Qpid-Java-Artefact-Release-0.20/0.20/qpid/java/common/templates/model/version/MethodDispatcherInterface.vm
     [java] Looking for template files in directory: /zonestorage/hudson_solaris/home/hudson/hudson-slave/workspace/Qpid-Java-Artefact-Release-0.20/0.20/qpid/java/common/templates/class
     [java] Looking for version specific template files in directory: /zonestorage/hudson_solaris/home/hudson/hudson-slave/workspace/Qpid-Java-Artefact-Release-0.20/0.20/qpid/java/common/templates/class/version
     [java] Looking for template files in directory: /zonestorage/hudson_solaris/home/hudson/hudson-slave/workspace/Qpid-Java-Artefact-Release-0.20/0.20/qpid/java/common/templates/method
     [java] Looking for version specific template files in directory: /zonestorage/hudson_solaris/home/hudson/hudson-slave/workspace/Qpid-Java-Artefact-Release-0.20/0.20/qpid/java/common/templates/method/version
     [java] method template file(s):
     [java]   /zonestorage/hudson_solaris/home/hudson/hudson-slave/workspace/Qpid-Java-Artefact-Release-0.20/0.20/qpid/java/common/templates/method/MethodBodyInterface.vm
     [java] method template file(s):
     [java]   /zonestorage/hudson_solaris/home/hudson/hudson-slave/workspace/Qpid-Java-Artefact-Release-0.20/0.20/qpid/java/common/templates/method/version/MethodBodyClass.vm
     [java] Looking for template files in directory: /zonestorage/hudson_solaris/home/hudson/hudson-slave/workspace/Qpid-Java-Artefact-Release-0.20/0.20/qpid/java/common/templates/field
     [java] Looking for version specific template files in directory: /zonestorage/hudson_solaris/home/hudson/hudson-slave/workspace/Qpid-Java-Artefact-Release-0.20/0.20/qpid/java/common/templates/field/version
     [java] Generation directory: /zonestorage/hudson_solaris/home/hudson/hudson-slave/workspace/Qpid-Java-Artefact-Release-0.20/0.20/qpid/java/build/scratch/common/src/org/apache/qpid/framing
     [java] Files generated: 0
     [java] Done.
    [touch] Creating /zonestorage/hudson_solaris/home/hudson/hudson-slave/workspace/Qpid-Java-Artefact-Release-0.20/0.20/qpid/java/build/scratch/common/src/org/apache/qpid/framing/gentools.timestamp

check_jython_deps:

jython:
    [touch] Creating /zonestorage/hudson_solaris/home/hudson/hudson-slave/workspace/Qpid-Java-Artefact-Release-0.20/0.20/qpid/java/build/scratch/common/src/org/apache/qpid/framing/jython.timestamp

check-version:

create-version:

build-version:

jms-selector:
     [copy] Copying 1 file to /zonestorage/hudson_solaris/home/hudson/hudson-slave/workspace/Qpid-Java-Artefact-Release-0.20/0.20/qpid/java/build/scratch/common
    [mkdir] Created dir: /zonestorage/hudson_solaris/home/hudson/hudson-slave/workspace/Qpid-Java-Artefact-Release-0.20/0.20/qpid/java/build/scratch/common/src/org/apache/qpid/filter/selector
   [javacc] Java Compiler Compiler Version 5.0 (Parser Generator)
   [javacc] (type "javacc" with no arguments for help)
   [javacc] Reading from file /zonestorage/hudson_solaris/home/hudson/hudson-slave/workspace/Qpid-Java-Artefact-Release-0.20/0.20/qpid/java/common/src/main/grammar/SelectorParser.jj
. . .
   [javacc] Note: UNICODE_INPUT option is specified. Please make sure you create the parser/lexer
using a Reader with the correct character encoding.
   [javacc] File "TokenMgrError.java" does not exist.  Will create one.
   [javacc] File "ParseException.java" does not exist.  Will create one.
   [javacc] File "Token.java" does not exist.  Will create one.
   [javacc] File "SimpleCharStream.java" does not exist.  Will create one.
   [javacc] Parser generated successfully.

precompile:

compile:
     [echo] Targeting : 1.5
    [javac] Compiling 705 source files to /zonestorage/hudson_solaris/home/hudson/hudson-slave/workspace/Qpid-Java-Artefact-Release-0.20/0.20/qpid/java/build/scratch/common/classes
    [javac] Note: Some input files use or override a deprecated API.
    [javac] Note: Recompile with -Xlint:deprecation for details.
    [javac] Note: Some input files use unchecked or unsafe operations.
    [javac] Note: Recompile with -Xlint:unchecked for details.
     [copy] Copying 1 file to /zonestorage/hudson_solaris/home/hudson/hudson-slave/workspace/Qpid-Java-Artefact-Release-0.20/0.20/qpid/java/build/scratch/common/classes
     [copy] Copying /zonestorage/hudson_solaris/home/hudson/hudson-slave/workspace/Qpid-Java-Artefact-Release-0.20/0.20/qpid/java/common/src/main/java/common.bnd
to /zonestorage/hudson_solaris/home/hudson/hudson-slave/workspace/Qpid-Java-Artefact-Release-0.20/0.20/qpid/java/build/scratch/common/classes/common.bnd

copy-metainf-resources:
     [copy] Copying 3 files to /zonestorage/hudson_solaris/home/hudson/hudson-slave/workspace/Qpid-Java-Artefact-Release-0.20/0.20/qpid/java/build/scratch/common/META-INF
     [copy] Warning: /zonestorage/hudson_solaris/home/hudson/hudson-slave/workspace/Qpid-Java-Artefact-Release-0.20/0.20/qpid/java/common/resources
does not exist.

copy-module-metainf:

jar.manifest:

jar.nomanifest:
      [jar] Building jar: /zonestorage/hudson_solaris/home/hudson/hudson-slave/workspace/Qpid-Java-Artefact-Release-0.20/0.20/qpid/java/build/lib/qpid-common-0.20.jar

jar:

precompile-tests:

compile-tests:
    [javac] Compiling 31 source files to /zonestorage/hudson_solaris/home/hudson/hudson-slave/workspace/Qpid-Java-Artefact-Release-0.20/0.20/qpid/java/build/scratch/common/test/classes
    [javac] Note: /zonestorage/hudson_solaris/home/hudson/hudson-slave/workspace/Qpid-Java-Artefact-Release-0.20/0.20/qpid/java/common/src/test/java/org/apache/qpid/codec/MockAMQVersionAwareProtocolSession.java
uses or overrides a deprecated API.
    [javac] Note: Recompile with -Xlint:deprecation for details.
    [javac] Note: /zonestorage/hudson_solaris/home/hudson/hudson-slave/workspace/Qpid-Java-Artefact-Release-0.20/0.20/qpid/java/common/src/test/java/org/apache/qpid/transport/ConnectionTest.java
uses unchecked or unsafe operations.
    [javac] Note: Recompile with -Xlint:unchecked for details.
     [copy] Copying 2 files to /zonestorage/hudson_solaris/home/hudson/hudson-slave/workspace/Qpid-Java-Artefact-Release-0.20/0.20/qpid/java/build/scratch/common/test/classes
     [copy] Copying /zonestorage/hudson_solaris/home/hudson/hudson-slave/workspace/Qpid-Java-Artefact-Release-0.20/0.20/qpid/java/common/src/test/java/org/apache/qpid/util/default.properties
to /zonestorage/hudson_solaris/home/hudson/hudson-slave/workspace/Qpid-Java-Artefact-Release-0.20/0.20/qpid/java/build/scratch/common/test/classes/org/apache/qpid/util/default.properties
     [copy] Copying /zonestorage/hudson_solaris/home/hudson/hudson-slave/workspace/Qpid-Java-Artefact-Release-0.20/0.20/qpid/java/common/src/test/java/org/apache/qpid/util/mydefaults.properties
to /zonestorage/hudson_solaris/home/hudson/hudson-slave/workspace/Qpid-Java-Artefact-Release-0.20/0.20/qpid/java/build/scratch/common/test/classes/org/apache/qpid/util/mydefaults.properties

jar-tests:
      [jar] Building jar: /zonestorage/hudson_solaris/home/hudson/hudson-slave/workspace/Qpid-Java-Artefact-Release-0.20/0.20/qpid/java/build/lib/qpid-common-tests-0.20.jar

jar-sources:
      [jar] Building jar: /zonestorage/hudson_solaris/home/hudson/hudson-slave/workspace/Qpid-Java-Artefact-Release-0.20/0.20/qpid/java/build/lib/qpid-common-0.20-sources.jar

libs:
     [copy] Copying 1 file to /zonestorage/hudson_solaris/home/hudson/hudson-slave/workspace/Qpid-Java-Artefact-Release-0.20/0.20/qpid/java/build/lib

copy-bin:
     [copy] Copying 2 files to /zonestorage/hudson_solaris/home/hudson/hudson-slave/workspace/Qpid-Java-Artefact-Release-0.20/0.20/qpid/java/build/bin

BUILD FAILED
/zonestorage/hudson_solaris/home/hudson/hudson-slave/workspace/Qpid-Java-Artefact-Release-0.20/0.20/qpid/java/build.xml:170:
The following error occurred while executing this line:
/zonestorage/hudson_solaris/home/hudson/hudson-slave/workspace/Qpid-Java-Artefact-Release-0.20/0.20/qpid/java/build.xml:65:
The following error occurred while executing this line:
/zonestorage/hudson_solaris/home/hudson/hudson-slave/workspace/Qpid-Java-Artefact-Release-0.20/0.20/qpid/java/module.xml:473:
Execute failed: java.io.IOException: Cannot run program "chmod" (in directory "/zonestorage/hudson_solaris/home/hudson/hudson-slave/workspace/Qpid-Java-Artefact-Release-0.20/0.20/qpid/java/common"):
error=12, Not enough space
	at java.lang.ProcessBuilder.start(ProcessBuilder.java:460)
	at java.lang.Runtime.exec(Runtime.java:593)
	at org.apache.tools.ant.taskdefs.Execute$Java13CommandLauncher.exec(Execute.java:862)
	at org.apache.tools.ant.taskdefs.Execute.launch(Execute.java:481)
	at org.apache.tools.ant.taskdefs.Execute.execute(Execute.java:495)
	at org.apache.tools.ant.taskdefs.ExecTask.runExecute(ExecTask.java:631)
	at org.apache.tools.ant.taskdefs.ExecuteOn.runParallel(ExecuteOn.java:716)
	at org.apache.tools.ant.taskdefs.ExecuteOn.runExec(ExecuteOn.java:479)
	at org.apache.tools.ant.taskdefs.ExecTask.execute(ExecTask.java:498)
	at org.apache.tools.ant.taskdefs.Chmod.execute(Chmod.java:181)
	at org.apache.tools.ant.UnknownElement.execute(UnknownElement.java:291)
	at sun.reflect.GeneratedMethodAccessor4.invoke(Unknown Source)
	at sun.reflect.DelegatingMethodAccessorImpl.invoke(DelegatingMethodAccessorImpl.java:25)
	at java.lang.reflect.Method.invoke(Method.java:597)
	at org.apache.tools.ant.dispatch.DispatchUtils.execute(DispatchUtils.java:106)
	at org.apache.tools.ant.Task.perform(Task.java:348)
	at org.apache.tools.ant.Target.execute(Target.java:390)
	at org.apache.tools.ant.Target.performTasks(Target.java:411)
	at org.apache.tools.ant.Project.executeSortedTargets(Project.java:1399)
	at org.apache.tools.ant.helper.SingleCheckExecutor.executeTargets(SingleCheckExecutor.java:38)
	at org.apache.tools.ant.Project.executeTargets(Project.java:1251)
	at org.apache.tools.ant.taskdefs.Ant.execute(Ant.java:442)
	at org.apache.tools.ant.taskdefs.SubAnt.execute(SubAnt.java:302)
	at org.apache.tools.ant.taskdefs.SubAnt.execute(SubAnt.java:221)
	at org.apache.tools.ant.UnknownElement.execute(UnknownElement.java:291)
	at sun.reflect.GeneratedMethodAccessor4.invoke(Unknown Source)
	at sun.reflect.DelegatingMethodAccessorImpl.invoke(DelegatingMethodAccessorImpl.java:25)
	at java.lang.reflect.Method.invoke(Method.java:597)
	at org.apache.tools.ant.dispatch.DispatchUtils.execute(DispatchUtils.java:106)
	at org.apache.tools.ant.Task.perform(Task.java:348)
	at org.apache.tools.ant.taskdefs.Sequential.execute(Sequential.java:68)
	at org.apache.tools.ant.UnknownElement.execute(UnknownElement.java:291)
	at sun.reflect.GeneratedMethodAccessor4.invoke(Unknown Source)
	at sun.reflect.DelegatingMethodAccessorImpl.invoke(DelegatingMethodAccessorImpl.java:25)
	at java.lang.reflect.Method.invoke(Method.java:597)
	at org.apache.tools.ant.dispatch.DispatchUtils.execute(DispatchUtils.java:106)
	at org.apache.tools.ant.Task.perform(Task.java:348)
	at org.apache.tools.ant.taskdefs.MacroInstance.execute(MacroInstance.java:398)
	at org.apache.tools.ant.UnknownElement.execute(UnknownElement.java:291)
	at sun.reflect.GeneratedMethodAccessor4.invoke(Unknown Source)
	at sun.reflect.DelegatingMethodAccessorImpl.invoke(DelegatingMethodAccessorImpl.java:25)
	at java.lang.reflect.Method.invoke(Method.java:597)
	at org.apache.tools.ant.dispatch.DispatchUtils.execute(DispatchUtils.java:106)
	at org.apache.tools.ant.Task.perform(Task.java:348)
	at org.apache.tools.ant.Target.execute(Target.java:390)
	at org.apache.tools.ant.Target.performTasks(Target.java:411)
	at org.apache.tools.ant.Project.executeSortedTargets(Project.java:1399)
	at org.apache.tools.ant.Project.executeTarget(Project.java:1368)
	at org.apache.tools.ant.helper.DefaultExecutor.executeTargets(DefaultExecutor.java:41)
	at org.apache.tools.ant.Project.executeTargets(Project.java:1251)
	at org.apache.tools.ant.Main.runBuild(Main.java:809)
	at org.apache.tools.ant.Main.startAnt(Main.java:217)
	at org.apache.tools.ant.launch.Launcher.run(Launcher.java:280)
	at org.apache.tools.ant.launch.Launcher.main(Launcher.java:109)
Caused by: java.io.IOException: error=12, Not enough space
	at java.lang.UNIXProcess.forkAndExec(Native Method)
	at java.lang.UNIXProcess.<init>(UNIXProcess.java:53)
	at java.lang.ProcessImpl.start(ProcessImpl.java:65)
	at java.lang.ProcessBuilder.start(ProcessBuilder.java:453)
	... 53 more

Total time: 2 minutes 26 seconds
Build step 'Invoke Ant' marked build as failure
Archiving artifacts

Mime
View raw message