qpid-notifications mailing list archives

Site index · List index
Message view « Date » · « Thread »
Top « Date » · « Thread »
From Apache Jenkins Server <jenk...@builds.apache.org>
Subject Build failed in Jenkins: Qpid-Java-Java-BDB-TestMatrix » JDK 1.6 (latest),Ubuntu,java-bdb.0-9-1 #672
Date Wed, 12 Dec 2012 10:45:53 GMT
See <https://builds.apache.org/job/Qpid-Java-Java-BDB-TestMatrix/./jdk=JDK%201.6%20(latest),label=Ubuntu,profile=java-bdb.0-9-1/672/changes>

Changes:

[aconway] QPID-4481: HA replication of propagated bindings can lead to incorrect configuration

When using dynamic federation between two independent HA broker clusters, it is
possible under certain failover scenarios for the propagated bindings on the
source broker to become out-of-sync with the true state of bindings on the
destination broker.

How reproducible:
Often -- race condition between re-establishment of federated link and the deletion of a binding
on the destination broker

Steps to Reproduce:
1. Start a stand-alone broker (route destination) and an HA broker (route source w/ primary
and backup)
2. Configure a dynamic federated route between a destination broker and a source broker. 
The dynamic federation needs to utilize an existing, non-auto-delete queue on the source broker.
3. Subscribe to an auto-delete queue on the destination broker and bind the auto-delete queue
to the exchange configured for the dynamic federation
4. Kill the primary source broker
5. Kill the subscription to the auto-delete queue on the destination broker
6. Promote the backup source broker to primary

Actual results:
With the loss of the client subscription to the auto-delete queue, the binding will be removed.
 If the binding is removed prior to the re-establishment of the federated link to the source
broker, the unbind command will not propagate.  Since the backup source broker had previously
replicated the propagated binding, the binding will incorrectly remain on the source broker.

Expected results:
Propagated bindings should not be replicated from the primary to backups since they are transient
and will be recreated when the route is re-established.)))

[mcpierce] QPID-4499: Installs qpid.i, qmfengine.i and qmf2.i into include directory.

The three files are needed by the language bindings and so should be
delivered as a part of the installation of Qpid.

------------------------------------------
[...truncated 3733 lines...]
    [junit]     <property name="preload.broker.command" value="build/bin/qpid-server -p
@PORT -m @MPORT @EXCLUDES @INCLUDES -c @CONFIG_FILE -l @LOG_CONFIG_FILE" />
    [junit]     <property name="broker.existing.qpid.work" value="" />
    [junit]     <property name="user.language" value="en" />
    [junit]     <property name="module.libs" value="lib/required/geronimo-jms_1.1_spec-1.0.jar
lib/required/slf4j-api-1.6.4.jar lib/required/log4j-1.2.16.jar lib/required/slf4j-log4j12-1.6.4.jar
lib/required/commons-logging-1.1.1.jar lib/required/commons-collections-3.2.1.jar lib/required/commons-beanutils-core-1.8.3.jar
lib/required/commons-lang-2.6.jar lib/required/gson-2.0.jar" />
    [junit]     <property name="jackson-core" value="lib/required/jackson-core-asl-1.9.0.jar"
/>
    [junit]     <property name="build.findbugs" value="<https://builds.apache.org/job/Qpid-Java-Java-BDB-TestMatrix/./jdk=JDK%201.6%20(latest),label=Ubuntu,profile=java-bdb.0-9-1/ws/trunk/qpid/java/build/findbugs">
/>
    [junit]     <property name="preload.include" value="" />
    [junit]     <property name="module.test.depends" value="systests broker common/tests
management/common bdbstore" />
    [junit]     <property name="ant.file.Performance Tests" value="<https://builds.apache.org/job/Qpid-Java-Java-BDB-TestMatrix/./jdk=JDK%201.6%20(latest),label=Ubuntu,profile=java-bdb.0-9-1/ws/trunk/qpid/java/perftests/build.xml">
/>
    [junit]     <property name="ant.project.invoked-targets" value="test" />
    [junit]     <property name="java.class.version" value="50.0" />
    [junit]     <property name="ant.file.type.AMQ Java" value="file" />
    [junit]     <property name="profile.clustered" value="false" />
    [junit]     <property name="broker.persistent" value="true" />
    [junit]     <property name="ant.file.AMQ Java" value="<https://builds.apache.org/job/Qpid-Java-Java-BDB-TestMatrix/./jdk=JDK%201.6%20(latest),label=Ubuntu,profile=java-bdb.0-9-1/ws/trunk/qpid/java/build.xml">
/>
    [junit]     <property name="broker.log.prefix" value="BROKER: " />
    [junit]     <property name="module.test.libs.includes" value="lib/required/slf4j-log4j12-1.6.4.jar
lib/required/log4j-1.2.16.jar lib/required/junit-3.8.1.jar lib/required/slf4j-api-1.6.4.jar
lib/required/mockito-all-1.9.0.jar" />
    [junit]     <property name="maven.snapshot" value="true" />
    [junit]     <property name="jython" value="lib/required/jython-standalone-2.5.2.jar"
/>
    [junit]     <property name="commons-codec" value="lib/required/commons-codec-1.6.jar"
/>
    [junit]     <property name="project.version" value="0.21" />
    [junit]     <property name="jetty-io" value="lib/required/jetty-io-7.6.3.v20120416.jar"
/>
    [junit]     <property name="file.encoding.pkg" value="sun.io" />
    [junit]     <property name="sun.cpu.endian" value="little" />
    [junit]     <property name="dojo" value="lib/required/dojo-war-1.7.2.war" />
    [junit]     <property name="csvjdbc.jar" value="lib/csvjdbc/csvjdbc-1.0.8.jar" />
    [junit]     <property name="module.test.src.exists" value="true" />
    [junit]     <property name="commons-lang" value="lib/required/commons-lang-2.6.jar"
/>
    [junit]     <property name="tasks.classes" value="<https://builds.apache.org/job/Qpid-Java-Java-BDB-TestMatrix/./jdk=JDK%201.6%20(latest),label=Ubuntu,profile=java-bdb.0-9-1/ws/trunk/qpid/java/tasks/classes">
/>
    [junit]     <property name="java.home" value="/home/jenkins/tools/java/jdk1.6.0_27-32/jre"
/>
    [junit]     <property name="module.coverage" value="<https://builds.apache.org/job/Qpid-Java-Java-BDB-TestMatrix/./jdk=JDK%201.6%20(latest),label=Ubuntu,profile=java-bdb.0-9-1/ws/trunk/qpid/java/build/scratch/perftests/coverage">
/>
    [junit]     <property name="module.test.api" value="<https://builds.apache.org/job/Qpid-Java-Java-BDB-TestMatrix/./jdk=JDK%201.6%20(latest),label=Ubuntu,profile=java-bdb.0-9-1/ws/trunk/qpid/java/build/test-api/perftests">
/>
    [junit]     <property name="module.release.zip" value="<https://builds.apache.org/job/Qpid-Java-Java-BDB-TestMatrix/./jdk=JDK%201.6%20(latest),label=Ubuntu,profile=java-bdb.0-9-1/ws/trunk/qpid/java/perftests/release/qpid-perftests-0.21.zip">
/>
    [junit]     <property name="ant.project.default-target" value="build" />
    [junit]     <property name="build.test.api" value="<https://builds.apache.org/job/Qpid-Java-Java-BDB-TestMatrix/./jdk=JDK%201.6%20(latest),label=Ubuntu,profile=java-bdb.0-9-1/ws/trunk/qpid/java/build/test-api">
/>
    [junit]     <property name="amqj.server.logging.level" value="debug" />
    [junit]     <property name="build.api" value="<https://builds.apache.org/job/Qpid-Java-Java-BDB-TestMatrix/./jdk=JDK%201.6%20(latest),label=Ubuntu,profile=java-bdb.0-9-1/ws/trunk/qpid/java/build/api">
/>
    [junit]     <property name="geronimo-jms" value="lib/required/geronimo-jms_1.1_spec-1.0.jar"
/>
    [junit]     <property name="build.results" value="<https://builds.apache.org/job/Qpid-Java-Java-BDB-TestMatrix/./jdk=JDK%201.6%20(latest),label=Ubuntu,profile=java-bdb.0-9-1/ws/trunk/qpid/java/build/results">
/>
    [junit]     <property name="eclipse.updatealways" value="false" />
    [junit]     <property name="jca.libs" value="lib/required/geronimo-j2ee-connector_1.5_spec-2.0.0.jar
lib/required/geronimo-jta_1.1_spec-1.1.1.jar lib/required/geronimo-jms_1.1_spec-1.0.jar lib/required/slf4j-log4j12-1.6.4.jar
lib/required/log4j-1.2.16.jar lib/required/junit-3.8.1.jar lib/required/slf4j-api-1.6.4.jar
lib/required/mockito-all-1.9.0.jar lib/required/geronimo-kernel-2.2.1.jar lib/required/geronimo-ejb_3.0_spec-1.0.1.jar
lib/required/geronimo-servlet_2.5_spec-1.2.jar" />
    [junit]     <property name="build.bin" value="<https://builds.apache.org/job/Qpid-Java-Java-BDB-TestMatrix/./jdk=JDK%201.6%20(latest),label=Ubuntu,profile=java-bdb.0-9-1/ws/trunk/qpid/java/build/bin">
/>
    [junit]     <property name="perftests-visualisation-jfc.libs" value="lib/jfree/jfreechart-1.0.13.jar
lib/jfree/jcommon-1.0.16.jar lib/csvjdbc/csvjdbc-1.0.8.jar" />
    [junit]     <property name="module.etc" value="<https://builds.apache.org/job/Qpid-Java-Java-BDB-TestMatrix/./jdk=JDK%201.6%20(latest),label=Ubuntu,profile=java-bdb.0-9-1/ws/trunk/qpid/java/perftests/etc">
/>
    [junit]     <property name="test.excludefiles" value="<https://builds.apache.org/job/Qpid-Java-Java-BDB-TestMatrix/./jdk=JDK%201.6%20(latest),label=Ubuntu,profile=java-bdb.0-9-1/ws/trunk/qpid/java/test-profiles/Excludes;>
<https://builds.apache.org/job/Qpid-Java-Java-BDB-TestMatrix/./jdk=JDK%201.6%20(latest),label=Ubuntu,profile=java-bdb.0-9-1/ws/trunk/qpid/java/test-profiles/JavaExcludes;>
<https://builds.apache.org/job/Qpid-Java-Java-BDB-TestMatrix/./jdk=JDK%201.6%20(latest),label=Ubuntu,profile=java-bdb.0-9-1/ws/trunk/qpid/java/test-profiles/java-bdb.0-9-1.excludes;>
<https://builds.apache.org/job/Qpid-Java-Java-BDB-TestMatrix/./jdk=JDK%201.6%20(latest),label=Ubuntu,profile=java-bdb.0-9-1/ws/trunk/qpid/java/test-profiles/JavaExcludes;>
<https://builds.apache.org/job/Qpid-Java-Java-BDB-TestMatrix/./jdk=JDK%201.6%20(latest),label=Ubuntu,profile=java-bdb.0-9-1/ws/trunk/qpid/java/test-profiles/JavaPersistentExcludes;>
<https://builds.apache.org/job/Qpid-Java-Java-BDB-TestMatrix/./jdk=JDK%201.6%20(latest),label=Ubuntu,profile=java-bdb.0-9-1/ws/trunk/qpid/java/test-profiles/XAExcludes;>
<https://builds.apache.org/job/Qpid-Java-Java-BDB-TestMatrix/./jdk=JDK%201.6%20(latest),label=Ubuntu,profile=java-bdb.0-9-1/ws/trunk/qpid/java/test-profiles/JavaPre010Excludes;>
<https://builds.apache.org/job/Qpid-Java-Java-BDB-TestMatrix/./jdk=JDK%201.6%20(latest),label=Ubuntu,profile=java-bdb.0-9-1/ws/trunk/qpid/java/test-profiles/JavaBDBExcludes;">
/>
    [junit]     <property name="amqj.logging.level" value="debug" />
    [junit]     <property name="module.depends.libs" value="lib/required/geronimo-jms_1.1_spec-1.0.jar
lib/required/slf4j-api-1.6.4.jar" />
    [junit]     <property name="dontruntest" value="runtest" />
    [junit]     <property name="log4j.debug" value="false" />
    [junit]     <property name="resources" value="<https://builds.apache.org/job/Qpid-Java-Java-BDB-TestMatrix/./jdk=JDK%201.6%20(latest),label=Ubuntu,profile=java-bdb.0-9-1/ws/trunk/qpid/java/resources">
/>
    [junit]     <property name="preload.messagestore.class.name" value="org.apache.qpid.server.store.berkeleydb.BDBMessageStore"
/>
    [junit]     <property name="log4j.config" value="-Dlog4j.configuration=perftests.log4j"
/>
    [junit]     <property name="sun.management.compiler" value="HotSpot Tiered Compilers"
/>
    [junit]     <property name="max_prefetch" value="1000" />
    [junit]     <property name="javac.deprecation" value="off" />
    [junit]     <property name="jetty-util" value="lib/required/jetty-util-7.6.3.v20120416.jar"
/>
    [junit]     <property name="broker.command" value="build/bin/qpid-server -p @PORT -m
@MPORT @EXCLUDES @INCLUDES -c @CONFIG_FILE -l @LOG_CONFIG_FILE" />
    [junit]     <property name="amqp-1-0-client-example.libs" value="lib/required/commons-cli-1.2.jar"
/>
    [junit]     <property name="management-common.libs" value="" />
    [junit]     <property name="test.failures.ignore" value="true" />
    [junit]     <property name="ant.file" value="<https://builds.apache.org/job/Qpid-Java-Java-BDB-TestMatrix/./jdk=JDK%201.6%20(latest),label=Ubuntu,profile=java-bdb.0-9-1/ws/trunk/qpid/java/perftests/build.xml">
/>
    [junit]     <property name="retrieve.dependencies" value="true" />
    [junit]     <property name="perftests-visualisation-jfc.test.libs" value="lib/required/slf4j-log4j12-1.6.4.jar
lib/required/log4j-1.2.16.jar lib/required/junit-3.8.1.jar lib/required/slf4j-api-1.6.4.jar
lib/required/mockito-all-1.9.0.jar" />
    [junit]     <property name="tasks.src" value="<https://builds.apache.org/job/Qpid-Java-Java-BDB-TestMatrix/./jdk=JDK%201.6%20(latest),label=Ubuntu,profile=java-bdb.0-9-1/ws/trunk/qpid/java/tasks/src">
/>
    [junit]     <property name="test.output" value="<https://builds.apache.org/job/Qpid-Java-Java-BDB-TestMatrix/./jdk=JDK%201.6%20(latest),label=Ubuntu,profile=java-bdb.0-9-1/ws/trunk/qpid/java/build/results/perftests">
/>
    [junit]     <property name="qpid.home" value="<https://builds.apache.org/job/Qpid-Java-Java-BDB-TestMatrix/./jdk=JDK%201.6%20(latest),label=Ubuntu,profile=java-bdb.0-9-1/ws/trunk/qpid/java/build">
/>
    [junit]     <property name="module.depends.jars" value="qpid-client-0.21.jar,qpid-common-0.21.jar"
/>
    [junit]     <property name="jetty" value="lib/required/jetty-server-7.6.3.v20120416.jar"
/>
    [junit]     <property name="java.vm.specification.vendor" value="Sun Microsystems Inc."
/>
    [junit]     <property name="test.mport" value="18999" />
    [junit]     <property name="slf4j-api" value="lib/required/slf4j-api-1.6.4.jar" />
    [junit]     <property name="java.vm.name" value="Java HotSpot(TM) Server VM" />
    [junit]     <property name="build.report" value="<https://builds.apache.org/job/Qpid-Java-Java-BDB-TestMatrix/./jdk=JDK%201.6%20(latest),label=Ubuntu,profile=java-bdb.0-9-1/ws/trunk/qpid/java/build/report">
/>
    [junit]     <property name="amqp-1-0-client-jms.libs" value="lib/required/geronimo-jms_1.1_spec-1.0.jar"
/>
    [junit]     <property name="java.io.tmpdir" value="/tmp" />
    [junit]     <property name="java.vendor.url" value="http://java.sun.com/" />
    [junit]     <property name="module.namever.osgi" value="qpid-perftests_0.21.0.osgi"
/>
    [junit]     <property name="ant.file.type.Performance Tests" value="file" />
    [junit]     <property name="sun.boot.library.path" value="/home/jenkins/tools/java/jdk1.6.0_27-32/jre/lib/i386"
/>
    [junit]     <property name="_profile_files" value="java-bdb.0-9-1.testprofile" />
    [junit]     <property name="module.test.doc.access" value="public" />
    [junit]     <property name="preload.broker.persistent" value="true" />
    [junit]     <property name="testprofile.file" value="<https://builds.apache.org/job/Qpid-Java-Java-BDB-TestMatrix/./jdk=JDK%201.6%20(latest),label=Ubuntu,profile=java-bdb.0-9-1/ws/trunk/qpid/java/test-profiles/java-bdb.0-9-1.testprofile">
/>
    [junit]     <property name="test.mem" value="512M" />
    [junit]     <property name="perftests.libs" value="lib/required/geronimo-jms_1.1_spec-1.0.jar
lib/required/slf4j-api-1.6.4.jar lib/required/log4j-1.2.16.jar lib/required/slf4j-log4j12-1.6.4.jar
lib/required/commons-logging-1.1.1.jar lib/required/commons-collections-3.2.1.jar lib/required/commons-beanutils-core-1.8.3.jar
lib/required/commons-lang-2.6.jar lib/required/gson-2.0.jar" />
    [junit]     <property name="java.runtime.name" value="Java(TM) SE Runtime Environment"
/>
    [junit]     <property name="ant.project.name" value="Performance Tests" />
    [junit]     <property name="module.namever" value="qpid-perftests-0.21" />
    [junit]     <property name="sun.cpu.isalist" value="" />
    [junit]     <property name="module.test.depends.jars.path" value="<https://builds.apache.org/job/Qpid-Java-Java-BDB-TestMatrix/./jdk=JDK%201.6%20(latest),label=Ubuntu,profile=java-bdb.0-9-1/ws/trunk/qpid/java/build/lib/qpid-systests-0.21.jar>:<https://builds.apache.org/job/Qpid-Java-Java-BDB-TestMatrix/./jdk=JDK%201.6%20(latest),label=Ubuntu,profile=java-bdb.0-9-1/ws/trunk/qpid/java/build/lib/qpid-broker-0.21.jar>:<https://builds.apache.org/job/Qpid-Java-Java-BDB-TestMatrix/./jdk=JDK%201.6%20(latest),label=Ubuntu,profile=java-bdb.0-9-1/ws/trunk/qpid/java/build/lib/qpid-common-tests-0.21.jar>:<https://builds.apache.org/job/Qpid-Java-Java-BDB-TestMatrix/./jdk=JDK%201.6%20(latest),label=Ubuntu,profile=java-bdb.0-9-1/ws/trunk/qpid/java/build/lib/qpid-management-common-0.21.jar>:<https://builds.apache.org/job/Qpid-Java-Java-BDB-TestMatrix/./jdk=JDK%201.6%20(latest),label=Ubuntu,profile=java-bdb.0-9-1/ws/trunk/qpid/java/build/lib/qpid-bdbstore-0.21.jar">
/>
    [junit]     <property name="bnd" value="lib/required/bnd-0.0.384.jar" />
    [junit]     <property name="qpid.dest_syntax" value="BURL" />
    [junit]     <property name="tools.libs" value="lib/required/commons-beanutils-core-1.8.3.jar
lib/required/commons-digester-1.8.1.jar lib/required/commons-codec-1.6.jar lib/required/commons-lang-2.6.jar
lib/required/commons-collections-3.2.1.jar lib/required/commons-configuration-1.8.jar lib/required/log4j-1.2.16.jar"
/>
    [junit]     <property name="user.home" value="/home/jenkins" />
    [junit]     <property name="commons-logging" value="lib/required/commons-logging-1.1.1.jar"
/>
    [junit]     <property name="module.api" value="<https://builds.apache.org/job/Qpid-Java-Java-BDB-TestMatrix/./jdk=JDK%201.6%20(latest),label=Ubuntu,profile=java-bdb.0-9-1/ws/trunk/qpid/java/build/api/perftests">
/>
    [junit]     <property name="commons-digester" value="lib/required/commons-digester-1.8.1.jar"
/>
    [junit]     <property name="module.genpom.args" value="" />
    [junit]     <property name="java.specification.name" value="Java Platform API Specification"
/>
    [junit]     <property name="test.port" value="15672" />
    [junit]     <property name="ant.file.type.common" value="file" />
    [junit]     <property name="module.build" value="<https://builds.apache.org/job/Qpid-Java-Java-BDB-TestMatrix/./jdk=JDK%201.6%20(latest),label=Ubuntu,profile=java-bdb.0-9-1/ws/trunk/qpid/java/build/scratch/perftests">
/>
    [junit]     <property name="perftests.optional.test.depends" value="bdbstore" />
    [junit]     <property name="java.specification.vendor" value="Sun Microsystems Inc."
/>
    [junit]     <property name="module.bin" value="<https://builds.apache.org/job/Qpid-Java-Java-BDB-TestMatrix/./jdk=JDK%201.6%20(latest),label=Ubuntu,profile=java-bdb.0-9-1/ws/trunk/qpid/java/perftests/bin">
/>
    [junit]     <property name="java.version" value="1.6.0_27" />
    [junit]     <property name="module.test.libs" value="lib/required/slf4j-log4j12-1.6.4.jar
lib/required/log4j-1.2.16.jar lib/required/junit-3.8.1.jar lib/required/slf4j-api-1.6.4.jar
lib/required/mockito-all-1.9.0.jar" />
    [junit]     <property name="broker.config" value="build/etc/config-systests-bdb.xml"
/>
    [junit]     <property name="test.exclude" value="true" />
    [junit]     <property name="client-example.test.libs" value="lib/required/slf4j-log4j12-1.6.4.jar
lib/required/log4j-1.2.16.jar lib/required/junit-3.8.1.jar lib/required/slf4j-api-1.6.4.jar
lib/required/mockito-all-1.9.0.jar" />
    [junit]     <property name="jackson-mapper" value="lib/required/jackson-mapper-asl-1.9.0.jar"
/>
    [junit]     <property name="amqp-1-0-common.libs" value="" />
    [junit]     <property name="javac.compiler.args" value="" />
    [junit]     <property name="optional" value="true" />
    [junit]     <property name="messagestore.class.name" value="org.apache.qpid.server.store.berkeleydb.BDBMessageStore"
/>
    [junit]     <property name="preload.broker.clean.between.tests" value="true" />
    [junit]     <property name="module.test.classes" value="<https://builds.apache.org/job/Qpid-Java-Java-BDB-TestMatrix/./jdk=JDK%201.6%20(latest),label=Ubuntu,profile=java-bdb.0-9-1/ws/trunk/qpid/java/build/scratch/perftests/test/classes">
/>
    [junit]     <property name="qpid.work" value="<https://builds.apache.org/job/Qpid-Java-Java-BDB-TestMatrix/./jdk=JDK%201.6%20(latest),label=Ubuntu,profile=java-bdb.0-9-1/ws/trunk/qpid/java/build/work">
/>
    [junit]     <property name="preload.profile.excludes" value="JavaExcludes JavaPersistentExcludes
XAExcludes JavaPre010Excludes JavaBDBExcludes" />
    [junit]     <property name="build.failed" value="<https://builds.apache.org/job/Qpid-Java-Java-BDB-TestMatrix/./jdk=JDK%201.6%20(latest),label=Ubuntu,profile=java-bdb.0-9-1/ws/trunk/qpid/java/build/results/FAILED">
/>
    [junit]     <property name="maven.version.suffix" value="-SNAPSHOT" />
    [junit]     <property name="broker.protocol.excludes" value="--exclude-0-10 @PORT --exclude-0-10
@SSL_PORT --exclude-1-0 @PORT --exclude-1-0 @SSL_PORT" />
    [junit]     <property name="line.separator" value="&#xa;" />
    [junit]     <property name="java.specification.version" value="1.6" />
    [junit]     <property name="build.lib.broker.plugins" value="<https://builds.apache.org/job/Qpid-Java-Java-BDB-TestMatrix/./jdk=JDK%201.6%20(latest),label=Ubuntu,profile=java-bdb.0-9-1/ws/trunk/qpid/java/build/lib/broker-plugins">
/>
    [junit]     <property name="java.vm.info" value="mixed mode" />
    [junit]     <property name="jetty-servlet" value="lib/required/jetty-servlet-7.6.3.v20120416.jar"
/>
    [junit]     <property name="ivy.organisation" value="org/apache" />
    [junit]     <property name="xalan" value="lib/required/xalan-2.7.0.jar" />
    [junit]     <property name="module.depends" value="client common" />
    [junit]     <property name="nexus.upload.url" value="https://repository.apache.org/service/local/staging/deploy/maven2"
/>
    [junit]     <property name="module.test.jar" value="<https://builds.apache.org/job/Qpid-Java-Java-BDB-TestMatrix/./jdk=JDK%201.6%20(latest),label=Ubuntu,profile=java-bdb.0-9-1/ws/trunk/qpid/java/build/lib/qpid-perftests-tests-0.21.jar">
/>
    [junit]     <property name="ivy.jar.dir" value="<https://builds.apache.org/job/Qpid-Java-Java-BDB-TestMatrix/./jdk=JDK%201.6%20(latest),label=Ubuntu,profile=java-bdb.0-9-1/ws/trunk/qpid/java/lib/ivy">
/>
    [junit]     <property name="sun.boot.class.path" value="/home/jenkins/tools/java/jdk1.6.0_27-32/jre/lib/resources.jar:/home/jenkins/tools/java/jdk1.6.0_27-32/jre/lib/rt.jar:/home/jenkins/tools/java/jdk1.6.0_27-32/jre/lib/sunrsasign.jar:/home/jenkins/tools/java/jdk1.6.0_27-32/jre/lib/jsse.jar:/home/jenkins/tools/java/jdk1.6.0_27-32/jre/lib/jce.jar:/home/jenkins/tools/java/jdk1.6.0_27-32/jre/lib/charsets.jar:/home/jenkins/tools/java/jdk1.6.0_27-32/jre/lib/modules/jdk.boot.jar:/home/jenkins/tools/java/jdk1.6.0_27-32/jre/classes"
/>
    [junit]     <property name="project.url" value="http://qpid.apache.org" />
    [junit]     <property name="commons-configuration.libs" value="lib/required/commons-beanutils-core-1.8.3.jar
lib/required/commons-digester-1.8.1.jar lib/required/commons-codec-1.6.jar lib/required/commons-lang-2.6.jar
lib/required/commons-collections-3.2.1.jar lib/required/commons-configuration-1.8.jar" />
    [junit]     <property name="gentools.home" value="<https://builds.apache.org/job/Qpid-Java-Java-BDB-TestMatrix/./jdk=JDK%201.6%20(latest),label=Ubuntu,profile=java-bdb.0-9-1/ws/trunk/qpid/gentools">
/>
    [junit]     <property name="build" value="<https://builds.apache.org/job/Qpid-Java-Java-BDB-TestMatrix/./jdk=JDK%201.6%20(latest),label=Ubuntu,profile=java-bdb.0-9-1/ws/trunk/qpid/java/build">
/>
    [junit]     <property name="ivy.m2repo.url" value="http://repo1.maven.org/maven2" />
    [junit]     <property name="servlet-api" value="lib/required/geronimo-servlet_2.5_spec-1.2.jar"
/>
    [junit]     <property name="mockito-all" value="lib/required/mockito-all-1.9.0.jar"
/>
    [junit]     <property name="module.doc.access" value="package" />
    [junit]     <property name="haltonerror" value="no" />
    [junit]     <property name="velocity.compile.dir" value="<https://builds.apache.org/job/Qpid-Java-Java-BDB-TestMatrix/./jdk=JDK%201.6%20(latest),label=Ubuntu,profile=java-bdb.0-9-1/ws/trunk/qpid/java/build/scratch/broker/velocity">
/>
    [junit]     <property name="broker-plugins-management-jmx.test.libs" value="lib/required/slf4j-log4j12-1.6.4.jar
lib/required/log4j-1.2.16.jar lib/required/junit-3.8.1.jar lib/required/slf4j-api-1.6.4.jar
lib/required/mockito-all-1.9.0.jar" />
    [junit]     <property name="module.test.depends.libs" value="lib/required/slf4j-log4j12-1.6.4.jar
lib/required/log4j-1.2.16.jar lib/required/junit-3.8.1.jar lib/required/slf4j-api-1.6.4.jar
lib/required/mockito-all-1.9.0.jar lib/required/commons-cli-1.2.jar lib/required/commons-logging-1.1.1.jar
lib/required/log4j-1.2.16.jar lib/required/slf4j-log4j12-1.6.4.jar lib/required/xalan-2.7.0.jar
lib/required/derby-10.8.2.2.jar lib/required/commons-beanutils-core-1.8.3.jar lib/required/commons-digester-1.8.1.jar
lib/required/commons-codec-1.6.jar lib/required/commons-lang-2.6.jar lib/required/commons-collections-3.2.1.jar
lib/required/commons-configuration-1.8.jar lib/required/jackson-core-asl-1.9.0.jar lib/required/jackson-mapper-asl-1.9.0.jar
lib/required/jetty-server-7.6.3.v20120416.jar lib/required/jetty-continuation-7.6.3.v20120416.jar
lib/required/jetty-security-7.6.3.v20120416.jar lib/required/jetty-http-7.6.3.v20120416.jar
lib/required/jetty-io-7.6.3.v20120416.jar lib/required/jetty-servlet-7.6.3.v20120416.jar lib/required/jetty-util-7.6.3.v20120416.jar
lib/required/geronimo-servlet_2.5_spec-1.2.jar lib/required/jetty-websocket-7.6.3.v20120416.jar
null  lib/bdbstore/je-5.0.58.jar" />
    [junit]     <property name="java.awt.printerjob" value="sun.print.PSPrinterJob" />
    [junit]     <property name="perftests.test.libs" value="lib/required/slf4j-log4j12-1.6.4.jar
lib/required/log4j-1.2.16.jar lib/required/junit-3.8.1.jar lib/required/slf4j-api-1.6.4.jar
lib/required/mockito-all-1.9.0.jar" />
    [junit]     <property name="module.test.src" value="<https://builds.apache.org/job/Qpid-Java-Java-BDB-TestMatrix/./jdk=JDK%201.6%20(latest),label=Ubuntu,profile=java-bdb.0-9-1/ws/trunk/qpid/java/perftests/src/test/java">
/>
    [junit]     <property name="common.test.libs" value="lib/required/slf4j-log4j12-1.6.4.jar
lib/required/log4j-1.2.16.jar lib/required/junit-3.8.1.jar lib/required/slf4j-api-1.6.4.jar
lib/required/mockito-all-1.9.0.jar" />
    [junit]     <property name="sun.jnu.encoding" value="ANSI_X3.4-1968" />
    [junit]     <property name="project.groupid" value="org.apache.qpid" />
    [junit]     <property name="java.runtime.version" value="1.6.0_27-b07" />
    [junit]     <property name="log4j.configuration" value="test-profiles/log4j-test.xml"
/>
    [junit]     <property name="bdbstore-jmx.libs" value="lib/bdbstore/je-5.0.58.jar" />
    [junit]     <property name="test.logging.level" value="-Damqj.test.logging.level=info"
/>
    [junit]     <property name="tasks" value="<https://builds.apache.org/job/Qpid-Java-Java-BDB-TestMatrix/./jdk=JDK%201.6%20(latest),label=Ubuntu,profile=java-bdb.0-9-1/ws/trunk/qpid/java/tasks">
/>
    [junit]     <property name="test.port.alt" value="25672" />
    [junit]     <property name="user.timezone" value="Etc/UTC" />
    [junit]     <property name="module.failed" value="<https://builds.apache.org/job/Qpid-Java-Java-BDB-TestMatrix/./jdk=JDK%201.6%20(latest),label=Ubuntu,profile=java-bdb.0-9-1/ws/trunk/qpid/java/build/results/perftests/FAILED">
/>
    [junit]     <property name="profiles" value=" java-bdb.0-9-1" />
    [junit]     <property name="dont.download.ivy" value="true" />
    [junit]     <property name="tools.test.libs" value="" />
    [junit]     <property name="testprofile.file.present" value="true" />
    [junit]     <property name="java.ext.dirs" value="/home/jenkins/tools/java/jdk1.6.0_27-32/jre/lib/ext:/usr/java/packages/lib/ext"
/>
    [junit]     <property name="module.release" value="<https://builds.apache.org/job/Qpid-Java-Java-BDB-TestMatrix/./jdk=JDK%201.6%20(latest),label=Ubuntu,profile=java-bdb.0-9-1/ws/trunk/qpid/java/perftests/release/qpid-perftests-0.21">
/>
    [junit]     <property name="jetty-security" value="lib/required/jetty-security-7.6.3.v20120416.jar"
/>
    [junit]     <property name="commons-beanutils-core" value="lib/required/commons-beanutils-core-1.8.3.jar"
/>
    [junit]     <property name="java.class.path" value="/home/hudson/tools/ant/latest/lib/ant-launcher.jar:/home/hudson/tools/ant/latest/lib/ant-apache-resolver.jar:/home/hudson/tools/ant/latest/lib/ant-apache-bcel.jar:/home/hudson/tools/ant/latest/lib/ant-netrexx.jar:/home/hudson/tools/ant/latest/lib/ant-commons-net.jar:/home/hudson/tools/ant/latest/lib/ant-javamail.jar:/home/hudson/tools/ant/latest/lib/ant-commons-logging.jar:/home/hudson/tools/ant/latest/lib/ant-junit4.jar:/home/hudson/tools/ant/latest/lib/ant-launcher.jar:/home/hudson/tools/ant/latest/lib/ant-apache-bsf.jar:/home/hudson/tools/ant/latest/lib/ant-testutil.jar:/home/hudson/tools/ant/latest/lib/ant-jdepend.jar:/home/hudson/tools/ant/latest/lib/ant-apache-oro.jar:/home/hudson/tools/ant/latest/lib/ant.jar:/home/hudson/tools/ant/latest/lib/ant-swing.jar:/home/hudson/tools/ant/latest/lib/ant-apache-log4j.jar:/home/hudson/tools/ant/latest/lib/ant-junit.jar:/home/hudson/tools/ant/latest/lib/ant-apache-regexp.jar:/home/hudson/tools/ant/latest/lib/ant-jsch.jar:/home/hudson/tools/ant/latest/lib/ant-jai.jar:/home/hudson/tools/ant/latest/lib/ant-antlr.jar:/home/hudson/tools/ant/latest/lib/ant-jmf.jar:/home/hudson/tools/ant/latest/lib/ant-apache-xalan2.jar:/home/jenkins/tools/java/jdk1.6.0_27-32/lib/tools.jar"
/>
    [junit]     <property name="broker.version" value="v0_9_1" />
    [junit]     <property name="mllib.dir" value="<https://builds.apache.org/job/Qpid-Java-Java-BDB-TestMatrix/./jdk=JDK%201.6%20(latest),label=Ubuntu,profile=java-bdb.0-9-1/ws/trunk/qpid/java/../python">
/>
    [junit]     <property name="broker.language" value="java" />
    [junit]     <property name="log4j" value="lib/required/log4j-1.2.16.jar" />
    [junit]     <property name="cobertura.version" value="1.9.4.1" />
    [junit]     <property name="os.version" value="3.2.0-31-generic" />
    [junit]     <property name="broker.log.interleave" value="true" />
    [junit]     <property name="module.test.depends.libs.includes" value="lib/required/slf4j-log4j12-1.6.4.jar
lib/required/log4j-1.2.16.jar lib/required/junit-3.8.1.jar lib/required/slf4j-api-1.6.4.jar
lib/required/mockito-all-1.9.0.jar lib/required/commons-cli-1.2.jar lib/required/commons-logging-1.1.1.jar
lib/required/log4j-1.2.16.jar lib/required/slf4j-log4j12-1.6.4.jar lib/required/xalan-2.7.0.jar
lib/required/derby-10.8.2.2.jar lib/required/commons-beanutils-core-1.8.3.jar lib/required/commons-digester-1.8.1.jar
lib/required/commons-codec-1.6.jar lib/required/commons-lang-2.6.jar lib/required/commons-collections-3.2.1.jar
lib/required/commons-configuration-1.8.jar lib/required/jackson-core-asl-1.9.0.jar lib/required/jackson-mapper-asl-1.9.0.jar
lib/required/jetty-server-7.6.3.v20120416.jar lib/required/jetty-continuation-7.6.3.v20120416.jar
lib/required/jetty-security-7.6.3.v20120416.jar lib/required/jetty-http-7.6.3.v20120416.jar
lib/required/jetty-io-7.6.3.v20120416.jar lib/required/jetty-servlet-7.6.3.v20120416.jar lib/required/jetty-util-7.6.3.v20120416.jar
lib/required/geronimo-servlet_2.5_spec-1.2.jar lib/required/jetty-websocket-7.6.3.v20120416.jar
null  lib/bdbstore/je-5.0.58.jar" />
    [junit]     <property name="common.libs" value="lib/required/slf4j-api-1.6.4.jar" />
    [junit]     <property name="module.release.bz2" value="<https://builds.apache.org/job/Qpid-Java-Java-BDB-TestMatrix/./jdk=JDK%201.6%20(latest),label=Ubuntu,profile=java-bdb.0-9-1/ws/trunk/qpid/java/perftests/release/qpid-perftests-0.21/qpid-perftests-0.21.tar.bz2">
/>
    [junit]     <property name="geronimo-kernel" value="lib/required/geronimo-kernel-2.2.1.jar"
/>
    [junit]     <property name="build.scratch" value="<https://builds.apache.org/job/Qpid-Java-Java-BDB-TestMatrix/./jdk=JDK%201.6%20(latest),label=Ubuntu,profile=java-bdb.0-9-1/ws/trunk/qpid/java/build/scratch">
/>
    [junit]     <property name="project.version.maven" value="0.22" />
    [junit]     <property name="module.release.base" value="<https://builds.apache.org/job/Qpid-Java-Java-BDB-TestMatrix/./jdk=JDK%201.6%20(latest),label=Ubuntu,profile=java-bdb.0-9-1/ws/trunk/qpid/java/perftests/release">
/>
    [junit]     <property name="test.port.alt.ssl" value="25671" />
    [junit]     <property name="ant.file.type.module" value="file" />
    [junit]     <property name="maven.settings.xml" value="<https://builds.apache.org/job/Qpid-Java-Java-BDB-TestMatrix/./jdk=JDK%201.6%20(latest),label=Ubuntu,profile=java-bdb.0-9-1/ws/trunk/qpid/java/maven-settings.xml">
/>
    [junit]     <property name="client.test.libs" value="lib/required/slf4j-log4j12-1.6.4.jar
lib/required/log4j-1.2.16.jar lib/required/junit-3.8.1.jar lib/required/slf4j-api-1.6.4.jar
lib/required/mockito-all-1.9.0.jar" />
    [junit]     <property name="geronimo-openejb" value="lib/required/geronimo-ejb_3.0_spec-1.0.1.jar"
/>
    [junit]     <property name="java.awt.graphicsenv" value="sun.awt.X11GraphicsEnvironment"
/>
    [junit]     <property name="java.vm.vendor" value="Sun Microsystems Inc." />
    [junit]     <property name="amqj.protocol.logging.level" value="debug" />
    [junit]     <property name="geronimo-j2ee" value="lib/required/geronimo-j2ee-connector_1.5_spec-2.0.0.jar"
/>
    [junit]     <property name="slf4j-log4j" value="lib/required/slf4j-log4j12-1.6.4.jar"
/>
    [junit]     <property name="module.test.resources" value="<https://builds.apache.org/job/Qpid-Java-Java-BDB-TestMatrix/./jdk=JDK%201.6%20(latest),label=Ubuntu,profile=java-bdb.0-9-1/ws/trunk/qpid/java/build/scratch/perftests/test/resources">
/>
    [junit]     <property name="ivy.jar.file.exists" value="true" />
    [junit]     <property name="commons-collections" value="lib/required/commons-collections-3.2.1.jar"
/>
    [junit]     <property name="broker-plugins.libs" value="lib/required/log4j-1.2.16.jar
lib/required/commons-beanutils-core-1.8.3.jar lib/required/commons-digester-1.8.1.jar lib/required/commons-codec-1.6.jar
lib/required/commons-lang-2.6.jar lib/required/commons-collections-3.2.1.jar lib/required/commons-configuration-1.8.jar"
/>
    [junit]     <property name="label" value="Ubuntu" />
    [junit]     <property name="ant.file.type" value="file" />
    [junit]     <property name="module" value="perftests" />
    [junit]     <property name="build.coverage.report" value="<https://builds.apache.org/job/Qpid-Java-Java-BDB-TestMatrix/./jdk=JDK%201.6%20(latest),label=Ubuntu,profile=java-bdb.0-9-1/ws/trunk/qpid/java/build/coverage/report">
/>
    [junit]     <property name="preload.broker.config" value="build/etc/config-systests-bdb.xml"
/>
    [junit]     <property name="build.lib" value="<https://builds.apache.org/job/Qpid-Java-Java-BDB-TestMatrix/./jdk=JDK%201.6%20(latest),label=Ubuntu,profile=java-bdb.0-9-1/ws/trunk/qpid/java/build/lib">
/>
    [junit]     <property name="maven.local.repo" value="<https://builds.apache.org/job/Qpid-Java-Java-BDB-TestMatrix/./jdk=JDK%201.6%20(latest),label=Ubuntu,profile=java-bdb.0-9-1/ws/trunk/qpid/java/build/scratch/maven-local-repo">
/>
    [junit]     <property name="module.jar" value="<https://builds.apache.org/job/Qpid-Java-Java-BDB-TestMatrix/./jdk=JDK%201.6%20(latest),label=Ubuntu,profile=java-bdb.0-9-1/ws/trunk/qpid/java/build/lib/qpid-perftests-0.21.jar">
/>
    [junit]     <property name="amqp-1-0-client.libs" value="" />
    [junit]     <property name="test.excludelist" value="org.apache.qpid.test.unit.transacted.TransactionTimeoutTest#*
org.apache.qpid.test.unit.transacted.TransactionTimeoutDisabledTest#* org.apache.qpid.test.client.message.SelectorTest.testRuntimeSelectorError
 org.apache.qpid.systest.management.jmx.LoggingManagementTest#testViewEffectiveRuntimeLoggerLevels"
/>
    [junit]     <property name="module.depends.jars.path" value="<https://builds.apache.org/job/Qpid-Java-Java-BDB-TestMatrix/./jdk=JDK%201.6%20(latest),label=Ubuntu,profile=java-bdb.0-9-1/ws/trunk/qpid/java/build/lib/qpid-client-0.21.jar>:<https://builds.apache.org/job/Qpid-Java-Java-BDB-TestMatrix/./jdk=JDK%201.6%20(latest),label=Ubuntu,profile=java-bdb.0-9-1/ws/trunk/qpid/java/build/lib/qpid-common-0.21.jar">
/>
    [junit]     <property name="broker-plugins-management-http.test.libs" value="lib/required/slf4j-log4j12-1.6.4.jar
lib/required/log4j-1.2.16.jar lib/required/junit-3.8.1.jar lib/required/slf4j-api-1.6.4.jar
lib/required/mockito-all-1.9.0.jar" />
    [junit]     <property name="ant.version" value="Apache Ant(TM) version 1.8.2 compiled
on December 20 2010" />
    [junit]     <property name="file.encoding" value="ANSI_X3.4-1968" />
    [junit]     <property name="module.instrumented" value="<https://builds.apache.org/job/Qpid-Java-Java-BDB-TestMatrix/./jdk=JDK%201.6%20(latest),label=Ubuntu,profile=java-bdb.0-9-1/ws/trunk/qpid/java/build/scratch/perftests/classes-instrumented">
/>
    [junit]     <property name="project.root" value="<https://builds.apache.org/job/Qpid-Java-Java-BDB-TestMatrix/./jdk=JDK%201.6%20(latest),label=Ubuntu,profile=java-bdb.0-9-1/ws/trunk/qpid/java">
/>
    [junit]     <property name="preload.broker.version" value="v0_9_1" />
    [junit]   </properties>
    [junit]   <testcase classname="org.apache.qpid.systest.disttest.endtoend.Batch-With-Multiple-Tests"
name="Monitor file (<https://builds.apache.org/job/Qpid-Java-Java-BDB-TestMatrix/./jdk=JDK%201.6%20(latest),label=Ubuntu,profile=java-bdb.0-9-1/ws/trunk/qpid/java/perftests/junitvmwatcher3990916528886732448.properties)>
missing, location not writable, testcase not started or mixing ant versions?" time="0.0">
    [junit]     <error message="Forked Java VM exited abnormally. Please note the time
in the report does not reflect the time until the VM exit." type="junit.framework.AssertionFailedError">junit.framework.AssertionFailedError:
Forked Java VM exited abnormally. Please note the time in the report does not reflect the
time until the VM exit.
    [junit] </error>
    [junit]   </testcase>
    [junit] </testsuite>
    [junit] Running org.apache.qpid.systest.disttest.endtoend.Batch-With-Multiple-Tests
    [junit] Tests run: 1, Failures: 0, Errors: 1, Time elapsed: 0 sec

BUILD FAILED
<https://builds.apache.org/job/Qpid-Java-Java-BDB-TestMatrix/./jdk=JDK%201.6%20(latest),label=Ubuntu,profile=java-bdb.0-9-1/ws/trunk/qpid/java/build.xml>:96:
The following error occurred while executing this line:
<https://builds.apache.org/job/Qpid-Java-Java-BDB-TestMatrix/./jdk=JDK%201.6%20(latest),label=Ubuntu,profile=java-bdb.0-9-1/ws/trunk/qpid/java/build.xml>:65:
The following error occurred while executing this line:
<https://builds.apache.org/job/Qpid-Java-Java-BDB-TestMatrix/./jdk=JDK%201.6%20(latest),label=Ubuntu,profile=java-bdb.0-9-1/ws/trunk/qpid/java/module.xml>:424:
Could not delete temporary properties file '<https://builds.apache.org/job/Qpid-Java-Java-BDB-TestMatrix/./jdk=JDK%201.6%20(latest),label=Ubuntu,profile=java-bdb.0-9-1/ws/trunk/qpid/java/perftests/junit1082774354518583136.properties'.>

Total time: 28 minutes 18 seconds
Build step 'Invoke Ant' marked build as failure
[locks-and-latches] Releasing all the locks
[locks-and-latches] All the locks released
Recording test results
ERROR: Publisher hudson.tasks.junit.JUnitResultArchiver aborted due to exception
<https://builds.apache.org/job/Qpid-Java-Java-BDB-TestMatrix/./jdk=JDK%201.6%20(latest),label=Ubuntu,profile=java-bdb.0-9-1/ws/>
does not exist.
	at org.apache.tools.ant.types.AbstractFileSet.getDirectoryScanner(AbstractFileSet.java:483)
	at org.apache.tools.ant.types.AbstractFileSet.getDirectoryScanner(AbstractFileSet.java:460)
	at hudson.tasks.junit.JUnitParser$ParseResultCallable.invoke(JUnitParser.java:108)
	at hudson.tasks.junit.JUnitParser$ParseResultCallable.invoke(JUnitParser.java:90)
	at hudson.FilePath$FileCallableWrapper.call(FilePath.java:2309)
	at hudson.remoting.UserRequest.perform(UserRequest.java:118)
	at hudson.remoting.UserRequest.perform(UserRequest.java:48)
	at hudson.remoting.Request$2.run(Request.java:326)
	at hudson.remoting.InterceptingExecutorService$1.call(InterceptingExecutorService.java:72)
	at java.util.concurrent.FutureTask$Sync.innerRun(FutureTask.java:334)
	at java.util.concurrent.FutureTask.run(FutureTask.java:166)
	at java.util.concurrent.ThreadPoolExecutor.runWorker(ThreadPoolExecutor.java:1110)
	at java.util.concurrent.ThreadPoolExecutor$Worker.run(ThreadPoolExecutor.java:603)
	at java.lang.Thread.run(Thread.java:679)

Mime
View raw message