qpid-notifications mailing list archives

Site index · List index
Message view « Date » · « Thread »
Top « Date » · « Thread »
From Apache Jenkins Server <jenk...@builds.apache.org>
Subject Build failed in Jenkins: Qpid-Java-Artefact-Release #523
Date Mon, 27 Aug 2012 23:44:12 GMT
See <https://builds.apache.org/job/Qpid-Java-Artefact-Release/523/changes>

Changes:

[robbie] QPID-4258: remove some other empty directories from the java tree

[robbie] QPID-4258: remove a bunch of empty directories from the java tree

[robbie] QPID-4237: modified FileGroupDatabase to ensure that it always closes its file input/output
streams.

Applied patch from Philip Harvey <phil@philharveyonline.com>

[robbie] QPID-4237: added convenience method to AuthenticatedResult to facilitate implementation
of third party authentication managers.

Applied patch from Philip Harvey <phil@philharveyonline.com>

[robbie] NO-JIRA: make the default location the 'localfs' ivy resolver uses be a subdirectory
of the lib dir

------------------------------------------
[...truncated 2952 lines...]
   [delete] Deleting: /zonestorage/hudson_solaris/home/hudson/hudson-slave/workspace/Qpid-Java-Artefact-Release/trunk/qpid/java/build/scratch/test-java-mms.0-10.properties

release-bin:
     [echo] Running ant for module : bdbstore
   [delete] Deleting: /zonestorage/hudson_solaris/home/hudson/hudson-slave/workspace/Qpid-Java-Artefact-Release/trunk/qpid/java/build/scratch/test-java-mms.0-10.properties

release-bin:

BUILD SUCCESSFUL
Total time: 2 minutes 28 seconds
[java] $ /home/hudson/tools/ant/latest/bin/ant -file build.xml -Ddownload-bdb=true -Dmodules.opt=bdbstore
release-mvn
Buildfile: /zonestorage/hudson_solaris/home/hudson/hudson-slave/workspace/Qpid-Java-Artefact-Release/trunk/qpid/java/build.xml

release-mvn:
     [echo] Running ant for module : common
   [delete] Deleting: /zonestorage/hudson_solaris/home/hudson/hudson-slave/workspace/Qpid-Java-Artefact-Release/trunk/qpid/java/build/scratch/test-java-mms.0-10.properties

prepare:

pom:

release-mvn:
     [echo] Running ant for module : common
   [delete] Deleting: /zonestorage/hudson_solaris/home/hudson/hudson-slave/workspace/Qpid-Java-Artefact-Release/trunk/qpid/java/build/scratch/test-java-mms.0-10.properties

prepare:

compile_gentools:

compile:

check_gentool_deps:

gentools:

check_jython_deps:

jython:

check-version:

create-version:

build-version:

jms-selector:

precompile:

compile:
     [echo] Targeting : 1.5

copy-metainf-resources:

copy-module-metainf:

jar.manifest:

jar.nomanifest:

jar:

precompile-tests:

compile-tests:

jar-tests:

jar-sources:

libs:

copy-bin:

copy-etc:

postbuild:

build:
[artifact:install] [INFO] Installing /zonestorage/hudson_solaris/home/hudson/hudson-slave/workspace/Qpid-Java-Artefact-Release/trunk/qpid/java/build/lib/qpid-common-0.19.jar
to /zonestorage/hudson_solaris/home/hudson/hudson-slave/workspace/Qpid-Java-Artefact-Release/trunk/qpid/java/build/scratch/maven-local-repo/org/apache/qpid/qpid-common/0.19-SNAPSHOT/qpid-common-0.19-SNAPSHOT.jar
[artifact:deploy] Deploying to file:///zonestorage/hudson_solaris/home/hudson/hudson-slave/workspace/Qpid-Java-Artefact-Release/trunk/qpid/java/common/release/maven
[artifact:deploy] [INFO] Retrieving previous build number from remote
[artifact:deploy] [INFO] repository metadata for: 'snapshot org.apache.qpid:qpid-common:0.19-SNAPSHOT'
could not be found on repository: remote, so will be created
[artifact:deploy] Uploading: org/apache/qpid/qpid-common/0.19-SNAPSHOT/qpid-common-0.19-SNAPSHOT.jar
to repository remote at file:///zonestorage/hudson_solaris/home/hudson/hudson-slave/workspace/Qpid-Java-Artefact-Release/trunk/qpid/java/common/release/maven
[artifact:deploy] Transferring 1329K from remote
[artifact:deploy] Uploaded 1329K
[artifact:deploy] [INFO] Retrieving previous metadata from remote
[artifact:deploy] [INFO] repository metadata for: 'artifact org.apache.qpid:qpid-common' could
not be found on repository: remote, so will be created
[artifact:deploy] [INFO] Uploading repository metadata for: 'artifact org.apache.qpid:qpid-common'
[artifact:deploy] [INFO] Uploading project information for qpid-common 0.19-SNAPSHOT
[artifact:deploy] [INFO] Retrieving previous metadata from remote
[artifact:deploy] [INFO] repository metadata for: 'snapshot org.apache.qpid:qpid-common:0.19-SNAPSHOT'
could not be found on repository: remote, so will be created
[artifact:deploy] [INFO] Uploading repository metadata for: 'snapshot org.apache.qpid:qpid-common:0.19-SNAPSHOT'
[artifact:deploy] [INFO] Retrieving previous build number from remote
[artifact:deploy] Uploading: org/apache/qpid/qpid-common/0.19-SNAPSHOT/qpid-common-0.19-SNAPSHOT-sources.jar
to repository remote at file:///zonestorage/hudson_solaris/home/hudson/hudson-slave/workspace/Qpid-Java-Artefact-Release/trunk/qpid/java/common/release/maven
[artifact:deploy] Transferring 984K from remote
[artifact:deploy] Uploaded 984K
     [echo] Running ant for module : management/common
   [delete] Deleting: /zonestorage/hudson_solaris/home/hudson/hudson-slave/workspace/Qpid-Java-Artefact-Release/trunk/qpid/java/build/scratch/test-java-mms.0-10.properties

prepare:

pom:

release-mvn:
     [echo] Running ant for module : management/common
   [delete] Deleting: /zonestorage/hudson_solaris/home/hudson/hudson-slave/workspace/Qpid-Java-Artefact-Release/trunk/qpid/java/build/scratch/test-java-mms.0-10.properties

prepare:

precompile:

compile:
     [echo] Targeting : 1.5

copy-metainf-resources:

copy-module-metainf:

jar.manifest:

jar.nomanifest:

jar:

precompile-tests:

compile-tests:

jar-tests:

jar-sources:

libs:

copy-bin:

copy-etc:

postbuild:

build:
[artifact:install] [INFO] Installing /zonestorage/hudson_solaris/home/hudson/hudson-slave/workspace/Qpid-Java-Artefact-Release/trunk/qpid/java/build/lib/qpid-management-common-0.19.jar
to /zonestorage/hudson_solaris/home/hudson/hudson-slave/workspace/Qpid-Java-Artefact-Release/trunk/qpid/java/build/scratch/maven-local-repo/org/apache/qpid/qpid-management-common/0.19-SNAPSHOT/qpid-management-common-0.19-SNAPSHOT.jar
[artifact:deploy] Deploying to file:///zonestorage/hudson_solaris/home/hudson/hudson-slave/workspace/Qpid-Java-Artefact-Release/trunk/qpid/java/management/common/release/maven
[artifact:deploy] [INFO] Retrieving previous build number from remote
[artifact:deploy] [INFO] repository metadata for: 'snapshot org.apache.qpid:qpid-management-common:0.19-SNAPSHOT'
could not be found on repository: remote, so will be created
[artifact:deploy] Uploading: org/apache/qpid/qpid-management-common/0.19-SNAPSHOT/qpid-management-common-0.19-SNAPSHOT.jar
to repository remote at file:///zonestorage/hudson_solaris/home/hudson/hudson-slave/workspace/Qpid-Java-Artefact-Release/trunk/qpid/java/management/common/release/maven
[artifact:deploy] Transferring 50K from remote
[artifact:deploy] Uploaded 50K
[artifact:deploy] [INFO] Retrieving previous metadata from remote
[artifact:deploy] [INFO] repository metadata for: 'artifact org.apache.qpid:qpid-management-common'
could not be found on repository: remote, so will be created
[artifact:deploy] [INFO] Uploading repository metadata for: 'artifact org.apache.qpid:qpid-management-common'
[artifact:deploy] [INFO] Retrieving previous metadata from remote
[artifact:deploy] [INFO] repository metadata for: 'snapshot org.apache.qpid:qpid-management-common:0.19-SNAPSHOT'
could not be found on repository: remote, so will be created
[artifact:deploy] [INFO] Uploading repository metadata for: 'snapshot org.apache.qpid:qpid-management-common:0.19-SNAPSHOT'
[artifact:deploy] [INFO] Uploading project information for qpid-management-common 0.19-SNAPSHOT
[artifact:deploy] [INFO] Retrieving previous build number from remote
[artifact:deploy] Uploading: org/apache/qpid/qpid-management-common/0.19-SNAPSHOT/qpid-management-common-0.19-SNAPSHOT-sources.jar
to repository remote at file:///zonestorage/hudson_solaris/home/hudson/hudson-slave/workspace/Qpid-Java-Artefact-Release/trunk/qpid/java/management/common/release/maven
[artifact:deploy] Transferring 54K from remote
[artifact:deploy] Uploaded 54K
     [echo] Running ant for module : amqp-1-0-common
   [delete] Deleting: /zonestorage/hudson_solaris/home/hudson/hudson-slave/workspace/Qpid-Java-Artefact-Release/trunk/qpid/java/build/scratch/test-java-mms.0-10.properties

prepare:

pom:

BUILD FAILED
/zonestorage/hudson_solaris/home/hudson/hudson-slave/workspace/Qpid-Java-Artefact-Release/trunk/qpid/java/build.xml:77:
The following error occurred while executing this line:
/zonestorage/hudson_solaris/home/hudson/hudson-slave/workspace/Qpid-Java-Artefact-Release/trunk/qpid/java/build.xml:65:
The following error occurred while executing this line:
/zonestorage/hudson_solaris/home/hudson/hudson-slave/workspace/Qpid-Java-Artefact-Release/trunk/qpid/java/module.xml:225:
The following error occurred while executing this line:
/zonestorage/hudson_solaris/home/hudson/hudson-slave/workspace/Qpid-Java-Artefact-Release/trunk/qpid/java/common.xml:188:
java.io.IOException: Cannot run program "/zonestorage/hudson_solaris/home/hudson/tools/java/jdk1.6.0_22/jre/bin/java"
(in directory "/zonestorage/hudson_solaris/home/hudson/hudson-slave/workspace/Qpid-Java-Artefact-Release/trunk/qpid/java/amqp-1-0-common"):
error=12, Not enough space
	at java.lang.ProcessBuilder.start(ProcessBuilder.java:460)
	at java.lang.Runtime.exec(Runtime.java:593)
	at org.apache.tools.ant.taskdefs.Execute$Java13CommandLauncher.exec(Execute.java:862)
	at org.apache.tools.ant.taskdefs.Execute.launch(Execute.java:481)
	at org.apache.tools.ant.taskdefs.Execute.execute(Execute.java:495)
	at org.apache.tools.ant.taskdefs.Java.fork(Java.java:791)
	at org.apache.tools.ant.taskdefs.Java.executeJava(Java.java:214)
	at org.apache.tools.ant.taskdefs.Java.executeJava(Java.java:135)
	at org.apache.tools.ant.taskdefs.Java.execute(Java.java:108)
	at org.apache.tools.ant.UnknownElement.execute(UnknownElement.java:291)
	at sun.reflect.GeneratedMethodAccessor4.invoke(Unknown Source)
	at sun.reflect.DelegatingMethodAccessorImpl.invoke(DelegatingMethodAccessorImpl.java:25)
	at java.lang.reflect.Method.invoke(Method.java:597)
	at org.apache.tools.ant.dispatch.DispatchUtils.execute(DispatchUtils.java:106)
	at org.apache.tools.ant.Task.perform(Task.java:348)
	at org.apache.tools.ant.taskdefs.Sequential.execute(Sequential.java:68)
	at org.apache.tools.ant.UnknownElement.execute(UnknownElement.java:291)
	at sun.reflect.GeneratedMethodAccessor4.invoke(Unknown Source)
	at sun.reflect.DelegatingMethodAccessorImpl.invoke(DelegatingMethodAccessorImpl.java:25)
	at java.lang.reflect.Method.invoke(Method.java:597)
	at org.apache.tools.ant.dispatch.DispatchUtils.execute(DispatchUtils.java:106)
	at org.apache.tools.ant.Task.perform(Task.java:348)
	at org.apache.tools.ant.taskdefs.MacroInstance.execute(MacroInstance.java:398)
	at org.apache.tools.ant.UnknownElement.execute(UnknownElement.java:291)
	at sun.reflect.GeneratedMethodAccessor4.invoke(Unknown Source)
	at sun.reflect.DelegatingMethodAccessorImpl.invoke(DelegatingMethodAccessorImpl.java:25)
	at java.lang.reflect.Method.invoke(Method.java:597)
	at org.apache.tools.ant.dispatch.DispatchUtils.execute(DispatchUtils.java:106)
	at org.apache.tools.ant.Task.perform(Task.java:348)
	at org.apache.tools.ant.Target.execute(Target.java:390)
	at org.apache.tools.ant.Target.performTasks(Target.java:411)
	at org.apache.tools.ant.Project.executeSortedTargets(Project.java:1399)
	at org.apache.tools.ant.helper.SingleCheckExecutor.executeTargets(SingleCheckExecutor.java:38)
	at org.apache.tools.ant.Project.executeTargets(Project.java:1251)
	at org.apache.tools.ant.taskdefs.Ant.execute(Ant.java:442)
	at org.apache.tools.ant.taskdefs.SubAnt.execute(SubAnt.java:302)
	at org.apache.tools.ant.taskdefs.SubAnt.execute(SubAnt.java:221)
	at org.apache.tools.ant.UnknownElement.execute(UnknownElement.java:291)
	at sun.reflect.GeneratedMethodAccessor4.invoke(Unknown Source)
	at sun.reflect.DelegatingMethodAccessorImpl.invoke(DelegatingMethodAccessorImpl.java:25)
	at java.lang.reflect.Method.invoke(Method.java:597)
	at org.apache.tools.ant.dispatch.DispatchUtils.execute(DispatchUtils.java:106)
	at org.apache.tools.ant.Task.perform(Task.java:348)
	at org.apache.tools.ant.taskdefs.Sequential.execute(Sequential.java:68)
	at org.apache.tools.ant.UnknownElement.execute(UnknownElement.java:291)
	at sun.reflect.GeneratedMethodAccessor4.invoke(Unknown Source)
	at sun.reflect.DelegatingMethodAccessorImpl.invoke(DelegatingMethodAccessorImpl.java:25)
	at java.lang.reflect.Method.invoke(Method.java:597)
	at org.apache.tools.ant.dispatch.DispatchUtils.execute(DispatchUtils.java:106)
	at org.apache.tools.ant.Task.perform(Task.java:348)
	at org.apache.tools.ant.taskdefs.MacroInstance.execute(MacroInstance.java:398)
	at org.apache.tools.ant.UnknownElement.execute(UnknownElement.java:291)
	at sun.reflect.GeneratedMethodAccessor4.invoke(Unknown Source)
	at sun.reflect.DelegatingMethodAccessorImpl.invoke(DelegatingMethodAccessorImpl.java:25)
	at java.lang.reflect.Method.invoke(Method.java:597)
	at org.apache.tools.ant.dispatch.DispatchUtils.execute(DispatchUtils.java:106)
	at org.apache.tools.ant.Task.perform(Task.java:348)
	at org.apache.tools.ant.Target.execute(Target.java:390)
	at org.apache.tools.ant.Target.performTasks(Target.java:411)
	at org.apache.tools.ant.Project.executeSortedTargets(Project.java:1399)
	at org.apache.tools.ant.Project.executeTarget(Project.java:1368)
	at org.apache.tools.ant.helper.DefaultExecutor.executeTargets(DefaultExecutor.java:41)
	at org.apache.tools.ant.Project.executeTargets(Project.java:1251)
	at org.apache.tools.ant.Main.runBuild(Main.java:809)
	at org.apache.tools.ant.Main.startAnt(Main.java:217)
	at org.apache.tools.ant.launch.Launcher.run(Launcher.java:280)
	at org.apache.tools.ant.launch.Launcher.main(Launcher.java:109)
Caused by: java.io.IOException: error=12, Not enough space
	at java.lang.UNIXProcess.forkAndExec(Native Method)
	at java.lang.UNIXProcess.<init>(UNIXProcess.java:53)
	at java.lang.ProcessImpl.start(ProcessImpl.java:65)
	at java.lang.ProcessBuilder.start(ProcessBuilder.java:453)
	... 66 more

Total time: 1 minute 3 seconds
Build step 'Invoke Ant' marked build as failure
Archiving artifacts

Mime
View raw message