qpid-notifications mailing list archives

Site index · List index
Message view « Date » · « Thread »
Top « Date » · « Thread »
From Apache Jenkins Server <jenk...@builds.apache.org>
Subject Build failed in Jenkins: Qpid-Java-Cpp-Test #924
Date Fri, 24 Aug 2012 15:56:15 GMT
See <https://builds.apache.org/job/Qpid-Java-Cpp-Test/924/changes>

Changes:

[robbie] QPID-4236, QPID-4237, QPID-4245: Added group management functionality, and exposed
it via the web management interface. Removed group definition functionality from the ACL plugin.
The ACL plugin uses groups but no longer defines them.

Introduced SubjectCreator as a facade to AuthenticationManager and group
management classes.

Applied access control to user and group management.

Fixed bug in choosing between update and creation in RestServlet.

Moved lots of RestTest helper methods to RestTestHelper.

Fixed authentication, authorisation, and status logging when using the web ui.

Applied patch from Philip Harvey <phil@philharveyonline.com>, Keith Wall and myself.

------------------------------------------
[...truncated 6256 lines...]
jar-tests:

jar-sources:

libs:

copy-bin:

copy-etc:

postbuild:

build:

test:
     [echo] Using profile:cpp
    [junit] Running org.apache.qpid.server.security.access.plugins.AccessControlTest
    [junit] Tests run: 11, Failures: 0, Errors: 0, Time elapsed: 0.119 sec
    [junit] Running org.apache.qpid.server.security.access.plugins.PlainConfigurationTest
    [junit] Tests run: 21, Failures: 0, Errors: 0, Time elapsed: 0.087 sec
    [junit] Running org.apache.qpid.server.security.access.plugins.RuleSetTest
    [junit] Tests run: 0, Failures: 0, Errors: 0, Time elapsed: 0.009 sec
     [echo] Running ant for module : broker-plugins/access-control
   [delete] Deleting: /x1/jenkins/jenkins-slave/workspace/Qpid-Java-Cpp-Test/trunk/qpid/java/build/scratch/test-cpp.properties

touch-failed:
     [echo] Running ant for module : broker-plugins/firewall
   [delete] Deleting: /x1/jenkins/jenkins-slave/workspace/Qpid-Java-Cpp-Test/trunk/qpid/java/build/scratch/test-cpp.properties

prepare:

precompile:

compile:
     [echo] Targeting : 1.5

copy-metainf-resources:

copy-module-metainf:

jar.manifest:

jar.nomanifest:

jar:

precompile-tests:

compile-tests:

jar-tests:

jar-sources:

libs:

copy-bin:

copy-etc:

postbuild:

build:

test:
     [echo] Using profile:cpp
    [junit] Running org.apache.qpid.server.security.access.FirewallConfigurationTest
    [junit] Tests run: 0, Failures: 0, Errors: 0, Time elapsed: 0.064 sec
    [junit] Running org.apache.qpid.server.security.access.FirewallPluginTest
    [junit] Tests run: 0, Failures: 0, Errors: 0, Time elapsed: 0.009 sec
     [echo] Running ant for module : broker-plugins/firewall
   [delete] Deleting: /x1/jenkins/jenkins-slave/workspace/Qpid-Java-Cpp-Test/trunk/qpid/java/build/scratch/test-cpp.properties

touch-failed:
     [echo] Running ant for module : broker-plugins/management-http
   [delete] Deleting: /x1/jenkins/jenkins-slave/workspace/Qpid-Java-Cpp-Test/trunk/qpid/java/build/scratch/test-cpp.properties

prepare:

precompile:
    [unwar] Expanding: /x1/jenkins/jenkins-slave/workspace/Qpid-Java-Cpp-Test/trunk/qpid/java/lib/required/dojo-war-1.7.2.war
into /x1/jenkins/jenkins-slave/workspace/Qpid-Java-Cpp-Test/trunk/qpid/java/build/scratch/broker-plugins/management-http/classes/resources/dojo

compile:
     [echo] Targeting : 1.5

copy-metainf-resources:

copy-module-metainf:

jar.manifest:

jar.nomanifest:

jar:

precompile-tests:

compile-tests:

jar-tests:

jar-sources:

libs:

copy-bin:

copy-etc:

postbuild:

build:

test:
     [echo] Using profile:cpp
    [junit] Running org.apache.qpid.server.management.plugin.servlet.rest.AuthenticationProviderRestTest
    [junit] Tests run: 0, Failures: 0, Errors: 0, Time elapsed: 0.032 sec
    [junit] Running org.apache.qpid.server.management.plugin.servlet.rest.BindingRestTest
    [junit] Tests run: 0, Failures: 0, Errors: 0, Time elapsed: 0.009 sec
    [junit] Running org.apache.qpid.server.management.plugin.servlet.rest.BrokerRestHttpsTest
    [junit] Tests run: 0, Failures: 0, Errors: 0, Time elapsed: 0.007 sec
    [junit] Running org.apache.qpid.server.management.plugin.servlet.rest.BrokerRestTest
    [junit] Tests run: 0, Failures: 0, Errors: 0, Time elapsed: 0.006 sec
    [junit] Running org.apache.qpid.server.management.plugin.servlet.rest.ConfiguredObjectToMapConverterTest
    [junit] Tests run: 4, Failures: 0, Errors: 0, Time elapsed: 0.042 sec
    [junit] Running org.apache.qpid.server.management.plugin.servlet.rest.ConnectionRestTest
    [junit] Tests run: 0, Failures: 0, Errors: 0, Time elapsed: 0.008 sec
    [junit] Running org.apache.qpid.server.management.plugin.servlet.rest.ExchangeRestTest
    [junit] Tests run: 0, Failures: 0, Errors: 0, Time elapsed: 0.006 sec
    [junit] Running org.apache.qpid.server.management.plugin.servlet.rest.GroupProviderRestTest
    [junit] Tests run: 0, Failures: 0, Errors: 0, Time elapsed: 0.005 sec
    [junit] Running org.apache.qpid.server.management.plugin.servlet.rest.GroupRestTest
    [junit] Tests run: 0, Failures: 0, Errors: 0, Time elapsed: 0.006 sec
    [junit] Running org.apache.qpid.server.management.plugin.servlet.rest.LogRecordsRestTest
    [junit] Tests run: 0, Failures: 0, Errors: 0, Time elapsed: 0.006 sec
    [junit] Running org.apache.qpid.server.management.plugin.servlet.rest.MessagesRestTest
    [junit] Tests run: 0, Failures: 0, Errors: 0, Time elapsed: 0.005 sec
    [junit] Running org.apache.qpid.server.management.plugin.servlet.rest.PortRestTest
    [junit] Tests run: 0, Failures: 0, Errors: 0, Time elapsed: 0.004 sec
    [junit] Running org.apache.qpid.server.management.plugin.servlet.rest.QueueRestTest
    [junit] Tests run: 0, Failures: 0, Errors: 0, Time elapsed: 0.006 sec
    [junit] Running org.apache.qpid.server.management.plugin.servlet.rest.SaslRestTest
    [junit] Tests run: 0, Failures: 0, Errors: 0, Time elapsed: 0.003 sec
    [junit] Running org.apache.qpid.server.management.plugin.servlet.rest.StructureRestTest
    [junit] Tests run: 0, Failures: 0, Errors: 0, Time elapsed: 0.004 sec
    [junit] Running org.apache.qpid.server.management.plugin.servlet.rest.UserRestTest
    [junit] Tests run: 0, Failures: 0, Errors: 0, Time elapsed: 0.004 sec
    [junit] Running org.apache.qpid.server.management.plugin.servlet.rest.VirtualHostRestTest
    [junit] Tests run: 0, Failures: 0, Errors: 0, Time elapsed: 0.003 sec
    [junit] Running org.apache.qpid.systest.rest.acl.GroupRestACLTest
    [junit] Tests run: 4, Failures: 0, Errors: 4, Time elapsed: 0.288 sec
    [junit] TEST org.apache.qpid.systest.rest.acl.GroupRestACLTest FAILED
    [junit] Running org.apache.qpid.systest.rest.acl.UserRestACLTest
    [junit] Tests run: 3, Failures: 0, Errors: 3, Time elapsed: 0.201 sec
    [junit] TEST org.apache.qpid.systest.rest.acl.UserRestACLTest FAILED
    [junit] Tests FAILED
     [echo] Running ant for module : broker-plugins/management-http
   [delete] Deleting: /x1/jenkins/jenkins-slave/workspace/Qpid-Java-Cpp-Test/trunk/qpid/java/build/scratch/test-cpp.properties

touch-failed:
    [touch] Creating /x1/jenkins/jenkins-slave/workspace/Qpid-Java-Cpp-Test/trunk/qpid/java/build/results/broker-plugins/management-http/FAILED
    [touch] Creating /x1/jenkins/jenkins-slave/workspace/Qpid-Java-Cpp-Test/trunk/qpid/java/build/results/FAILED
     [echo] Running ant for module : broker-plugins/management-jmx
   [delete] Deleting: /x1/jenkins/jenkins-slave/workspace/Qpid-Java-Cpp-Test/trunk/qpid/java/build/scratch/test-cpp.properties

prepare:

precompile:

compile:
     [echo] Targeting : 1.5

copy-metainf-resources:

copy-module-metainf:

jar.manifest:

jar.nomanifest:

jar:

precompile-tests:

compile-tests:

jar-tests:

jar-sources:

libs:

copy-bin:

copy-etc:

postbuild:

build:

test:
     [echo] Using profile:cpp
    [junit] Running org.apache.qpid.server.jmx.ManagementLogActorTest
    [junit] Tests run: 1, Failures: 0, Errors: 0, Time elapsed: 0.795 sec
    [junit] Running org.apache.qpid.server.jmx.mbeans.ConnectionMBeanTest
    [junit] Tests run: 16, Failures: 0, Errors: 0, Time elapsed: 0.466 sec
    [junit] Running org.apache.qpid.server.jmx.mbeans.ExchangeMBeanTest
    [junit] Tests run: 10, Failures: 0, Errors: 0, Time elapsed: 0.104 sec
    [junit] Running org.apache.qpid.server.jmx.mbeans.LoggingManagementMBeanTest
    [junit] Tests run: 20, Failures: 0, Errors: 0, Time elapsed: 0.055 sec
    [junit] Running org.apache.qpid.server.jmx.mbeans.QueueMBeanTest
    [junit] Tests run: 0, Failures: 0, Errors: 0, Time elapsed: 0.01 sec
    [junit] Running org.apache.qpid.server.jmx.mbeans.ServerInformationMBeanTest
    [junit] Tests run: 5, Failures: 0, Errors: 0, Time elapsed: 0.026 sec
    [junit] Running org.apache.qpid.server.jmx.mbeans.UserManagementMBeanTest
    [junit] Tests run: 10, Failures: 0, Errors: 0, Time elapsed: 0.033 sec
    [junit] Running org.apache.qpid.server.jmx.mbeans.VirtualHostManagerMBeanTest
    [junit] Tests run: 9, Failures: 0, Errors: 0, Time elapsed: 0.059 sec
    [junit] Running org.apache.qpid.systest.management.jmx.BrokerManagementTest
    [junit] Tests run: 0, Failures: 0, Errors: 0, Time elapsed: 0.005 sec
    [junit] Running org.apache.qpid.systest.management.jmx.ConnectionManagementTest
    [junit] Tests run: 0, Failures: 0, Errors: 0, Time elapsed: 0.006 sec
    [junit] Running org.apache.qpid.systest.management.jmx.LoggingManagementTest
    [junit] Tests run: 0, Failures: 0, Errors: 0, Time elapsed: 0.006 sec
    [junit] Running org.apache.qpid.systest.management.jmx.ManagementActorLoggingTest
    [junit] Tests run: 0, Failures: 0, Errors: 0, Time elapsed: 0.004 sec
    [junit] Running org.apache.qpid.systest.management.jmx.ManagementLoggingTest
    [junit] Tests run: 0, Failures: 0, Errors: 0, Time elapsed: 0.004 sec
    [junit] Running org.apache.qpid.systest.management.jmx.QueueManagementTest
    [junit] Tests run: 0, Failures: 0, Errors: 0, Time elapsed: 0.006 sec
    [junit] Running org.apache.qpid.systest.management.jmx.StatisticsTest
    [junit] Tests run: 0, Failures: 0, Errors: 0, Time elapsed: 0.006 sec
    [junit] Running org.apache.qpid.systest.management.jmx.UserManagementTest
    [junit] Tests run: 0, Failures: 0, Errors: 0, Time elapsed: 0.005 sec
    [junit] Running org.apache.qpid.systest.management.jmx.UserManagementWithBase64MD5PasswordsTest
    [junit] Tests run: 0, Failures: 0, Errors: 0, Time elapsed: 0.004 sec
     [echo] Running ant for module : broker-plugins/management-jmx
   [delete] Deleting: /x1/jenkins/jenkins-slave/workspace/Qpid-Java-Cpp-Test/trunk/qpid/java/build/scratch/test-cpp.properties

touch-failed:

BUILD FAILED
/x1/jenkins/jenkins-slave/workspace/Qpid-Java-Cpp-Test/trunk/qpid/java/build.xml:100: TEST
SUITE FAILED

Total time: 7 minutes 40 seconds
Build step 'Invoke Ant' marked build as failure
[locks-and-latches] Releasing all the locks
[locks-and-latches] All the locks released
Recording test results

Mime
View raw message