qpid-notifications mailing list archives

Site index · List index
Message view « Date » · « Thread »
Top « Date » · « Thread »
From Apache Jenkins Server <jenk...@builds.apache.org>
Subject Build failed in Jenkins: Qpid-Java-Java-Test-JDK1.7 #100
Date Sat, 26 May 2012 02:19:31 GMT
See <https://builds.apache.org/job/Qpid-Java-Java-Test-JDK1.7/100/changes>

Changes:

[kwall] QPID-3936: Java Performance Test Framework - better PSFC support

Change ProducerParticipant to cancel the sending test messages after maximumDuration is reached.
 This is required for
deterministic behaviour when using the Producer Side Flow Control feature of the Java Broker,
otherwise the send() can
hang indefinitely after consumers have shutdown.

[tross] QPID-3992 - Removed the Boost license text from the Ruby LICENSE file.
Applied patch from Darryl Pierce.

[tross] QPID-3995 - Cleans up queues created during Cucumber feature tests 
Applied patch from Darryl Pierce

[kgiusti] NO-JIRA: eliminate dead code and potential null pointer dereference as found by
Coverity

[kgiusti] NO-JIRA: fix some defects found by Coverity static analysis scan of C++ code

[kwall] QPID-4006: [Java Broker] BDB HA.

Close BDB environment in the event of unexpected exceptions during commit/begin tran.
Install BDB exception listener to log exception arising from its own threads.
Default BDB parameters for sensible defaults for standard Qpid use-cases.
Ensure that closeInternal always closes the environment.
Added MBean operation descriptions.

Work of Robbie Gemmell <robbie@apache.org> and myself.

[robbie] QPID-4012: update the priority queue entry sub lists to maintain a record of the
priority index they represent, refer to this when comparing queue entries in order to avoid
using the metadata later than is possible

------------------------------------------
[...truncated 2601 lines...]
    [junit] Tests run: 6, Failures: 0, Errors: 0, Time elapsed: 0.05 sec
    [junit] Running org.apache.qpid.disttest.controller.ParticipatingClientsTest
    [junit] Tests run: 5, Failures: 0, Errors: 0, Time elapsed: 0.005 sec
    [junit] Running org.apache.qpid.disttest.controller.TestRunnerTest
    [junit] Tests run: 6, Failures: 0, Errors: 0, Time elapsed: 1.142 sec
    [junit] Running org.apache.qpid.disttest.controller.config.ClientConfigTest
    [junit] Tests run: 4, Failures: 0, Errors: 0, Time elapsed: 0.01 sec
    [junit] Running org.apache.qpid.disttest.controller.config.ConfigReaderTest
    [junit] Tests run: 4, Failures: 0, Errors: 0, Time elapsed: 0.144 sec
    [junit] Running org.apache.qpid.disttest.controller.config.ConfigTest
    [junit] Tests run: 1, Failures: 0, Errors: 0, Time elapsed: 0.008 sec
    [junit] Running org.apache.qpid.disttest.controller.config.ConnectionConfigTest
    [junit] Tests run: 3, Failures: 0, Errors: 0, Time elapsed: 0.011 sec
    [junit] Running org.apache.qpid.disttest.controller.config.ConsumerConfigTest
    [junit] Tests run: 2, Failures: 0, Errors: 0, Time elapsed: 0.003 sec
    [junit] Running org.apache.qpid.disttest.controller.config.IterationValueTest
    [junit] Tests run: 3, Failures: 0, Errors: 0, Time elapsed: 0.047 sec
    [junit] Running org.apache.qpid.disttest.controller.config.MessageProviderConfigTest
    [junit] Tests run: 2, Failures: 0, Errors: 0, Time elapsed: 0.003 sec
    [junit] Running org.apache.qpid.disttest.controller.config.ProducerConfigTest
    [junit] Tests run: 3, Failures: 0, Errors: 0, Time elapsed: 0.003 sec
    [junit] Running org.apache.qpid.disttest.controller.config.SessionConfigTest
    [junit] Tests run: 3, Failures: 0, Errors: 0, Time elapsed: 0.01 sec
    [junit] Running org.apache.qpid.disttest.controller.config.TestConfigTest
    [junit] Tests run: 5, Failures: 0, Errors: 0, Time elapsed: 0.008 sec
    [junit] Running org.apache.qpid.disttest.controller.config.TestInstanceTest
    [junit] Tests run: 3, Failures: 0, Errors: 0, Time elapsed: 0.007 sec
    [junit] Running org.apache.qpid.disttest.jms.JmsMessageAdaptorTest
    [junit] Tests run: 1, Failures: 0, Errors: 0, Time elapsed: 0.003 sec
    [junit] Running org.apache.qpid.disttest.message.JsonHandlerTest
    [junit] Tests run: 2, Failures: 0, Errors: 0, Time elapsed: 0.022 sec
    [junit] Running org.apache.qpid.disttest.message.ParticipantResultTest
    [junit] Tests run: 3, Failures: 0, Errors: 0, Time elapsed: 0.043 sec
    [junit] Running org.apache.qpid.disttest.results.aggregation.AggregatorTest
    [junit] Tests run: 1, Failures: 0, Errors: 0, Time elapsed: 0.013 sec
    [junit] Running org.apache.qpid.disttest.results.aggregation.ParticipantResultAggregatorTest
    [junit] Tests run: 13, Failures: 0, Errors: 0, Time elapsed: 0.004 sec
    [junit] Running org.apache.qpid.disttest.results.aggregation.TestResultAggregatorTest
    [junit] Tests run: 2, Failures: 0, Errors: 0, Time elapsed: 0.002 sec
    [junit] Running org.apache.qpid.disttest.results.formatting.CSVFormaterTest
    [junit] Tests run: 1, Failures: 0, Errors: 0, Time elapsed: 0.003 sec
    [junit] Running org.apache.qpid.disttest.results.formatting.CSVOrderParticipantResultComparatorTest
    [junit] Tests run: 6, Failures: 0, Errors: 0, Time elapsed: 0.008 sec
    [junit] Running org.apache.qpid.systest.disttest.QpidQueueCreatorTest
    [junit] Tests run: 4, Failures: 0, Errors: 0, Time elapsed: 2.264 sec
    [junit] Running org.apache.qpid.systest.disttest.clientonly.BasicDistributedClientTest
    [junit] Tests run: 5, Failures: 0, Errors: 0, Time elapsed: 0.983 sec
    [junit] Running org.apache.qpid.systest.disttest.clientonly.ConsumerParticipantTest
    [junit] Tests run: 3, Failures: 0, Errors: 0, Time elapsed: 6.564 sec
    [junit] Running org.apache.qpid.systest.disttest.clientonly.DistributedClientTest
    [junit] Tests run: 9, Failures: 0, Errors: 0, Time elapsed: 1.408 sec
    [junit] Running org.apache.qpid.systest.disttest.clientonly.MessageProviderTest
    [junit] Tests run: 2, Failures: 0, Errors: 0, Time elapsed: 0.225 sec
    [junit] Running org.apache.qpid.systest.disttest.clientonly.ProducerParticipantTest
    [junit] Tests run: 1, Failures: 0, Errors: 0, Time elapsed: 0.619 sec
    [junit] Running org.apache.qpid.systest.disttest.controllerandclient.ControllerAndClientTest
    [junit] Tests run: 5, Failures: 0, Errors: 0, Time elapsed: 2.126 sec
    [junit] Running org.apache.qpid.systest.disttest.controlleronly.DistributedControllerTest
    [junit] Tests run: 1, Failures: 0, Errors: 0, Time elapsed: 1.13 sec
    [junit] Running org.apache.qpid.systest.disttest.endtoend.EndToEndTest
    [junit] Tests run: 1, Failures: 0, Errors: 0, Time elapsed: 0.205 sec
    [junit] Tests FAILED
     [echo] Running ant for module : perftests
   [delete] Deleting: <https://builds.apache.org/job/Qpid-Java-Java-Test-JDK1.7/ws/trunk/qpid/java/build/scratch/test-java-mms.0-10.properties>

touch-failed:
    [touch] Creating <https://builds.apache.org/job/Qpid-Java-Java-Test-JDK1.7/ws/trunk/qpid/java/build/results/perftests/FAILED>
     [echo] Running ant for module : broker-plugins/access-control
   [delete] Deleting: <https://builds.apache.org/job/Qpid-Java-Java-Test-JDK1.7/ws/trunk/qpid/java/build/scratch/test-java-mms.0-10.properties>

prepare:

compile_velocity:

check_velocity_deps:

gen_logging:

precompile:

compile:
     [echo] Targeting : 1.5

jar.manifest:

jar.nomanifest:

jar:

precompile-tests:

compile-tests:

jar-tests:

jar-sources:

libs:

copy-bin:

copy-etc:

postbuild:

build:

test:
     [echo] Using profile:java-mms.0-10
    [junit] Running org.apache.qpid.server.security.access.plugins.AccessControlTest
    [junit] Tests run: 11, Failures: 0, Errors: 0, Time elapsed: 0.2 sec
    [junit] Running org.apache.qpid.server.security.access.plugins.PlainConfigurationTest
    [junit] Tests run: 19, Failures: 0, Errors: 0, Time elapsed: 0.036 sec
    [junit] Running org.apache.qpid.server.security.access.plugins.RuleSetTest
    [junit] Tests run: 21, Failures: 0, Errors: 0, Time elapsed: 0.02 sec
     [echo] Running ant for module : broker-plugins/access-control
   [delete] Deleting: <https://builds.apache.org/job/Qpid-Java-Java-Test-JDK1.7/ws/trunk/qpid/java/build/scratch/test-java-mms.0-10.properties>

touch-failed:
     [echo] Running ant for module : broker-plugins/experimental/shutdown
   [delete] Deleting: <https://builds.apache.org/job/Qpid-Java-Java-Test-JDK1.7/ws/trunk/qpid/java/build/scratch/test-java-mms.0-10.properties>

prepare:

precompile:

compile:
     [echo] Targeting : 1.5

jar.manifest:

jar.nomanifest:

jar:

precompile-tests:

compile-tests:

jar-tests:

jar-sources:

libs:

copy-bin:

copy-etc:

postbuild:

build:

test:
     [echo] Running ant for module : broker-plugins/extras
   [delete] Deleting: <https://builds.apache.org/job/Qpid-Java-Java-Test-JDK1.7/ws/trunk/qpid/java/build/scratch/test-java-mms.0-10.properties>

prepare:

precompile:

compile:
     [echo] Targeting : 1.5

jar.manifest:

jar.nomanifest:

jar:

precompile-tests:

compile-tests:

jar-tests:

jar-sources:

libs:

copy-bin:

copy-etc:

postbuild:

build:

test:
     [echo] Using profile:java-mms.0-10
    [junit] Running org.apache.qpid.server.plugins.ExtrasTest
    [junit] Tests run: 2, Failures: 0, Errors: 0, Time elapsed: 0.887 sec
     [echo] Running ant for module : broker-plugins/extras
   [delete] Deleting: <https://builds.apache.org/job/Qpid-Java-Java-Test-JDK1.7/ws/trunk/qpid/java/build/scratch/test-java-mms.0-10.properties>

touch-failed:
     [echo] Running ant for module : broker-plugins/firewall
   [delete] Deleting: <https://builds.apache.org/job/Qpid-Java-Java-Test-JDK1.7/ws/trunk/qpid/java/build/scratch/test-java-mms.0-10.properties>

prepare:

precompile:

compile:
     [echo] Targeting : 1.5

jar.manifest:

jar.nomanifest:

jar:

precompile-tests:

compile-tests:

jar-tests:

jar-sources:

libs:

copy-bin:

copy-etc:

postbuild:

build:

test:
     [echo] Using profile:java-mms.0-10
    [junit] Running org.apache.qpid.server.security.access.FirewallConfigurationTest
    [junit] Tests run: 5, Failures: 0, Errors: 0, Time elapsed: 1.284 sec
    [junit] Running org.apache.qpid.server.security.access.FirewallPluginTest
    [junit] Tests run: 10, Failures: 0, Errors: 0, Time elapsed: 0.421 sec
     [echo] Running ant for module : broker-plugins/firewall
   [delete] Deleting: <https://builds.apache.org/job/Qpid-Java-Java-Test-JDK1.7/ws/trunk/qpid/java/build/scratch/test-java-mms.0-10.properties>

touch-failed:

BUILD FAILED
<https://builds.apache.org/job/Qpid-Java-Java-Test-JDK1.7/ws/trunk/qpid/java/build.xml>:99:
TEST SUITE FAILED

Total time: 15 minutes 38 seconds
Build step 'Invoke Ant' marked build as failure
[locks-and-latches] Releasing all the locks
[locks-and-latches] All the locks released
Recording test results

Mime
View raw message