qpid-notifications mailing list archives

Site index · List index
Message view « Date » · « Thread »
Top « Date » · « Thread »
From Apache Jenkins Server <jenk...@builds.apache.org>
Subject Build failed in Jenkins: Qpid-Java-Java-BDB-TestMatrix » JDK 1.6 (latest),Ubuntu,java-bdb.0-10 #248
Date Thu, 24 May 2012 11:07:33 GMT
See <https://builds.apache.org/job/Qpid-Java-Java-BDB-TestMatrix/./jdk=JDK%201.6%20(latest),label=Ubuntu,profile=java-bdb.0-10/248/changes>

Changes:

[kwall] QPID-4006: Remove BDB StateChangeListener during Environment#close() to avoid processing
an unnecessary DETACHED event (which was causing a stack trace).

[astitcher] NO-JIRA: Rearrange memory status code
Currently only Linux has a useful implementation and everyone else uses a null implementation.

[astitcher] NO-JIRA: Rearrange CMake a bit to improve the chances of compiling on non-Linux
Unix

[astitcher] NO-JIRA: Remove final vestiges of non-portable alloca().

Fixed unit_test changes to avoid incorrect array initialisation.

------------------------------------------
[...truncated 2735 lines...]

prepare:

precompile:

compile:
     [echo] Targeting : 1.5

jar.manifest:

jar.nomanifest:

jar:

precompile-tests:

compile-tests:

jar-tests:

jar-sources:

libs:

copy-bin:

copy-etc:

postbuild:

build:

test:
     [echo] Running ant for module : broker-plugins/extras
   [delete] Deleting: <https://builds.apache.org/job/Qpid-Java-Java-BDB-TestMatrix/./jdk=JDK%201.6%20(latest),label=Ubuntu,profile=java-bdb.0-10/ws/trunk/qpid/java/build/scratch/test-java-bdb.0-10.properties>

prepare:

precompile:

compile:
     [echo] Targeting : 1.5

jar.manifest:

jar.nomanifest:

jar:

precompile-tests:

compile-tests:

jar-tests:

jar-sources:

libs:

copy-bin:

copy-etc:

postbuild:

build:

test:
     [echo] Using profile:java-bdb.0-10
    [junit] Running org.apache.qpid.server.plugins.ExtrasTest
    [junit] Tests run: 2, Failures: 0, Errors: 0, Time elapsed: 0.994 sec
     [echo] Running ant for module : broker-plugins/extras
   [delete] Deleting: <https://builds.apache.org/job/Qpid-Java-Java-BDB-TestMatrix/./jdk=JDK%201.6%20(latest),label=Ubuntu,profile=java-bdb.0-10/ws/trunk/qpid/java/build/scratch/test-java-bdb.0-10.properties>

touch-failed:
     [echo] Running ant for module : broker-plugins/firewall
   [delete] Deleting: <https://builds.apache.org/job/Qpid-Java-Java-BDB-TestMatrix/./jdk=JDK%201.6%20(latest),label=Ubuntu,profile=java-bdb.0-10/ws/trunk/qpid/java/build/scratch/test-java-bdb.0-10.properties>

prepare:

precompile:

compile:
     [echo] Targeting : 1.5

jar.manifest:

jar.nomanifest:

jar:

precompile-tests:

compile-tests:

jar-tests:

jar-sources:

libs:

copy-bin:

copy-etc:

postbuild:

build:

test:
     [echo] Using profile:java-bdb.0-10
    [junit] Running org.apache.qpid.server.security.access.FirewallConfigurationTest
    [junit] Tests run: 5, Failures: 0, Errors: 0, Time elapsed: 1.689 sec
    [junit] Running org.apache.qpid.server.security.access.FirewallPluginTest
    [junit] Tests run: 10, Failures: 0, Errors: 0, Time elapsed: 1.04 sec
     [echo] Running ant for module : broker-plugins/firewall
   [delete] Deleting: <https://builds.apache.org/job/Qpid-Java-Java-BDB-TestMatrix/./jdk=JDK%201.6%20(latest),label=Ubuntu,profile=java-bdb.0-10/ws/trunk/qpid/java/build/scratch/test-java-bdb.0-10.properties>

touch-failed:
     [echo] Running ant for module : bdbstore
   [delete] Deleting: <https://builds.apache.org/job/Qpid-Java-Java-BDB-TestMatrix/./jdk=JDK%201.6%20(latest),label=Ubuntu,profile=java-bdb.0-10/ws/trunk/qpid/java/build/scratch/test-java-bdb.0-10.properties>

check-request-props:
     [echo] Running ant for module : bdbstore
   [delete] Deleting: <https://builds.apache.org/job/Qpid-Java-Java-BDB-TestMatrix/./jdk=JDK%201.6%20(latest),label=Ubuntu,profile=java-bdb.0-10/ws/trunk/qpid/java/build/scratch/test-java-bdb.0-10.properties>

bdb-licence-note:
     [echo] *NOTE* The BDB JE library required by this optional module is licensed under the
Sleepycat Licence, which is not compatible with the Apache Licence v2.0.
     [echo] 
     [echo] For a copy of the Sleepycat Licence, please see:
     [echo] http://www.oracle.com/technetwork/database/berkeleydb/downloads/jeoslicense-086837.html

download-ivy:

load-ivy:

configure-ivy:
[ivy:configure] :: Ivy 2.2.0 - 20100923230623 :: http://ant.apache.org/ivy/ ::
[ivy:configure] :: loading settings :: file = <https://builds.apache.org/job/Qpid-Java-Java-BDB-TestMatrix/./jdk=JDK%201.6%20(latest),label=Ubuntu,profile=java-bdb.0-10/ws/trunk/qpid/java/ivysettings.retrieve.xml>

download-bdb:
     [echo] Resolving and retrieving dependencies...
[ivy:resolve] :: resolving dependencies :: org/apache#qpid;0.17
[ivy:resolve] 	confs: [bdbje]
[ivy:resolve] 	found com.sleepycat#je;5.0.48 in oracle
[ivy:resolve] :: resolution report :: resolve 103ms :: artifacts dl 1ms
	---------------------------------------------------------------------
	|                  |            modules            ||   artifacts   |
	|       conf       | number| search|dwnlded|evicted|| number|dwnlded|
	---------------------------------------------------------------------
	|       bdbje      |   1   |   0   |   0   |   0   ||   1   |   0   |
	---------------------------------------------------------------------
[ivy:retrieve] :: retrieving :: org/apache#qpid [sync]
[ivy:retrieve] 	confs: [bdbje]
[ivy:retrieve] 	0 artifacts copied, 1 already retrieved (0kB/3ms)

check-bdb-jar:

bdb-licence-note-optional:

bdb-jar-required:

prepare:

precompile:

compile:
     [echo] Targeting : 1.5

jar.manifest:

jar.nomanifest:

jar:

precompile-tests:

compile-tests:

jar-tests:

jar-sources:

libs:

copy-bin:

copy-etc:

copy-store-to-upgrade:

postbuild:

module.build:

build:

test:
     [echo] Using profile:java-bdb.0-10
    [junit] Running org.apache.qpid.server.store.berkeleydb.AMQShortStringEncodingTest
    [junit] Tests run: 3, Failures: 0, Errors: 0, Time elapsed: 0.163 sec
    [junit] Running org.apache.qpid.server.store.berkeleydb.BDBBackupTest
    [junit] Tests run: 1, Failures: 0, Errors: 0, Time elapsed: 5.732 sec
    [junit] Running org.apache.qpid.server.store.berkeleydb.BDBHAMessageStoreManagerMBeanTest
    [junit] Tests run: 14, Failures: 0, Errors: 0, Time elapsed: 0.261 sec
    [junit] Running org.apache.qpid.server.store.berkeleydb.BDBHAMessageStoreTest
    [junit] Tests run: 1, Failures: 0, Errors: 0, Time elapsed: 0.373 sec
    [junit] Running org.apache.qpid.server.store.berkeleydb.BDBMessageStoreConfigurationTest
    [junit] Tests run: 9, Failures: 0, Errors: 0, Time elapsed: 3.04 sec
    [junit] Running org.apache.qpid.server.store.berkeleydb.BDBMessageStoreTest
    [junit] Tests run: 15, Failures: 0, Errors: 0, Time elapsed: 7.83 sec
    [junit] Running org.apache.qpid.server.store.berkeleydb.BDBUpgradeTest
    [junit] Tests run: 6, Failures: 0, Errors: 0, Time elapsed: 20.651 sec
    [junit] Running org.apache.qpid.server.store.berkeleydb.HAClusterBlackboxTest
    [junit] Tests run: 2, Failures: 0, Errors: 0, Time elapsed: 26.26 sec
    [junit] Running org.apache.qpid.server.store.berkeleydb.HAClusterManagementTest
    [junit] Tests run: 7, Failures: 0, Errors: 0, Time elapsed: 151.44 sec
    [junit] Running org.apache.qpid.server.store.berkeleydb.HAClusterTwoNodeTest
    [junit] Tests run: 7, Failures: 0, Errors: 0, Time elapsed: 100.775 sec
    [junit] Running org.apache.qpid.server.store.berkeleydb.HAClusterWhiteboxTest
    [junit] Tests run: 5, Failures: 1, Errors: 0, Time elapsed: 143.579 sec
    [junit] TEST org.apache.qpid.server.store.berkeleydb.HAClusterWhiteboxTest FAILED
    [junit] Running org.apache.qpid.server.store.berkeleydb.HAMessageStoreSmokeTest
    [junit] Tests run: 1, Failures: 0, Errors: 0, Time elapsed: 0.022 sec
    [junit] Running org.apache.qpid.server.store.berkeleydb.tuple.ConfiguredObjectBindingTest
    [junit] Tests run: 1, Failures: 0, Errors: 0, Time elapsed: 0.006 sec
    [junit] Running org.apache.qpid.server.store.berkeleydb.upgrade.DatabaseTemplateTest
    [junit] Tests run: 2, Failures: 0, Errors: 0, Time elapsed: 0.089 sec
    [junit] Running org.apache.qpid.server.store.berkeleydb.upgrade.UpgradeFrom4to5Test
    [junit] Tests run: 2, Failures: 0, Errors: 0, Time elapsed: 3.142 sec
    [junit] Running org.apache.qpid.server.store.berkeleydb.upgrade.UpgradeFrom5To6Test
    [junit] Tests run: 4, Failures: 0, Errors: 0, Time elapsed: 8.199 sec
    [junit] Running org.apache.qpid.server.store.berkeleydb.upgrade.UpgraderTest
    [junit] Tests run: 2, Failures: 0, Errors: 0, Time elapsed: 2.652 sec
    [junit] Tests FAILED
     [echo] Running ant for module : bdbstore
   [delete] Deleting: <https://builds.apache.org/job/Qpid-Java-Java-BDB-TestMatrix/./jdk=JDK%201.6%20(latest),label=Ubuntu,profile=java-bdb.0-10/ws/trunk/qpid/java/build/scratch/test-java-bdb.0-10.properties>

touch-failed:
    [touch] Creating <https://builds.apache.org/job/Qpid-Java-Java-BDB-TestMatrix/./jdk=JDK%201.6%20(latest),label=Ubuntu,profile=java-bdb.0-10/ws/trunk/qpid/java/build/results/bdbstore/FAILED>

BUILD FAILED
<https://builds.apache.org/job/Qpid-Java-Java-BDB-TestMatrix/./jdk=JDK%201.6%20(latest),label=Ubuntu,profile=java-bdb.0-10/ws/trunk/qpid/java/build.xml>:99:
TEST SUITE FAILED

Total time: 37 minutes 46 seconds
Build step 'Invoke Ant' marked build as failure
[locks-and-latches] Releasing all the locks
[locks-and-latches] All the locks released
Recording test results

Mime
View raw message