qpid-notifications mailing list archives

Site index · List index
Message view « Date » · « Thread »
Top « Date » · « Thread »
From Apache Jenkins Server <jenk...@builds.apache.org>
Subject Build failed in Jenkins: Qpid-Java-Java-Test-JDK1.7 #58
Date Sat, 14 Apr 2012 02:17:02 GMT
See <https://builds.apache.org/job/Qpid-Java-Java-Test-JDK1.7/58/changes>

Changes:

[gsim] QPID-3947: Bounds checking for str8/str16 on creating AMQP 0-10 structs

[tross] QPID-3946 - Make swig python wrappers compatible with older versions of Python and
Swig.

[robbie] QPID-3945: add the generated Eclipse projects 'classes' output folder to .gitignore

Applied patch from Phil Harvey <phil@philharveyonline.com>

[rgodfrey] QPID-3917 : Fix failing BDB test, remove unusued readOnly flag

------------------------------------------
[...truncated 2418 lines...]
    [junit] Running org.apache.qpid.disttest.controller.TestRunnerTest
    [junit] Tests run: 6, Failures: 0, Errors: 1, Time elapsed: 3.033 sec
    [junit] TEST org.apache.qpid.disttest.controller.TestRunnerTest FAILED
    [junit] Running org.apache.qpid.disttest.controller.config.ClientConfigTest
    [junit] Tests run: 4, Failures: 0, Errors: 0, Time elapsed: 0.016 sec
    [junit] Running org.apache.qpid.disttest.controller.config.ConfigReaderTest
    [junit] Tests run: 4, Failures: 0, Errors: 0, Time elapsed: 0.183 sec
    [junit] Running org.apache.qpid.disttest.controller.config.ConfigTest
    [junit] Tests run: 1, Failures: 0, Errors: 0, Time elapsed: 0.012 sec
    [junit] Running org.apache.qpid.disttest.controller.config.ConnectionConfigTest
    [junit] Tests run: 3, Failures: 0, Errors: 0, Time elapsed: 0.017 sec
    [junit] Running org.apache.qpid.disttest.controller.config.ConsumerConfigTest
    [junit] Tests run: 2, Failures: 0, Errors: 0, Time elapsed: 0.005 sec
    [junit] Running org.apache.qpid.disttest.controller.config.IterationValueTest
    [junit] Tests run: 3, Failures: 0, Errors: 0, Time elapsed: 0.065 sec
    [junit] Running org.apache.qpid.disttest.controller.config.MessageProviderConfigTest
    [junit] Tests run: 2, Failures: 0, Errors: 0, Time elapsed: 0.004 sec
    [junit] Running org.apache.qpid.disttest.controller.config.ProducerConfigTest
    [junit] Tests run: 3, Failures: 0, Errors: 0, Time elapsed: 0.005 sec
    [junit] Running org.apache.qpid.disttest.controller.config.SessionConfigTest
    [junit] Tests run: 3, Failures: 0, Errors: 0, Time elapsed: 0.015 sec
    [junit] Running org.apache.qpid.disttest.controller.config.TestConfigTest
    [junit] Tests run: 5, Failures: 0, Errors: 0, Time elapsed: 0.007 sec
    [junit] Running org.apache.qpid.disttest.controller.config.TestInstanceTest
    [junit] Tests run: 3, Failures: 0, Errors: 0, Time elapsed: 0.006 sec
    [junit] Running org.apache.qpid.disttest.jms.JmsMessageAdaptorTest
    [junit] Tests run: 1, Failures: 0, Errors: 0, Time elapsed: 0.002 sec
    [junit] Running org.apache.qpid.disttest.message.JsonHandlerTest
    [junit] Tests run: 2, Failures: 0, Errors: 0, Time elapsed: 0.014 sec
    [junit] Running org.apache.qpid.disttest.message.ParticipantResultTest
    [junit] Tests run: 3, Failures: 0, Errors: 0, Time elapsed: 0.029 sec
    [junit] Running org.apache.qpid.disttest.results.aggregation.AggregatorTest
    [junit] Tests run: 1, Failures: 0, Errors: 0, Time elapsed: 0.01 sec
    [junit] Running org.apache.qpid.disttest.results.aggregation.ParticipantResultAggregatorTest
    [junit] Tests run: 8, Failures: 0, Errors: 0, Time elapsed: 0.003 sec
    [junit] Running org.apache.qpid.disttest.results.aggregation.TestResultAggregatorTest
    [junit] Tests run: 2, Failures: 0, Errors: 0, Time elapsed: 0.002 sec
    [junit] Running org.apache.qpid.disttest.results.formatting.CSVFormaterTest
    [junit] Tests run: 1, Failures: 0, Errors: 1, Time elapsed: 0.002 sec
    [junit] TEST org.apache.qpid.disttest.results.formatting.CSVFormaterTest FAILED
    [junit] Running org.apache.qpid.disttest.results.formatting.CSVOrderParticipantResultComparatorTest
    [junit] Tests run: 6, Failures: 0, Errors: 0, Time elapsed: 0.007 sec
    [junit] Running org.apache.qpid.systest.disttest.QpidQueueCreatorTest
    [junit] Tests run: 0, Failures: 0, Errors: 0, Time elapsed: 0.001 sec
    [junit] Running org.apache.qpid.systest.disttest.clientonly.BasicDistributedClientTest
    [junit] Tests run: 0, Failures: 0, Errors: 0, Time elapsed: 0.001 sec
    [junit] Running org.apache.qpid.systest.disttest.clientonly.ConsumerParticipantTest
    [junit] Tests run: 0, Failures: 0, Errors: 0, Time elapsed: 0.001 sec
    [junit] Running org.apache.qpid.systest.disttest.clientonly.DistributedClientTest
    [junit] Tests run: 0, Failures: 0, Errors: 0, Time elapsed: 0.001 sec
    [junit] Running org.apache.qpid.systest.disttest.clientonly.MessageProviderTest
    [junit] Tests run: 0, Failures: 0, Errors: 0, Time elapsed: 0.001 sec
    [junit] Running org.apache.qpid.systest.disttest.clientonly.ProducerParticipantTest
    [junit] Tests run: 0, Failures: 0, Errors: 0, Time elapsed: 0.001 sec
    [junit] Running org.apache.qpid.systest.disttest.controllerandclient.ControllerAndClientTest
    [junit] Tests run: 0, Failures: 0, Errors: 0, Time elapsed: 0.001 sec
    [junit] Running org.apache.qpid.systest.disttest.controlleronly.DistributedControllerTest
    [junit] Tests run: 0, Failures: 0, Errors: 0, Time elapsed: 0.001 sec
    [junit] Running org.apache.qpid.systest.disttest.endtoend.EndToEndTest
    [junit] Tests run: 0, Failures: 0, Errors: 0, Time elapsed: 0.001 sec
    [junit] Tests FAILED
     [echo] Running ant for module : perftests
   [delete] Deleting: /x1/jenkins/jenkins-slave/workspace/Qpid-Java-Java-Test-JDK1.7/trunk/qpid/java/build/scratch/test-java-mms.0-10.properties

touch-failed:
    [touch] Creating /x1/jenkins/jenkins-slave/workspace/Qpid-Java-Java-Test-JDK1.7/trunk/qpid/java/build/results/perftests/FAILED
    [touch] Creating /x1/jenkins/jenkins-slave/workspace/Qpid-Java-Java-Test-JDK1.7/trunk/qpid/java/build/results/FAILED
     [echo] Running ant for module : broker-plugins/access-control
   [delete] Deleting: /x1/jenkins/jenkins-slave/workspace/Qpid-Java-Java-Test-JDK1.7/trunk/qpid/java/build/scratch/test-java-mms.0-10.properties

prepare:

compile_velocity:

check_velocity_deps:

gen_logging:

precompile:

compile:
     [echo] Targeting : 1.5

jar.manifest:

jar.nomanifest:

jar:

precompile-tests:

compile-tests:

jar-tests:

jar-sources:

libs:

copy-bin:

copy-etc:

postbuild:

build:

test:
     [echo] Using profile:java-mms.0-10
    [junit] Running org.apache.qpid.server.security.access.plugins.AccessControlTest
    [junit] Tests run: 11, Failures: 0, Errors: 0, Time elapsed: 0.143 sec
    [junit] Running org.apache.qpid.server.security.access.plugins.PlainConfigurationTest
    [junit] Tests run: 19, Failures: 0, Errors: 0, Time elapsed: 0.054 sec
    [junit] Running org.apache.qpid.server.security.access.plugins.RuleSetTest
    [junit] Tests run: 21, Failures: 0, Errors: 0, Time elapsed: 0.016 sec
     [echo] Running ant for module : broker-plugins/access-control
   [delete] Deleting: /x1/jenkins/jenkins-slave/workspace/Qpid-Java-Java-Test-JDK1.7/trunk/qpid/java/build/scratch/test-java-mms.0-10.properties

touch-failed:
     [echo] Running ant for module : broker-plugins/experimental/shutdown
   [delete] Deleting: /x1/jenkins/jenkins-slave/workspace/Qpid-Java-Java-Test-JDK1.7/trunk/qpid/java/build/scratch/test-java-mms.0-10.properties

prepare:

precompile:

compile:
     [echo] Targeting : 1.5

jar.manifest:

jar.nomanifest:

jar:

precompile-tests:

compile-tests:

jar-tests:

jar-sources:

libs:

copy-bin:

copy-etc:

postbuild:

build:

test:
     [echo] Running ant for module : broker-plugins/extras
   [delete] Deleting: /x1/jenkins/jenkins-slave/workspace/Qpid-Java-Java-Test-JDK1.7/trunk/qpid/java/build/scratch/test-java-mms.0-10.properties

prepare:

precompile:

compile:
     [echo] Targeting : 1.5

jar.manifest:

jar.nomanifest:

jar:

precompile-tests:

compile-tests:

jar-tests:

jar-sources:

libs:

copy-bin:

copy-etc:

postbuild:

build:

test:
     [echo] Using profile:java-mms.0-10
    [junit] Running org.apache.qpid.server.plugins.ExtrasTest
    [junit] Tests run: 2, Failures: 0, Errors: 0, Time elapsed: 0.803 sec
     [echo] Running ant for module : broker-plugins/extras
   [delete] Deleting: /x1/jenkins/jenkins-slave/workspace/Qpid-Java-Java-Test-JDK1.7/trunk/qpid/java/build/scratch/test-java-mms.0-10.properties

touch-failed:
     [echo] Running ant for module : broker-plugins/firewall
   [delete] Deleting: /x1/jenkins/jenkins-slave/workspace/Qpid-Java-Java-Test-JDK1.7/trunk/qpid/java/build/scratch/test-java-mms.0-10.properties

prepare:

precompile:

compile:
     [echo] Targeting : 1.5

jar.manifest:

jar.nomanifest:

jar:

precompile-tests:

compile-tests:

jar-tests:

jar-sources:

libs:

copy-bin:

copy-etc:

postbuild:

build:

test:
     [echo] Using profile:java-mms.0-10
    [junit] Running org.apache.qpid.server.security.access.FirewallConfigurationTest
    [junit] Tests run: 5, Failures: 0, Errors: 0, Time elapsed: 1.235 sec
    [junit] Running org.apache.qpid.server.security.access.FirewallPluginTest
    [junit] Tests run: 10, Failures: 0, Errors: 0, Time elapsed: 1.733 sec
     [echo] Running ant for module : broker-plugins/firewall
   [delete] Deleting: /x1/jenkins/jenkins-slave/workspace/Qpid-Java-Java-Test-JDK1.7/trunk/qpid/java/build/scratch/test-java-mms.0-10.properties

touch-failed:

BUILD FAILED
/x1/jenkins/jenkins-slave/workspace/Qpid-Java-Java-Test-JDK1.7/trunk/qpid/java/build.xml:94:
TEST SUITE FAILED

Total time: 15 minutes 4 seconds
Build step 'Invoke Ant' marked build as failure
[locks-and-latches] Releasing all the locks
[locks-and-latches] All the locks released
Recording test results

Mime
View raw message