qpid-notifications mailing list archives

Site index · List index
Message view « Date » · « Thread »
Top « Date » · « Thread »
From Apache Jenkins Server <jenk...@builds.apache.org>
Subject Build failed in Jenkins: Qpid-Java-Java-BDB-TestMatrix » JDK 1.6 (latest),Ubuntu,java-bdb.0-10 #89
Date Thu, 12 Apr 2012 23:43:05 GMT
See <https://builds.apache.org/job/Qpid-Java-Java-BDB-TestMatrix/./jdk=JDK%201.6%20(latest),label=Ubuntu,profile=java-bdb.0-10/89/>

------------------------------------------
[...truncated 2556 lines...]

jar:

precompile-tests:

compile-tests:

jar-tests:

jar-sources:

libs:

copy-bin:

copy-etc:

postbuild:

build:

test:
     [echo] Using profile:java-bdb.0-10
    [junit] Running org.apache.qpid.server.security.access.plugins.AccessControlTest
    [junit] Tests run: 11, Failures: 0, Errors: 0, Time elapsed: 0.206 sec
    [junit] Running org.apache.qpid.server.security.access.plugins.PlainConfigurationTest
    [junit] Tests run: 19, Failures: 0, Errors: 0, Time elapsed: 0.038 sec
    [junit] Running org.apache.qpid.server.security.access.plugins.RuleSetTest
    [junit] Tests run: 21, Failures: 0, Errors: 0, Time elapsed: 0.035 sec
     [echo] Running ant for module : broker-plugins/access-control
   [delete] Deleting: <https://builds.apache.org/job/Qpid-Java-Java-BDB-TestMatrix/./jdk=JDK%201.6%20(latest),label=Ubuntu,profile=java-bdb.0-10/ws/trunk/qpid/java/build/scratch/test-java-bdb.0-10.properties>

touch-failed:
     [echo] Running ant for module : broker-plugins/experimental/shutdown
   [delete] Deleting: <https://builds.apache.org/job/Qpid-Java-Java-BDB-TestMatrix/./jdk=JDK%201.6%20(latest),label=Ubuntu,profile=java-bdb.0-10/ws/trunk/qpid/java/build/scratch/test-java-bdb.0-10.properties>

prepare:

precompile:

compile:
     [echo] Targeting : 1.5

jar.manifest:

jar.nomanifest:

jar:

precompile-tests:

compile-tests:

jar-tests:

jar-sources:

libs:

copy-bin:

copy-etc:

postbuild:

build:

test:
     [echo] Running ant for module : broker-plugins/extras
   [delete] Deleting: <https://builds.apache.org/job/Qpid-Java-Java-BDB-TestMatrix/./jdk=JDK%201.6%20(latest),label=Ubuntu,profile=java-bdb.0-10/ws/trunk/qpid/java/build/scratch/test-java-bdb.0-10.properties>

prepare:

precompile:

compile:
     [echo] Targeting : 1.5

jar.manifest:

jar.nomanifest:

jar:

precompile-tests:

compile-tests:

jar-tests:

jar-sources:

libs:

copy-bin:

copy-etc:

postbuild:

build:

test:
     [echo] Using profile:java-bdb.0-10
    [junit] Running org.apache.qpid.server.plugins.ExtrasTest
    [junit] Tests run: 2, Failures: 0, Errors: 0, Time elapsed: 0.867 sec
     [echo] Running ant for module : broker-plugins/extras
   [delete] Deleting: <https://builds.apache.org/job/Qpid-Java-Java-BDB-TestMatrix/./jdk=JDK%201.6%20(latest),label=Ubuntu,profile=java-bdb.0-10/ws/trunk/qpid/java/build/scratch/test-java-bdb.0-10.properties>

touch-failed:
     [echo] Running ant for module : broker-plugins/firewall
   [delete] Deleting: <https://builds.apache.org/job/Qpid-Java-Java-BDB-TestMatrix/./jdk=JDK%201.6%20(latest),label=Ubuntu,profile=java-bdb.0-10/ws/trunk/qpid/java/build/scratch/test-java-bdb.0-10.properties>

prepare:

precompile:

compile:
     [echo] Targeting : 1.5

jar.manifest:

jar.nomanifest:

jar:

precompile-tests:

compile-tests:

jar-tests:

jar-sources:

libs:

copy-bin:

copy-etc:

postbuild:

build:

test:
     [echo] Using profile:java-bdb.0-10
    [junit] Running org.apache.qpid.server.security.access.FirewallConfigurationTest
    [junit] Tests run: 5, Failures: 0, Errors: 0, Time elapsed: 1.185 sec
    [junit] Running org.apache.qpid.server.security.access.FirewallPluginTest
    [junit] Tests run: 10, Failures: 0, Errors: 0, Time elapsed: 0.679 sec
     [echo] Running ant for module : broker-plugins/firewall
   [delete] Deleting: <https://builds.apache.org/job/Qpid-Java-Java-BDB-TestMatrix/./jdk=JDK%201.6%20(latest),label=Ubuntu,profile=java-bdb.0-10/ws/trunk/qpid/java/build/scratch/test-java-bdb.0-10.properties>

touch-failed:
     [echo] Running ant for module : bdbstore
   [delete] Deleting: <https://builds.apache.org/job/Qpid-Java-Java-BDB-TestMatrix/./jdk=JDK%201.6%20(latest),label=Ubuntu,profile=java-bdb.0-10/ws/trunk/qpid/java/build/scratch/test-java-bdb.0-10.properties>

check-request-props:
     [echo] Running ant for module : bdbstore
   [delete] Deleting: <https://builds.apache.org/job/Qpid-Java-Java-BDB-TestMatrix/./jdk=JDK%201.6%20(latest),label=Ubuntu,profile=java-bdb.0-10/ws/trunk/qpid/java/build/scratch/test-java-bdb.0-10.properties>

bdb-licence-note:
     [echo] *NOTE* The BDB JE library required by this optional module is licensed under the
Sleepycat Licence, which is not compatible with the Apache Licence v2.0.
     [echo] 
     [echo] For a copy of the Sleepycat Licence, please see:
     [echo] http://www.oracle.com/technetwork/database/berkeleydb/downloads/jeoslicense-086837.html

download-bdb:
     [echo] Downloading BDB JE
      [get] Getting: http://download.oracle.com/maven/com/sleepycat/je/5.0.34/je-5.0.34.jar
      [get] To: <https://builds.apache.org/job/Qpid-Java-Java-BDB-TestMatrix/./jdk=JDK%201.6%20(latest),label=Ubuntu,profile=java-bdb.0-10/ws/trunk/qpid/java/lib/bdbstore/je-5.0.34.jar>
      [get] Not modified - so not downloaded

check-bdb-jar:

bdb-licence-note-optional:

bdb-jar-required:

prepare:

precompile:

compile:
     [echo] Targeting : 1.5

jar.manifest:

jar.nomanifest:

jar:

precompile-tests:

compile-tests:

jar-tests:

jar-sources:

libs:

copy-bin:

copy-etc:

copy-store-to-upgrade:

postbuild:

module.build:

build:

test:
     [echo] Using profile:java-bdb.0-10
    [junit] Running org.apache.qpid.server.store.berkeleydb.AMQShortStringEncodingTest
    [junit] Tests run: 3, Failures: 0, Errors: 0, Time elapsed: 0.151 sec
    [junit] Running org.apache.qpid.server.store.berkeleydb.BDBBackupTest
    [junit] Tests run: 1, Failures: 0, Errors: 0, Time elapsed: 3.256 sec
    [junit] Running org.apache.qpid.server.store.berkeleydb.BDBMessageStoreTest
    [junit] Tests run: 15, Failures: 0, Errors: 1, Time elapsed: 1.581 sec
    [junit] TEST org.apache.qpid.server.store.berkeleydb.BDBMessageStoreTest FAILED
    [junit] Running org.apache.qpid.server.store.berkeleydb.BDBUpgradeTest
    [junit] Tests run: 6, Failures: 0, Errors: 0, Time elapsed: 6.698 sec
    [junit] Running org.apache.qpid.server.store.berkeleydb.upgrade.DatabaseTemplateTest
    [junit] Tests run: 2, Failures: 0, Errors: 0, Time elapsed: 0.225 sec
    [junit] Running org.apache.qpid.server.store.berkeleydb.upgrade.UpgradeFrom4to5Test
    [junit] Tests run: 2, Failures: 0, Errors: 0, Time elapsed: 0.205 sec
    [junit] Running org.apache.qpid.server.store.berkeleydb.upgrade.UpgradeFrom5To6Test
    [junit] Tests run: 3, Failures: 0, Errors: 0, Time elapsed: 0.249 sec
    [junit] Running org.apache.qpid.server.store.berkeleydb.upgrade.UpgraderTest
    [junit] Tests run: 2, Failures: 0, Errors: 0, Time elapsed: 0.167 sec
    [junit] Tests FAILED
     [echo] Running ant for module : bdbstore
   [delete] Deleting: <https://builds.apache.org/job/Qpid-Java-Java-BDB-TestMatrix/./jdk=JDK%201.6%20(latest),label=Ubuntu,profile=java-bdb.0-10/ws/trunk/qpid/java/build/scratch/test-java-bdb.0-10.properties>

touch-failed:
    [touch] Creating <https://builds.apache.org/job/Qpid-Java-Java-BDB-TestMatrix/./jdk=JDK%201.6%20(latest),label=Ubuntu,profile=java-bdb.0-10/ws/trunk/qpid/java/build/results/bdbstore/FAILED>
    [touch] Creating <https://builds.apache.org/job/Qpid-Java-Java-BDB-TestMatrix/./jdk=JDK%201.6%20(latest),label=Ubuntu,profile=java-bdb.0-10/ws/trunk/qpid/java/build/results/FAILED>

BUILD FAILED
<https://builds.apache.org/job/Qpid-Java-Java-BDB-TestMatrix/./jdk=JDK%201.6%20(latest),label=Ubuntu,profile=java-bdb.0-10/ws/trunk/qpid/java/build.xml>:94:
TEST SUITE FAILED

Total time: 16 minutes 32 seconds
Build step 'Invoke Ant' marked build as failure
[locks-and-latches] Releasing all the locks
[locks-and-latches] All the locks released
Recording test results

Mime
View raw message