qpid-dev mailing list archives

Site index · List index
Message view « Date » · « Thread »
Top « Date » · « Thread »
From "Ganesh Murthy (Jira)" <j...@apache.org>
Subject [jira] [Created] (DISPATCH-1735) system_tests_management failing on Fedora 32
Date Fri, 31 Jul 2020 14:46:00 GMT
Ganesh Murthy created DISPATCH-1735:
---------------------------------------

             Summary: system_tests_management failing on Fedora 32
                 Key: DISPATCH-1735
                 URL: https://issues.apache.org/jira/browse/DISPATCH-1735
             Project: Qpid Dispatch
          Issue Type: Bug
          Components: Tests
            Reporter: Ganesh Murthy
            Assignee: Ganesh Murthy


{noformat}
19: ======================================================================
19: FAIL: test_dummy (system_tests_management.ManagementTest)
19: Test all operations on the dummy test entity
19: ----------------------------------------------------------------------
19: Traceback (most recent call last):
19:   File "/home/gmurthy/opensource/qpid-dispatch/tests/system_tests_management.py", line
347, in test_dummy
19:     self.assertEqual(
19: AssertionError: {'operation': 'callme', 'type': 'org.apache[58 chars]tes'} != {'type':
'org.apache.qpid.dispatch.dummy', [57 chars]y/0'}
19: - {'data': b'bytes',
19: ?          -
19: 
19: + {'data': 'bytes',
19:    'identity': 'dummy/0',
19:    'operation': 'callme',
19:    'type': 'org.apache.qpid.dispatch.dummy'}
19: 
19: ----------------------------------------------------------------------
19: Ran 21 tests in 9.483s
19: 
19: FAILED (failures=1)
1/1 Test #19: system_tests_management ..........***Failed    9.69 sec
 {noformat}



--
This message was sent by Atlassian Jira
(v8.3.4#803005)

---------------------------------------------------------------------
To unsubscribe, e-mail: dev-unsubscribe@qpid.apache.org
For additional commands, e-mail: dev-help@qpid.apache.org


Mime
View raw message