provisionr-dev mailing list archives

Site index · List index
Message view « Date » · « Thread »
Top « Date » · « Thread »
From Apache Jenkins Server <jenk...@builds.apache.org>
Subject Build failed in Jenkins: provisionr-master #173
Date Sun, 10 Nov 2013 07:54:41 GMT
See <https://builds.apache.org/job/provisionr-master/173/>

------------------------------------------
[...truncated 4492 lines...]
[INFO] 
[INFO] --- apache-rat-plugin:0.9:check (default) @ provisionr-assembly-tests ---
[INFO] 51 implicit excludes (use -debug for more details).
[INFO] Exclude: **/*.md
[INFO] Exclude: NOTICE
[INFO] Exclude: .git/**
[INFO] Exclude: .repository/**
[INFO] Exclude: .gitignore
[INFO] Exclude: .idea/**
[INFO] Exclude: **/*.iml
[INFO] Exclude: **/*.project
[INFO] Exclude: **/*.classpath
[INFO] Exclude: **/*.prefs
[INFO] Exclude: **/id_rsa_test
[INFO] Exclude: **/id_rsa_test.pub
[INFO] Exclude: **/*.bpmn20.xml
[INFO] Exclude: **/*.activiti
[INFO] Exclude: **/*.csv
[INFO] Exclude: **/target/**
[INFO] 3 resources included (use -debug for more details)
[INFO] Rat check: Summary of files. Unapproved: 0 unknown: 0 generated: 0 approved: 3 licence.
[INFO]                                                                         
[INFO] ------------------------------------------------------------------------
[INFO] Building Apache Provisionr :: Aggregator 0.5.0-incubating-SNAPSHOT
[INFO] ------------------------------------------------------------------------
[INFO] 
[INFO] --- maven-clean-plugin:2.5:clean (default-clean) @ provisionr-aggregator ---
[INFO] 
[INFO] --- maven-remote-resources-plugin:1.4:process (default) @ provisionr-aggregator ---
[INFO] 
[INFO] --- maven-site-plugin:3.2:attach-descriptor (attach-descriptor) @ provisionr-aggregator
---
[WARNING] Failed to getClass for org.apache.maven.plugin.source.SourceJarMojo
[INFO] 
[INFO] --- maven-source-plugin:2.2.1:jar (default) @ provisionr-aggregator ---
[INFO] 
[INFO] --- apache-rat-plugin:0.9:check (default) @ provisionr-aggregator ---
[INFO] 70 implicit excludes (use -debug for more details).
[INFO] Exclude: **/*.md
[INFO] Exclude: NOTICE
[INFO] Exclude: .git/**
[INFO] Exclude: .repository/**
[INFO] Exclude: .gitignore
[INFO] Exclude: .idea/**
[INFO] Exclude: **/*.iml
[INFO] Exclude: **/*.project
[INFO] Exclude: **/*.classpath
[INFO] Exclude: **/*.prefs
[INFO] Exclude: **/id_rsa_test
[INFO] Exclude: **/id_rsa_test.pub
[INFO] Exclude: **/*.bpmn20.xml
[INFO] Exclude: **/*.activiti
[INFO] Exclude: **/*.csv
[INFO] Exclude: **/target/**
[INFO] 7 resources included (use -debug for more details)
[INFO] Rat check: Summary of files. Unapproved: 0 unknown: 0 generated: 0 approved: 5 licence.
[INFO] 
[INFO] --- maven-install-plugin:2.3.1:install (default-install) @ provisionr-aggregator ---
[INFO] Installing <https://builds.apache.org/job/provisionr-master/ws/pom.xml> to /home/jenkins/jenkins-slave/maven-repositories/1/org/apache/provisionr/provisionr-aggregator/0.5.0-incubating-SNAPSHOT/provisionr-aggregator-0.5.0-incubating-SNAPSHOT.pom
[INFO] ------------------------------------------------------------------------
[INFO] Reactor Summary:
[INFO] 
[INFO] Apache Provisionr :: Parent ....................... SUCCESS [29.424s]
[INFO] Apache Provisionr :: API .......................... SUCCESS [18.651s]
[INFO] Apache Provisionr :: Activiti Database ............ SUCCESS [16.454s]
[INFO] Apache Provisionr :: Test Support ................. SUCCESS [26.143s]
[INFO] Apache Provisionr :: Core ......................... SUCCESS [1:05.321s]
[INFO] Apache Provisionr :: Examples ..................... SUCCESS [8.123s]
[INFO] Apache Provisionr :: Web Console & REST API ....... SUCCESS [20.808s]
[INFO] Apache Provisionr :: Amazon ....................... SUCCESS [52.489s]
[INFO] Apache Provisionr :: CloudStack ................... SUCCESS [29.429s]
[INFO] Apache Provisionr :: Rundeck ...................... SUCCESS [16.197s]
[INFO] Apache Provisionr :: Activiti Karaf :: Commands ... SUCCESS [35.751s]
[INFO] Apache Provisionr :: Activiti Karaf :: Explorer ... SUCCESS [25.511s]
[INFO] Apache Provisionr :: Karaf Commands ............... SUCCESS [33.374s]
[INFO] Apache Provisionr :: Karaf Branding ............... SUCCESS [7.960s]
[INFO] Apache Provisionr :: Karaf Features ............... SUCCESS [50.138s]
[INFO] Apache Provisionr :: Amazon Integration Tests ..... SUCCESS [15.899s]
[INFO] Apache Provisionr :: CloudStack Integration Tests . SUCCESS [21.809s]
[INFO] Apache Provisionr :: Custom Karaf Distribution .... SUCCESS [2:40.215s]
[INFO] Apache Provisionr :: Custom Karaf Distribution Tests  SUCCESS [4:02.863s]
[INFO] Apache Provisionr :: Aggregator ................... SUCCESS [1:07.883s]
[INFO] ------------------------------------------------------------------------
[INFO] BUILD SUCCESS
[INFO] ------------------------------------------------------------------------
[INFO] Total time: 32:32.280s
[INFO] Finished at: Sun Nov 10 07:33:49 UTC 2013
[INFO] Final Memory: 58M/265M
[INFO] ------------------------------------------------------------------------
Waiting for Jenkins to finish collecting data
[JENKINS] Archiving <https://builds.apache.org/job/provisionr-master/ws/test-support/pom.xml>
to org.apache.provisionr/provisionr-test-support/0.5.0-incubating-SNAPSHOT/provisionr-test-support-0.5.0-incubating-SNAPSHOT.pom
[JENKINS] Archiving <https://builds.apache.org/job/provisionr-master/ws/test-support/target/provisionr-test-support-0.5.0-incubating-SNAPSHOT.jar>
to org.apache.provisionr/provisionr-test-support/0.5.0-incubating-SNAPSHOT/provisionr-test-support-0.5.0-incubating-SNAPSHOT.jar
[JENKINS] Archiving <https://builds.apache.org/job/provisionr-master/ws/test-support/target/provisionr-test-support-0.5.0-incubating-SNAPSHOT-sources.jar>
to org.apache.provisionr/provisionr-test-support/0.5.0-incubating-SNAPSHOT/provisionr-test-support-0.5.0-incubating-SNAPSHOT-sources.jar
[JENKINS] Archiving <https://builds.apache.org/job/provisionr-master/ws/test-support/target/features.xml>
to org.apache.provisionr/provisionr-test-support/0.5.0-incubating-SNAPSHOT/provisionr-test-support-0.5.0-incubating-SNAPSHOT-features.xml
[JENKINS] Archiving <https://builds.apache.org/job/provisionr-master/ws/activiti/explorer/pom.xml>
to org.apache.provisionr/activiti-karaf-web-explorer/0.5.0-incubating-SNAPSHOT/activiti-karaf-web-explorer-0.5.0-incubating-SNAPSHOT.pom
[JENKINS] Archiving <https://builds.apache.org/job/provisionr-master/ws/activiti/explorer/target/activiti-karaf-web-explorer-0.5.0-incubating-SNAPSHOT.war>
to org.apache.provisionr/activiti-karaf-web-explorer/0.5.0-incubating-SNAPSHOT/activiti-karaf-web-explorer-0.5.0-incubating-SNAPSHOT.war
[JENKINS] Archiving <https://builds.apache.org/job/provisionr-master/ws/activiti/explorer/target/activiti-karaf-web-explorer-0.5.0-incubating-SNAPSHOT-sources.jar>
to org.apache.provisionr/activiti-karaf-web-explorer/0.5.0-incubating-SNAPSHOT/activiti-karaf-web-explorer-0.5.0-incubating-SNAPSHOT-sources.jar
[JENKINS] Archiving <https://builds.apache.org/job/provisionr-master/ws/providers/cloudstack/pom.xml>
to org.apache.provisionr/provisionr-cloudstack/0.5.0-incubating-SNAPSHOT/provisionr-cloudstack-0.5.0-incubating-SNAPSHOT.pom
[JENKINS] Archiving <https://builds.apache.org/job/provisionr-master/ws/providers/cloudstack/target/provisionr-cloudstack-0.5.0-incubating-SNAPSHOT.jar>
to org.apache.provisionr/provisionr-cloudstack/0.5.0-incubating-SNAPSHOT/provisionr-cloudstack-0.5.0-incubating-SNAPSHOT.jar
[JENKINS] Archiving <https://builds.apache.org/job/provisionr-master/ws/providers/cloudstack/target/provisionr-cloudstack-0.5.0-incubating-SNAPSHOT-sources.jar>
to org.apache.provisionr/provisionr-cloudstack/0.5.0-incubating-SNAPSHOT/provisionr-cloudstack-0.5.0-incubating-SNAPSHOT-sources.jar
[JENKINS] Archiving <https://builds.apache.org/job/provisionr-master/ws/providers/cloudstack/target/classes/features.xml>
to org.apache.provisionr/provisionr-cloudstack/0.5.0-incubating-SNAPSHOT/provisionr-cloudstack-0.5.0-incubating-SNAPSHOT-features.xml
[JENKINS] Archiving <https://builds.apache.org/job/provisionr-master/ws/providers/cloudstack/target/classes/org.apache.provisionr.cloudstack.cfg>
to org.apache.provisionr/provisionr-cloudstack/0.5.0-incubating-SNAPSHOT/provisionr-cloudstack-0.5.0-incubating-SNAPSHOT-defaults.cfg
[JENKINS] Archiving <https://builds.apache.org/job/provisionr-master/ws/karaf/features/pom.xml>
to org.apache.provisionr/provisionr-features/0.5.0-incubating-SNAPSHOT/provisionr-features-0.5.0-incubating-SNAPSHOT.pom
[JENKINS] Archiving <https://builds.apache.org/job/provisionr-master/ws/karaf/features/target/provisionr-features-0.5.0-incubating-SNAPSHOT.jar>
to org.apache.provisionr/provisionr-features/0.5.0-incubating-SNAPSHOT/provisionr-features-0.5.0-incubating-SNAPSHOT.jar
[JENKINS] Archiving <https://builds.apache.org/job/provisionr-master/ws/karaf/features/target/provisionr-features-0.5.0-incubating-SNAPSHOT-sources.jar>
to org.apache.provisionr/provisionr-features/0.5.0-incubating-SNAPSHOT/provisionr-features-0.5.0-incubating-SNAPSHOT-sources.jar
[JENKINS] Archiving <https://builds.apache.org/job/provisionr-master/ws/karaf/features/target/features.xml>
to org.apache.provisionr/provisionr-features/0.5.0-incubating-SNAPSHOT/provisionr-features-0.5.0-incubating-SNAPSHOT-features.xml
[JENKINS] Archiving <https://builds.apache.org/job/provisionr-master/ws/providers/cloudstack-tests/pom.xml>
to org.apache.provisionr/provisionr-cloudstack-tests/0.5.0-incubating-SNAPSHOT/provisionr-cloudstack-tests-0.5.0-incubating-SNAPSHOT.pom
[JENKINS] Archiving <https://builds.apache.org/job/provisionr-master/ws/providers/cloudstack-tests/target/provisionr-cloudstack-tests-0.5.0-incubating-SNAPSHOT.jar>
to org.apache.provisionr/provisionr-cloudstack-tests/0.5.0-incubating-SNAPSHOT/provisionr-cloudstack-tests-0.5.0-incubating-SNAPSHOT.jar
[JENKINS] Archiving <https://builds.apache.org/job/provisionr-master/ws/providers/cloudstack-tests/target/provisionr-cloudstack-tests-0.5.0-incubating-SNAPSHOT-sources.jar>
to org.apache.provisionr/provisionr-cloudstack-tests/0.5.0-incubating-SNAPSHOT/provisionr-cloudstack-tests-0.5.0-incubating-SNAPSHOT-sources.jar
[JENKINS] Archiving <https://builds.apache.org/job/provisionr-master/ws/console/pom.xml>
to org.apache.provisionr/provisionr-console/0.5.0-incubating-SNAPSHOT/provisionr-console-0.5.0-incubating-SNAPSHOT.pom
[JENKINS] Archiving <https://builds.apache.org/job/provisionr-master/ws/console/target/provisionr-console-0.5.0-incubating-SNAPSHOT.jar>
to org.apache.provisionr/provisionr-console/0.5.0-incubating-SNAPSHOT/provisionr-console-0.5.0-incubating-SNAPSHOT.jar
[JENKINS] Archiving <https://builds.apache.org/job/provisionr-master/ws/console/target/provisionr-console-0.5.0-incubating-SNAPSHOT-sources.jar>
to org.apache.provisionr/provisionr-console/0.5.0-incubating-SNAPSHOT/provisionr-console-0.5.0-incubating-SNAPSHOT-sources.jar
[JENKINS] Archiving <https://builds.apache.org/job/provisionr-master/ws/console/target/classes/features.xml>
to org.apache.provisionr/provisionr-console/0.5.0-incubating-SNAPSHOT/provisionr-console-0.5.0-incubating-SNAPSHOT-features.xml
[JENKINS] Archiving <https://builds.apache.org/job/provisionr-master/ws/console/target/classes/org.apache.provisionr.console.cfg>
to org.apache.provisionr/provisionr-console/0.5.0-incubating-SNAPSHOT/provisionr-console-0.5.0-incubating-SNAPSHOT-defaults.cfg
[JENKINS] Archiving <https://builds.apache.org/job/provisionr-master/ws/karaf/branding/pom.xml>
to org.apache.provisionr/provisionr-branding/0.5.0-incubating-SNAPSHOT/provisionr-branding-0.5.0-incubating-SNAPSHOT.pom
[JENKINS] Archiving <https://builds.apache.org/job/provisionr-master/ws/karaf/branding/target/provisionr-branding-0.5.0-incubating-SNAPSHOT.jar>
to org.apache.provisionr/provisionr-branding/0.5.0-incubating-SNAPSHOT/provisionr-branding-0.5.0-incubating-SNAPSHOT.jar
[JENKINS] Archiving <https://builds.apache.org/job/provisionr-master/ws/karaf/branding/target/provisionr-branding-0.5.0-incubating-SNAPSHOT-sources.jar>
to org.apache.provisionr/provisionr-branding/0.5.0-incubating-SNAPSHOT/provisionr-branding-0.5.0-incubating-SNAPSHOT-sources.jar
[JENKINS] Archiving <https://builds.apache.org/job/provisionr-master/ws/examples/pom.xml>
to org.apache.provisionr/provisionr-examples/0.5.0-incubating-SNAPSHOT/provisionr-examples-0.5.0-incubating-SNAPSHOT.pom
[JENKINS] Archiving <https://builds.apache.org/job/provisionr-master/ws/examples/target/provisionr-examples-0.5.0-incubating-SNAPSHOT.jar>
to org.apache.provisionr/provisionr-examples/0.5.0-incubating-SNAPSHOT/provisionr-examples-0.5.0-incubating-SNAPSHOT.jar
[JENKINS] Archiving <https://builds.apache.org/job/provisionr-master/ws/examples/target/provisionr-examples-0.5.0-incubating-SNAPSHOT-sources.jar>
to org.apache.provisionr/provisionr-examples/0.5.0-incubating-SNAPSHOT/provisionr-examples-0.5.0-incubating-SNAPSHOT-sources.jar
[JENKINS] Archiving <https://builds.apache.org/job/provisionr-master/ws/examples/target/classes/features.xml>
to org.apache.provisionr/provisionr-examples/0.5.0-incubating-SNAPSHOT/provisionr-examples-0.5.0-incubating-SNAPSHOT-features.xml
[JENKINS] Archiving <https://builds.apache.org/job/provisionr-master/ws/examples/target/classes/org/apache/provisionr/examples/templates/cdh3.xml>
to org.apache.provisionr/provisionr-examples/0.5.0-incubating-SNAPSHOT/provisionr-examples-0.5.0-incubating-SNAPSHOT-cdh3.template
[JENKINS] Archiving <https://builds.apache.org/job/provisionr-master/ws/examples/target/classes/org/apache/provisionr/examples/templates/cdh4.xml>
to org.apache.provisionr/provisionr-examples/0.5.0-incubating-SNAPSHOT/provisionr-examples-0.5.0-incubating-SNAPSHOT-cdh4.template
[JENKINS] Archiving <https://builds.apache.org/job/provisionr-master/ws/examples/target/classes/org/apache/provisionr/examples/templates/jenkins.xml>
to org.apache.provisionr/provisionr-examples/0.5.0-incubating-SNAPSHOT/provisionr-examples-0.5.0-incubating-SNAPSHOT-jenkins.template
[JENKINS] Archiving <https://builds.apache.org/job/provisionr-master/ws/providers/amazon-tests/pom.xml>
to org.apache.provisionr/provisionr-amazon-tests/0.5.0-incubating-SNAPSHOT/provisionr-amazon-tests-0.5.0-incubating-SNAPSHOT.pom
[JENKINS] Archiving <https://builds.apache.org/job/provisionr-master/ws/providers/amazon-tests/target/provisionr-amazon-tests-0.5.0-incubating-SNAPSHOT.jar>
to org.apache.provisionr/provisionr-amazon-tests/0.5.0-incubating-SNAPSHOT/provisionr-amazon-tests-0.5.0-incubating-SNAPSHOT.jar
[JENKINS] Archiving <https://builds.apache.org/job/provisionr-master/ws/providers/amazon-tests/target/provisionr-amazon-tests-0.5.0-incubating-SNAPSHOT-sources.jar>
to org.apache.provisionr/provisionr-amazon-tests/0.5.0-incubating-SNAPSHOT/provisionr-amazon-tests-0.5.0-incubating-SNAPSHOT-sources.jar
[JENKINS] Archiving <https://builds.apache.org/job/provisionr-master/ws/karaf/assembly-tests/pom.xml>
to org.apache.provisionr/provisionr-assembly-tests/0.5.0-incubating-SNAPSHOT/provisionr-assembly-tests-0.5.0-incubating-SNAPSHOT.pom
[JENKINS] Archiving <https://builds.apache.org/job/provisionr-master/ws/karaf/assembly-tests/target/provisionr-assembly-tests-0.5.0-incubating-SNAPSHOT.jar>
to org.apache.provisionr/provisionr-assembly-tests/0.5.0-incubating-SNAPSHOT/provisionr-assembly-tests-0.5.0-incubating-SNAPSHOT.jar
[JENKINS] Archiving <https://builds.apache.org/job/provisionr-master/ws/karaf/assembly-tests/target/provisionr-assembly-tests-0.5.0-incubating-SNAPSHOT-sources.jar>
to org.apache.provisionr/provisionr-assembly-tests/0.5.0-incubating-SNAPSHOT/provisionr-assembly-tests-0.5.0-incubating-SNAPSHOT-sources.jar
[JENKINS] Archiving <https://builds.apache.org/job/provisionr-master/ws/core/pom.xml>
to org.apache.provisionr/provisionr-core/0.5.0-incubating-SNAPSHOT/provisionr-core-0.5.0-incubating-SNAPSHOT.pom
[JENKINS] Archiving <https://builds.apache.org/job/provisionr-master/ws/core/target/provisionr-core-0.5.0-incubating-SNAPSHOT.jar>
to org.apache.provisionr/provisionr-core/0.5.0-incubating-SNAPSHOT/provisionr-core-0.5.0-incubating-SNAPSHOT.jar
[JENKINS] Archiving <https://builds.apache.org/job/provisionr-master/ws/core/target/provisionr-core-0.5.0-incubating-SNAPSHOT-sources.jar>
to org.apache.provisionr/provisionr-core/0.5.0-incubating-SNAPSHOT/provisionr-core-0.5.0-incubating-SNAPSHOT-sources.jar
[JENKINS] Archiving <https://builds.apache.org/job/provisionr-master/ws/core/target/classes/features.xml>
to org.apache.provisionr/provisionr-core/0.5.0-incubating-SNAPSHOT/provisionr-core-0.5.0-incubating-SNAPSHOT-features.xml
[JENKINS] Archiving <https://builds.apache.org/job/provisionr-master/ws/core/target/classes/org.apache.provisionr.cfg>
to org.apache.provisionr/provisionr-core/0.5.0-incubating-SNAPSHOT/provisionr-core-0.5.0-incubating-SNAPSHOT-defaults.cfg
[JENKINS] Archiving <https://builds.apache.org/job/provisionr-master/ws/core/target/classes/org.apache.felix.fileinstall-templates.cfg>
to org.apache.provisionr/provisionr-core/0.5.0-incubating-SNAPSHOT/provisionr-core-0.5.0-incubating-SNAPSHOT-fileinstall.cfg
[JENKINS] Archiving <https://builds.apache.org/job/provisionr-master/ws/providers/amazon/pom.xml>
to org.apache.provisionr/provisionr-amazon/0.5.0-incubating-SNAPSHOT/provisionr-amazon-0.5.0-incubating-SNAPSHOT.pom
[JENKINS] Archiving <https://builds.apache.org/job/provisionr-master/ws/providers/amazon/target/provisionr-amazon-0.5.0-incubating-SNAPSHOT.jar>
to org.apache.provisionr/provisionr-amazon/0.5.0-incubating-SNAPSHOT/provisionr-amazon-0.5.0-incubating-SNAPSHOT.jar
[JENKINS] Archiving <https://builds.apache.org/job/provisionr-master/ws/providers/amazon/target/provisionr-amazon-0.5.0-incubating-SNAPSHOT-sources.jar>
to org.apache.provisionr/provisionr-amazon/0.5.0-incubating-SNAPSHOT/provisionr-amazon-0.5.0-incubating-SNAPSHOT-sources.jar
[JENKINS] Archiving <https://builds.apache.org/job/provisionr-master/ws/providers/amazon/target/classes/features.xml>
to org.apache.provisionr/provisionr-amazon/0.5.0-incubating-SNAPSHOT/provisionr-amazon-0.5.0-incubating-SNAPSHOT-features.xml
[JENKINS] Archiving <https://builds.apache.org/job/provisionr-master/ws/providers/amazon/target/classes/org.apache.provisionr.amazon.cfg>
to org.apache.provisionr/provisionr-amazon/0.5.0-incubating-SNAPSHOT/provisionr-amazon-0.5.0-incubating-SNAPSHOT-defaults.cfg
[JENKINS] Archiving <https://builds.apache.org/job/provisionr-master/ws/integration/rundeck/pom.xml>
to org.apache.provisionr/provisionr-rundeck/0.5.0-incubating-SNAPSHOT/provisionr-rundeck-0.5.0-incubating-SNAPSHOT.pom
[JENKINS] Archiving <https://builds.apache.org/job/provisionr-master/ws/integration/rundeck/target/provisionr-rundeck-0.5.0-incubating-SNAPSHOT.jar>
to org.apache.provisionr/provisionr-rundeck/0.5.0-incubating-SNAPSHOT/provisionr-rundeck-0.5.0-incubating-SNAPSHOT.jar
[JENKINS] Archiving <https://builds.apache.org/job/provisionr-master/ws/integration/rundeck/target/provisionr-rundeck-0.5.0-incubating-SNAPSHOT-sources.jar>
to org.apache.provisionr/provisionr-rundeck/0.5.0-incubating-SNAPSHOT/provisionr-rundeck-0.5.0-incubating-SNAPSHOT-sources.jar
[JENKINS] Archiving <https://builds.apache.org/job/provisionr-master/ws/integration/rundeck/target/classes/features.xml>
to org.apache.provisionr/provisionr-rundeck/0.5.0-incubating-SNAPSHOT/provisionr-rundeck-0.5.0-incubating-SNAPSHOT-features.xml
[JENKINS] Archiving <https://builds.apache.org/job/provisionr-master/ws/karaf/assembly/pom.xml>
to org.apache.provisionr/provisionr-assembly/0.5.0-incubating-SNAPSHOT/provisionr-assembly-0.5.0-incubating-SNAPSHOT.pom
[JENKINS] Archiving <https://builds.apache.org/job/provisionr-master/ws/karaf/assembly/target/provisionr-assembly-0.5.0-incubating-SNAPSHOT.jar>
to org.apache.provisionr/provisionr-assembly/0.5.0-incubating-SNAPSHOT/provisionr-assembly-0.5.0-incubating-SNAPSHOT.jar
[JENKINS] Archiving <https://builds.apache.org/job/provisionr-master/ws/karaf/assembly/target/provisionr-assembly-0.5.0-incubating-SNAPSHOT-sources.jar>
to org.apache.provisionr/provisionr-assembly/0.5.0-incubating-SNAPSHOT/provisionr-assembly-0.5.0-incubating-SNAPSHOT-sources.jar
[JENKINS] Archiving <https://builds.apache.org/job/provisionr-master/ws/karaf/assembly/target/provisionr-0.5.0-incubating-SNAPSHOT.tar.gz>
to org.apache.provisionr/provisionr-assembly/0.5.0-incubating-SNAPSHOT/provisionr-assembly-0.5.0-incubating-SNAPSHOT.tar.gz
[JENKINS] Archiving <https://builds.apache.org/job/provisionr-master/ws/pom.xml> to
org.apache.provisionr/provisionr-aggregator/0.5.0-incubating-SNAPSHOT/provisionr-aggregator-0.5.0-incubating-SNAPSHOT.pom
[JENKINS] Archiving <https://builds.apache.org/job/provisionr-master/ws/parent/pom.xml>
to org.apache.provisionr/provisionr-parent/0.5.0-incubating-SNAPSHOT/provisionr-parent-0.5.0-incubating-SNAPSHOT.pom
[JENKINS] Archiving <https://builds.apache.org/job/provisionr-master/ws/activiti/database/pom.xml>
to org.apache.provisionr/activiti-database/0.5.0-incubating-SNAPSHOT/activiti-database-0.5.0-incubating-SNAPSHOT.pom
[JENKINS] Archiving <https://builds.apache.org/job/provisionr-master/ws/activiti/database/target/activiti-database-0.5.0-incubating-SNAPSHOT.jar>
to org.apache.provisionr/activiti-database/0.5.0-incubating-SNAPSHOT/activiti-database-0.5.0-incubating-SNAPSHOT.jar
[JENKINS] Archiving <https://builds.apache.org/job/provisionr-master/ws/activiti/database/target/activiti-database-0.5.0-incubating-SNAPSHOT-sources.jar>
to org.apache.provisionr/activiti-database/0.5.0-incubating-SNAPSHOT/activiti-database-0.5.0-incubating-SNAPSHOT-sources.jar
[JENKINS] Archiving <https://builds.apache.org/job/provisionr-master/ws/api/pom.xml>
to org.apache.provisionr/provisionr-api/0.5.0-incubating-SNAPSHOT/provisionr-api-0.5.0-incubating-SNAPSHOT.pom
[JENKINS] Archiving <https://builds.apache.org/job/provisionr-master/ws/api/target/provisionr-api-0.5.0-incubating-SNAPSHOT.jar>
to org.apache.provisionr/provisionr-api/0.5.0-incubating-SNAPSHOT/provisionr-api-0.5.0-incubating-SNAPSHOT.jar
[JENKINS] Archiving <https://builds.apache.org/job/provisionr-master/ws/api/target/provisionr-api-0.5.0-incubating-SNAPSHOT-sources.jar>
to org.apache.provisionr/provisionr-api/0.5.0-incubating-SNAPSHOT/provisionr-api-0.5.0-incubating-SNAPSHOT-sources.jar
[JENKINS] Archiving <https://builds.apache.org/job/provisionr-master/ws/activiti/commands/pom.xml>
to org.apache.provisionr/activiti-karaf-commands/0.5.0-incubating-SNAPSHOT/activiti-karaf-commands-0.5.0-incubating-SNAPSHOT.pom
[JENKINS] Archiving <https://builds.apache.org/job/provisionr-master/ws/activiti/commands/target/activiti-karaf-commands-0.5.0-incubating-SNAPSHOT.jar>
to org.apache.provisionr/activiti-karaf-commands/0.5.0-incubating-SNAPSHOT/activiti-karaf-commands-0.5.0-incubating-SNAPSHOT.jar
[JENKINS] Archiving <https://builds.apache.org/job/provisionr-master/ws/activiti/commands/target/activiti-karaf-commands-0.5.0-incubating-SNAPSHOT-sources.jar>
to org.apache.provisionr/activiti-karaf-commands/0.5.0-incubating-SNAPSHOT/activiti-karaf-commands-0.5.0-incubating-SNAPSHOT-sources.jar
[JENKINS] Archiving <https://builds.apache.org/job/provisionr-master/ws/karaf/commands/pom.xml>
to org.apache.provisionr/provisionr-commands/0.5.0-incubating-SNAPSHOT/provisionr-commands-0.5.0-incubating-SNAPSHOT.pom
[JENKINS] Archiving <https://builds.apache.org/job/provisionr-master/ws/karaf/commands/target/provisionr-commands-0.5.0-incubating-SNAPSHOT.jar>
to org.apache.provisionr/provisionr-commands/0.5.0-incubating-SNAPSHOT/provisionr-commands-0.5.0-incubating-SNAPSHOT.jar
[JENKINS] Archiving <https://builds.apache.org/job/provisionr-master/ws/karaf/commands/target/provisionr-commands-0.5.0-incubating-SNAPSHOT-sources.jar>
to org.apache.provisionr/provisionr-commands/0.5.0-incubating-SNAPSHOT/provisionr-commands-0.5.0-incubating-SNAPSHOT-sources.jar
channel stopped
Archiving artifacts
Maven RedeployPublisher use remote ubuntu3 maven settings from : /home/jenkins/.m2/settings.xml
[INFO] Deployment in https://repository.apache.org/content/repositories/snapshots (id=apache.snapshots.https,uniqueVersion=true)
Deploying the main artifact jenkins-5788147936913370962activiti-database-0.5.0-incubating-SNAPSHOT.jar
Downloading: https://repository.apache.org/content/repositories/snapshots/org/apache/provisionr/activiti-database/0.5.0-incubating-SNAPSHOT/maven-metadata.xml
Downloaded: https://repository.apache.org/content/repositories/snapshots/org/apache/provisionr/activiti-database/0.5.0-incubating-SNAPSHOT/maven-metadata.xml
(2 KB at 0.0 KB/sec)
Uploading: https://repository.apache.org/content/repositories/snapshots/org/apache/provisionr/activiti-database/0.5.0-incubating-SNAPSHOT/activiti-database-0.5.0-incubating-20131110.073800-111.jar
Uploaded: https://repository.apache.org/content/repositories/snapshots/org/apache/provisionr/activiti-database/0.5.0-incubating-SNAPSHOT/activiti-database-0.5.0-incubating-20131110.073800-111.jar
(539 KB at 7.6 KB/sec)
Uploading: https://repository.apache.org/content/repositories/snapshots/org/apache/provisionr/activiti-database/0.5.0-incubating-SNAPSHOT/activiti-database-0.5.0-incubating-20131110.073800-111.pom
Uploaded: https://repository.apache.org/content/repositories/snapshots/org/apache/provisionr/activiti-database/0.5.0-incubating-SNAPSHOT/activiti-database-0.5.0-incubating-20131110.073800-111.pom
(3 KB at 20.3 KB/sec)
Downloading: https://repository.apache.org/content/repositories/snapshots/org/apache/provisionr/activiti-database/maven-metadata.xml
Downloaded: https://repository.apache.org/content/repositories/snapshots/org/apache/provisionr/activiti-database/maven-metadata.xml
(309 B at 0.0 KB/sec)
Uploading: https://repository.apache.org/content/repositories/snapshots/org/apache/provisionr/activiti-database/0.5.0-incubating-SNAPSHOT/maven-metadata.xml
Uploaded: https://repository.apache.org/content/repositories/snapshots/org/apache/provisionr/activiti-database/0.5.0-incubating-SNAPSHOT/maven-metadata.xml
(2 KB at 0.8 KB/sec)
Uploading: https://repository.apache.org/content/repositories/snapshots/org/apache/provisionr/activiti-database/maven-metadata.xml
Uploaded: https://repository.apache.org/content/repositories/snapshots/org/apache/provisionr/activiti-database/maven-metadata.xml
(309 B at 1.0 KB/sec)
Deploying the main artifact jenkins-1353652811030506273activiti-database-0.5.0-incubating-SNAPSHOT-sources.jar
Uploading: https://repository.apache.org/content/repositories/snapshots/org/apache/provisionr/activiti-database/0.5.0-incubating-SNAPSHOT/activiti-database-0.5.0-incubating-20131110.073800-111-sources.jar
Uploaded: https://repository.apache.org/content/repositories/snapshots/org/apache/provisionr/activiti-database/0.5.0-incubating-SNAPSHOT/activiti-database-0.5.0-incubating-20131110.073800-111-sources.jar
(6 KB at 0.4 KB/sec)
Uploading: https://repository.apache.org/content/repositories/snapshots/org/apache/provisionr/activiti-database/0.5.0-incubating-SNAPSHOT/maven-metadata.xml
Uploaded: https://repository.apache.org/content/repositories/snapshots/org/apache/provisionr/activiti-database/0.5.0-incubating-SNAPSHOT/maven-metadata.xml
(2 KB at 6.1 KB/sec)
[INFO] Deployment in https://repository.apache.org/content/repositories/snapshots (id=apache.snapshots.https,uniqueVersion=true)
Deploying the main artifact jenkins-6078657511757644734activiti-karaf-commands-0.5.0-incubating-SNAPSHOT.jar
Downloading: https://repository.apache.org/content/repositories/snapshots/org/apache/provisionr/activiti-karaf-commands/0.5.0-incubating-SNAPSHOT/maven-metadata.xml
Downloaded: https://repository.apache.org/content/repositories/snapshots/org/apache/provisionr/activiti-karaf-commands/0.5.0-incubating-SNAPSHOT/maven-metadata.xml
(833 B at 0.0 KB/sec)
Uploading: https://repository.apache.org/content/repositories/snapshots/org/apache/provisionr/activiti-karaf-commands/0.5.0-incubating-SNAPSHOT/activiti-karaf-commands-0.5.0-incubating-20131110.074705-111.jar
Uploaded: https://repository.apache.org/content/repositories/snapshots/org/apache/provisionr/activiti-karaf-commands/0.5.0-incubating-SNAPSHOT/activiti-karaf-commands-0.5.0-incubating-20131110.074705-111.jar
(48 KB at 1.4 KB/sec)
Uploading: https://repository.apache.org/content/repositories/snapshots/org/apache/provisionr/activiti-karaf-commands/0.5.0-incubating-SNAPSHOT/activiti-karaf-commands-0.5.0-incubating-20131110.074705-111.pom
Uploaded: https://repository.apache.org/content/repositories/snapshots/org/apache/provisionr/activiti-karaf-commands/0.5.0-incubating-SNAPSHOT/activiti-karaf-commands-0.5.0-incubating-20131110.074705-111.pom
(7 KB at 57.3 KB/sec)
Downloading: https://repository.apache.org/content/repositories/snapshots/org/apache/provisionr/activiti-karaf-commands/maven-metadata.xml
Downloaded: https://repository.apache.org/content/repositories/snapshots/org/apache/provisionr/activiti-karaf-commands/maven-metadata.xml
(315 B at 0.0 KB/sec)
Uploading: https://repository.apache.org/content/repositories/snapshots/org/apache/provisionr/activiti-karaf-commands/0.5.0-incubating-SNAPSHOT/maven-metadata.xml
Uploaded: https://repository.apache.org/content/repositories/snapshots/org/apache/provisionr/activiti-karaf-commands/0.5.0-incubating-SNAPSHOT/maven-metadata.xml
(833 B at 0.2 KB/sec)
Uploading: https://repository.apache.org/content/repositories/snapshots/org/apache/provisionr/activiti-karaf-commands/maven-metadata.xml
ERROR: Failed to deploy metadata: Could not transfer metadata org.apache.provisionr:activiti-karaf-commands/maven-metadata.xml
from/to apache.snapshots.https (https://repository.apache.org/content/repositories/snapshots):
The target server failed to respond
org.apache.maven.artifact.deployer.ArtifactDeploymentException: Failed to deploy metadata:
Could not transfer metadata org.apache.provisionr:activiti-karaf-commands/maven-metadata.xml
from/to apache.snapshots.https (https://repository.apache.org/content/repositories/snapshots):
The target server failed to respond
	at org.apache.maven.artifact.deployer.DefaultArtifactDeployer.deploy(DefaultArtifactDeployer.java:143)
	at hudson.maven.reporters.MavenArtifactRecord.deploy(MavenArtifactRecord.java:191)
	at hudson.maven.RedeployPublisher.perform(RedeployPublisher.java:176)
	at hudson.tasks.BuildStepMonitor$1.perform(BuildStepMonitor.java:20)
	at hudson.model.AbstractBuild$AbstractBuildExecution.perform(AbstractBuild.java:781)
	at hudson.model.AbstractBuild$AbstractBuildExecution.performAllBuildSteps(AbstractBuild.java:753)
	at hudson.maven.MavenModuleSetBuild$MavenModuleSetBuildExecution.post2(MavenModuleSetBuild.java:1020)
	at hudson.model.AbstractBuild$AbstractBuildExecution.post(AbstractBuild.java:706)
	at hudson.model.Run.execute(Run.java:1690)
	at hudson.maven.MavenModuleSetBuild.run(MavenModuleSetBuild.java:509)
	at hudson.model.ResourceController.execute(ResourceController.java:88)
	at hudson.model.Executor.run(Executor.java:230)
Caused by: org.eclipse.aether.deployment.DeploymentException: Failed to deploy metadata: Could
not transfer metadata org.apache.provisionr:activiti-karaf-commands/maven-metadata.xml from/to
apache.snapshots.https (https://repository.apache.org/content/repositories/snapshots): The
target server failed to respond
	at org.eclipse.aether.internal.impl.DefaultDeployer.deploy(DefaultDeployer.java:372)
	at org.eclipse.aether.internal.impl.DefaultDeployer.deploy(DefaultDeployer.java:269)
	at org.eclipse.aether.internal.impl.DefaultRepositorySystem.deploy(DefaultRepositorySystem.java:413)
	at org.apache.maven.artifact.deployer.DefaultArtifactDeployer.deploy(DefaultArtifactDeployer.java:139)
	... 11 more
Caused by: org.eclipse.aether.transfer.MetadataTransferException: Could not transfer metadata
org.apache.provisionr:activiti-karaf-commands/maven-metadata.xml from/to apache.snapshots.https
(https://repository.apache.org/content/repositories/snapshots): The target server failed to
respond
	at org.eclipse.aether.connector.wagon.WagonRepositoryConnector$5.wrap(WagonRepositoryConnector.java:995)
	at org.eclipse.aether.connector.wagon.WagonRepositoryConnector$5.wrap(WagonRepositoryConnector.java:983)
	at org.eclipse.aether.connector.wagon.WagonRepositoryConnector$PutTask.run(WagonRepositoryConnector.java:895)
	at org.eclipse.aether.connector.wagon.WagonRepositoryConnector.put(WagonRepositoryConnector.java:530)
	at org.eclipse.aether.internal.impl.DefaultDeployer.deploy(DefaultDeployer.java:366)
	... 14 more
Caused by: org.apache.maven.wagon.TransferFailedException: The target server failed to respond
	at org.apache.maven.wagon.shared.http4.AbstractHttpClientWagon.put(AbstractHttpClientWagon.java:580)
	at org.apache.maven.wagon.shared.http4.AbstractHttpClientWagon.put(AbstractHttpClientWagon.java:524)
	at org.apache.maven.wagon.shared.http4.AbstractHttpClientWagon.put(AbstractHttpClientWagon.java:505)
	at org.apache.maven.wagon.shared.http4.AbstractHttpClientWagon.put(AbstractHttpClientWagon.java:485)
	at org.eclipse.aether.connector.wagon.WagonRepositoryConnector$PutTask.run(WagonRepositoryConnector.java:871)
	... 16 more
Caused by: org.apache.http.NoHttpResponseException: The target server failed to respond
	at org.apache.http.impl.conn.DefaultHttpResponseParser.parseHead(DefaultHttpResponseParser.java:95)
	at org.apache.http.impl.conn.DefaultHttpResponseParser.parseHead(DefaultHttpResponseParser.java:62)
	at org.apache.http.impl.io.AbstractMessageParser.parse(AbstractMessageParser.java:254)
	at org.apache.http.impl.AbstractHttpClientConnection.receiveResponseHeader(AbstractHttpClientConnection.java:289)
	at org.apache.http.impl.conn.DefaultClientConnection.receiveResponseHeader(DefaultClientConnection.java:252)
	at org.apache.http.impl.conn.ManagedClientConnectionImpl.receiveResponseHeader(ManagedClientConnectionImpl.java:191)
	at org.apache.http.protocol.HttpRequestExecutor.doReceiveResponse(HttpRequestExecutor.java:300)
	at org.apache.http.protocol.HttpRequestExecutor.execute(HttpRequestExecutor.java:127)
	at org.apache.http.impl.client.DefaultRequestDirector.tryExecute(DefaultRequestDirector.java:715)
	at org.apache.http.impl.client.DefaultRequestDirector.execute(DefaultRequestDirector.java:520)
	at org.apache.http.impl.client.AbstractHttpClient.execute(AbstractHttpClient.java:906)
	at org.apache.http.impl.client.AbstractHttpClient.execute(AbstractHttpClient.java:805)
	at org.apache.maven.wagon.shared.http4.AbstractHttpClientWagon.execute(AbstractHttpClientWagon.java:746)
	at org.apache.maven.wagon.shared.http4.AbstractHttpClientWagon.put(AbstractHttpClientWagon.java:574)
	... 20 more
[INFO] Deployment failed after 15 min
Build step 'Deploy artifacts to Maven repository' changed build result to FAILURE

Mime
View raw message