provisionr-dev mailing list archives

Site index · List index
Message view « Date » · « Thread »
Top « Date » · « Thread »
From Apache Jenkins Server <jenk...@builds.apache.org>
Subject Build failed in Jenkins: provisionr-master #168
Date Tue, 05 Nov 2013 10:48:39 GMT
See <https://builds.apache.org/job/provisionr-master/168/>

------------------------------------------
[...truncated 4483 lines...]
2013-11-05 10:35:40,878 | INFO  | Executor: 1      | PropertyPlaceholderConfigurer    | .support.PropertiesLoaderSupport
 177 | 90 - org.springframework.core - 3.1.4.RELEASE | Loading properties file from OSGi resource[classpath:ui.properties|bnd.id=146|bnd.sym=org.apache.provisionr.activiti-karaf-web-explorer]
2013-11-05 10:35:40,897 | INFO  | Executor: 1      | DefaultListableBeanFactory       | pport.DefaultListableBeanFactory
 577 | 92 - org.springframework.beans - 3.1.4.RELEASE | Pre-instantiating singletons in org.springframework.beans.factory.support.DefaultListableBeanFactory@19de0ec:
defining beans [processEngine,repositoryService,runtimeService,taskService,historyService,managementService,identityService,demoDataGenerator,activitiLoginHandler,activitiUiPropertyPlaceholder,navigatorManager,attachmentRendererManager,formPropertyRendererManager,variableRendererManager,componentFactories,userCache,navigationFragmentChangeListener,mainWindow,explorerApp,i18nManager,notificationManager,viewManager];
root of factory hierarchy
2013-11-05 10:35:40,959 | INFO  | Executor: 1      | OsgiServiceProxyFactoryBean      | al.aop.ServiceDynamicInterceptor
 470 | 134 - org.springframework.osgi.core - 1.2.1 | Looking for mandatory OSGi service dependency
for bean [processEngine] matching filter (objectClass=org.activiti.engine.ProcessEngine)
2013-11-05 10:35:40,961 | INFO  | Executor: 1      | OsgiServiceProxyFactoryBean      | al.aop.ServiceDynamicInterceptor
 476 | 134 - org.springframework.osgi.core - 1.2.1 | Found mandatory OSGi service for bean
[processEngine]
2013-11-05 10:35:41,133 | INFO  | Executor: 1      | giBundleXmlWebApplicationContext | ractOsgiBundleApplicationContext
 327 | 91 - org.springframework.context - 3.1.4.RELEASE | Publishing application context as
OSGi service with properties {org.springframework.context.service.name=org.apache.provisionr.activiti-karaf-web-explorer,
Bundle-SymbolicName=org.apache.provisionr.activiti-karaf-web-explorer, Bundle-Version=0.5.0.incubating-SNAPSHOT}
2013-11-05 10:35:41,140 | INFO  | Executor: 1      | ContextLoader                    | mework.web.context.ContextLoader
 312 | 137 - org.springframework.web - 3.1.4.RELEASE | Root WebApplicationContext: initialization
completed in 587 ms
2013-11-05 10:35:41,140 | INFO  | Executor: 1      | ContextHandler                   | ty.server.handler.ContextHandler
 744 | 59 - org.eclipse.jetty.util - 7.6.8.v20121106 | started HttpServiceContext{httpContext=org.ops4j.pax.web.extender.war.internal.WebAppWebContainerContext@e5394c}
2013-11-05 10:35:45,894 | INFO  | qtp13216403-72   | TrieBasedUserCache               | xplorer.cache.TrieBasedUserCache
  73 | 146 - org.apache.provisionr.activiti-karaf-web-explorer - 0.5.0.incubating-SNAPSHOT
| Caching users 0 to 25
2013-11-05 10:35:46,009 | INFO  | 3)-67.195.138.61 | TestBundleObserver               | tender.intern.TestBundleObserver
 101 | 159 - org.ops4j.pax.exam.extender.service - 2.6.0 | Unregistered testcase [org.ops4j.pax.exam.raw.extender.intern.Probe@16bc07a.]
Tests run: 1, Failures: 0, Errors: 0, Skipped: 0, Time elapsed: 22.49 sec

Results :

Tests run: 1, Failures: 0, Errors: 0, Skipped: 0

[JENKINS] Recording test results
[INFO] 
[INFO] --- maven-jar-plugin:2.4:jar (default-jar) @ provisionr-assembly-tests ---
[INFO] Building jar: <https://builds.apache.org/job/provisionr-master/ws/karaf/assembly-tests/target/provisionr-assembly-tests-0.5.0-incubating-SNAPSHOT.jar>
[INFO] 
[INFO] --- maven-site-plugin:3.2:attach-descriptor (attach-descriptor) @ provisionr-assembly-tests
---
[WARNING] Failed to getClass for org.apache.maven.plugin.source.SourceJarMojo
[INFO] 
[INFO] --- maven-source-plugin:2.2.1:jar (default) @ provisionr-assembly-tests ---
[INFO] Building jar: <https://builds.apache.org/job/provisionr-master/ws/karaf/assembly-tests/target/provisionr-assembly-tests-0.5.0-incubating-SNAPSHOT-sources.jar>
[INFO] 
[INFO] --- apache-rat-plugin:0.9:check (default) @ provisionr-assembly-tests ---
[INFO] 51 implicit excludes (use -debug for more details).
[INFO] Exclude: **/*.md
[INFO] Exclude: NOTICE
[INFO] Exclude: .git/**
[INFO] Exclude: .repository/**
[INFO] Exclude: .gitignore
[INFO] Exclude: .idea/**
[INFO] Exclude: **/*.iml
[INFO] Exclude: **/*.project
[INFO] Exclude: **/*.classpath
[INFO] Exclude: **/*.prefs
[INFO] Exclude: **/id_rsa_test
[INFO] Exclude: **/id_rsa_test.pub
[INFO] Exclude: **/*.bpmn20.xml
[INFO] Exclude: **/*.activiti
[INFO] Exclude: **/*.csv
[INFO] Exclude: **/target/**
[INFO] 3 resources included (use -debug for more details)
[INFO] Rat check: Summary of files. Unapproved: 0 unknown: 0 generated: 0 approved: 3 licence.
[INFO]                                                                         
[INFO] ------------------------------------------------------------------------
[INFO] Building Apache Provisionr :: Aggregator 0.5.0-incubating-SNAPSHOT
[INFO] ------------------------------------------------------------------------
[INFO] 
[INFO] --- maven-clean-plugin:2.5:clean (default-clean) @ provisionr-aggregator ---
[INFO] 
[INFO] --- maven-remote-resources-plugin:1.4:process (default) @ provisionr-aggregator ---
[INFO] 
[INFO] --- maven-site-plugin:3.2:attach-descriptor (attach-descriptor) @ provisionr-aggregator
---
[WARNING] Failed to getClass for org.apache.maven.plugin.source.SourceJarMojo
[INFO] 
[INFO] --- maven-source-plugin:2.2.1:jar (default) @ provisionr-aggregator ---
[INFO] 
[INFO] --- apache-rat-plugin:0.9:check (default) @ provisionr-aggregator ---
[INFO] 70 implicit excludes (use -debug for more details).
[INFO] Exclude: **/*.md
[INFO] Exclude: NOTICE
[INFO] Exclude: .git/**
[INFO] Exclude: .repository/**
[INFO] Exclude: .gitignore
[INFO] Exclude: .idea/**
[INFO] Exclude: **/*.iml
[INFO] Exclude: **/*.project
[INFO] Exclude: **/*.classpath
[INFO] Exclude: **/*.prefs
[INFO] Exclude: **/id_rsa_test
[INFO] Exclude: **/id_rsa_test.pub
[INFO] Exclude: **/*.bpmn20.xml
[INFO] Exclude: **/*.activiti
[INFO] Exclude: **/*.csv
[INFO] Exclude: **/target/**
[INFO] 7 resources included (use -debug for more details)
[INFO] Rat check: Summary of files. Unapproved: 0 unknown: 0 generated: 0 approved: 5 licence.
[INFO] 
[INFO] --- maven-install-plugin:2.3.1:install (default-install) @ provisionr-aggregator ---
[INFO] Installing <https://builds.apache.org/job/provisionr-master/ws/pom.xml> to /home/jenkins/jenkins-slave/maven-repositories/1/org/apache/provisionr/provisionr-aggregator/0.5.0-incubating-SNAPSHOT/provisionr-aggregator-0.5.0-incubating-SNAPSHOT.pom
[INFO] ------------------------------------------------------------------------
[INFO] Reactor Summary:
[INFO] 
[INFO] Apache Provisionr :: Parent ....................... SUCCESS [1:12.085s]
[INFO] Apache Provisionr :: API .......................... SUCCESS [31.381s]
[INFO] Apache Provisionr :: Activiti Database ............ SUCCESS [52.073s]
[INFO] Apache Provisionr :: Test Support ................. SUCCESS [51.940s]
[INFO] Apache Provisionr :: Core ......................... SUCCESS [32.620s]
[INFO] Apache Provisionr :: Examples ..................... SUCCESS [19.867s]
[INFO] Apache Provisionr :: Web Console & REST API ....... SUCCESS [18.820s]
[INFO] Apache Provisionr :: Amazon ....................... SUCCESS [26.998s]
[INFO] Apache Provisionr :: CloudStack ................... SUCCESS [13.833s]
[INFO] Apache Provisionr :: Rundeck ...................... SUCCESS [12.146s]
[INFO] Apache Provisionr :: Activiti Karaf :: Commands ... SUCCESS [15.827s]
[INFO] Apache Provisionr :: Activiti Karaf :: Explorer ... SUCCESS [35.151s]
[INFO] Apache Provisionr :: Karaf Commands ............... SUCCESS [15.585s]
[INFO] Apache Provisionr :: Karaf Branding ............... SUCCESS [8.389s]
[INFO] Apache Provisionr :: Karaf Features ............... SUCCESS [21.786s]
[INFO] Apache Provisionr :: Amazon Integration Tests ..... SUCCESS [14.702s]
[INFO] Apache Provisionr :: CloudStack Integration Tests . SUCCESS [7.978s]
[INFO] Apache Provisionr :: Custom Karaf Distribution .... SUCCESS [24.835s]
[INFO] Apache Provisionr :: Custom Karaf Distribution Tests  SUCCESS [33.311s]
[INFO] Apache Provisionr :: Aggregator ................... SUCCESS [6.495s]
[INFO] ------------------------------------------------------------------------
[INFO] BUILD SUCCESS
[INFO] ------------------------------------------------------------------------
[INFO] Total time: 52:29.515s
[INFO] Finished at: Tue Nov 05 10:45:55 UTC 2013
[INFO] Final Memory: 51M/265M
[INFO] ------------------------------------------------------------------------
Waiting for Jenkins to finish collecting data
[JENKINS] Archiving <https://builds.apache.org/job/provisionr-master/ws/test-support/pom.xml>
to org.apache.provisionr/provisionr-test-support/0.5.0-incubating-SNAPSHOT/provisionr-test-support-0.5.0-incubating-SNAPSHOT.pom
[JENKINS] Archiving <https://builds.apache.org/job/provisionr-master/ws/test-support/target/provisionr-test-support-0.5.0-incubating-SNAPSHOT.jar>
to org.apache.provisionr/provisionr-test-support/0.5.0-incubating-SNAPSHOT/provisionr-test-support-0.5.0-incubating-SNAPSHOT.jar
[JENKINS] Archiving <https://builds.apache.org/job/provisionr-master/ws/test-support/target/provisionr-test-support-0.5.0-incubating-SNAPSHOT-sources.jar>
to org.apache.provisionr/provisionr-test-support/0.5.0-incubating-SNAPSHOT/provisionr-test-support-0.5.0-incubating-SNAPSHOT-sources.jar
[JENKINS] Archiving <https://builds.apache.org/job/provisionr-master/ws/test-support/target/features.xml>
to org.apache.provisionr/provisionr-test-support/0.5.0-incubating-SNAPSHOT/provisionr-test-support-0.5.0-incubating-SNAPSHOT-features.xml
[JENKINS] Archiving <https://builds.apache.org/job/provisionr-master/ws/activiti/explorer/pom.xml>
to org.apache.provisionr/activiti-karaf-web-explorer/0.5.0-incubating-SNAPSHOT/activiti-karaf-web-explorer-0.5.0-incubating-SNAPSHOT.pom
[JENKINS] Archiving <https://builds.apache.org/job/provisionr-master/ws/activiti/explorer/target/activiti-karaf-web-explorer-0.5.0-incubating-SNAPSHOT.war>
to org.apache.provisionr/activiti-karaf-web-explorer/0.5.0-incubating-SNAPSHOT/activiti-karaf-web-explorer-0.5.0-incubating-SNAPSHOT.war
[JENKINS] Archiving <https://builds.apache.org/job/provisionr-master/ws/activiti/explorer/target/activiti-karaf-web-explorer-0.5.0-incubating-SNAPSHOT-sources.jar>
to org.apache.provisionr/activiti-karaf-web-explorer/0.5.0-incubating-SNAPSHOT/activiti-karaf-web-explorer-0.5.0-incubating-SNAPSHOT-sources.jar
[JENKINS] Archiving <https://builds.apache.org/job/provisionr-master/ws/providers/cloudstack/pom.xml>
to org.apache.provisionr/provisionr-cloudstack/0.5.0-incubating-SNAPSHOT/provisionr-cloudstack-0.5.0-incubating-SNAPSHOT.pom
[JENKINS] Archiving <https://builds.apache.org/job/provisionr-master/ws/providers/cloudstack/target/provisionr-cloudstack-0.5.0-incubating-SNAPSHOT.jar>
to org.apache.provisionr/provisionr-cloudstack/0.5.0-incubating-SNAPSHOT/provisionr-cloudstack-0.5.0-incubating-SNAPSHOT.jar
[JENKINS] Archiving <https://builds.apache.org/job/provisionr-master/ws/providers/cloudstack/target/provisionr-cloudstack-0.5.0-incubating-SNAPSHOT-sources.jar>
to org.apache.provisionr/provisionr-cloudstack/0.5.0-incubating-SNAPSHOT/provisionr-cloudstack-0.5.0-incubating-SNAPSHOT-sources.jar
[JENKINS] Archiving <https://builds.apache.org/job/provisionr-master/ws/providers/cloudstack/target/classes/features.xml>
to org.apache.provisionr/provisionr-cloudstack/0.5.0-incubating-SNAPSHOT/provisionr-cloudstack-0.5.0-incubating-SNAPSHOT-features.xml
[JENKINS] Archiving <https://builds.apache.org/job/provisionr-master/ws/providers/cloudstack/target/classes/org.apache.provisionr.cloudstack.cfg>
to org.apache.provisionr/provisionr-cloudstack/0.5.0-incubating-SNAPSHOT/provisionr-cloudstack-0.5.0-incubating-SNAPSHOT-defaults.cfg
[JENKINS] Archiving <https://builds.apache.org/job/provisionr-master/ws/karaf/features/pom.xml>
to org.apache.provisionr/provisionr-features/0.5.0-incubating-SNAPSHOT/provisionr-features-0.5.0-incubating-SNAPSHOT.pom
[JENKINS] Archiving <https://builds.apache.org/job/provisionr-master/ws/karaf/features/target/provisionr-features-0.5.0-incubating-SNAPSHOT.jar>
to org.apache.provisionr/provisionr-features/0.5.0-incubating-SNAPSHOT/provisionr-features-0.5.0-incubating-SNAPSHOT.jar
[JENKINS] Archiving <https://builds.apache.org/job/provisionr-master/ws/karaf/features/target/provisionr-features-0.5.0-incubating-SNAPSHOT-sources.jar>
to org.apache.provisionr/provisionr-features/0.5.0-incubating-SNAPSHOT/provisionr-features-0.5.0-incubating-SNAPSHOT-sources.jar
[JENKINS] Archiving <https://builds.apache.org/job/provisionr-master/ws/karaf/features/target/features.xml>
to org.apache.provisionr/provisionr-features/0.5.0-incubating-SNAPSHOT/provisionr-features-0.5.0-incubating-SNAPSHOT-features.xml
[JENKINS] Archiving <https://builds.apache.org/job/provisionr-master/ws/providers/cloudstack-tests/pom.xml>
to org.apache.provisionr/provisionr-cloudstack-tests/0.5.0-incubating-SNAPSHOT/provisionr-cloudstack-tests-0.5.0-incubating-SNAPSHOT.pom
[JENKINS] Archiving <https://builds.apache.org/job/provisionr-master/ws/providers/cloudstack-tests/target/provisionr-cloudstack-tests-0.5.0-incubating-SNAPSHOT.jar>
to org.apache.provisionr/provisionr-cloudstack-tests/0.5.0-incubating-SNAPSHOT/provisionr-cloudstack-tests-0.5.0-incubating-SNAPSHOT.jar
[JENKINS] Archiving <https://builds.apache.org/job/provisionr-master/ws/providers/cloudstack-tests/target/provisionr-cloudstack-tests-0.5.0-incubating-SNAPSHOT-sources.jar>
to org.apache.provisionr/provisionr-cloudstack-tests/0.5.0-incubating-SNAPSHOT/provisionr-cloudstack-tests-0.5.0-incubating-SNAPSHOT-sources.jar
[JENKINS] Archiving <https://builds.apache.org/job/provisionr-master/ws/console/pom.xml>
to org.apache.provisionr/provisionr-console/0.5.0-incubating-SNAPSHOT/provisionr-console-0.5.0-incubating-SNAPSHOT.pom
[JENKINS] Archiving <https://builds.apache.org/job/provisionr-master/ws/console/target/provisionr-console-0.5.0-incubating-SNAPSHOT.jar>
to org.apache.provisionr/provisionr-console/0.5.0-incubating-SNAPSHOT/provisionr-console-0.5.0-incubating-SNAPSHOT.jar
[JENKINS] Archiving <https://builds.apache.org/job/provisionr-master/ws/console/target/provisionr-console-0.5.0-incubating-SNAPSHOT-sources.jar>
to org.apache.provisionr/provisionr-console/0.5.0-incubating-SNAPSHOT/provisionr-console-0.5.0-incubating-SNAPSHOT-sources.jar
[JENKINS] Archiving <https://builds.apache.org/job/provisionr-master/ws/console/target/classes/features.xml>
to org.apache.provisionr/provisionr-console/0.5.0-incubating-SNAPSHOT/provisionr-console-0.5.0-incubating-SNAPSHOT-features.xml
[JENKINS] Archiving <https://builds.apache.org/job/provisionr-master/ws/console/target/classes/org.apache.provisionr.console.cfg>
to org.apache.provisionr/provisionr-console/0.5.0-incubating-SNAPSHOT/provisionr-console-0.5.0-incubating-SNAPSHOT-defaults.cfg
[JENKINS] Archiving <https://builds.apache.org/job/provisionr-master/ws/karaf/branding/pom.xml>
to org.apache.provisionr/provisionr-branding/0.5.0-incubating-SNAPSHOT/provisionr-branding-0.5.0-incubating-SNAPSHOT.pom
[JENKINS] Archiving <https://builds.apache.org/job/provisionr-master/ws/karaf/branding/target/provisionr-branding-0.5.0-incubating-SNAPSHOT.jar>
to org.apache.provisionr/provisionr-branding/0.5.0-incubating-SNAPSHOT/provisionr-branding-0.5.0-incubating-SNAPSHOT.jar
[JENKINS] Archiving <https://builds.apache.org/job/provisionr-master/ws/karaf/branding/target/provisionr-branding-0.5.0-incubating-SNAPSHOT-sources.jar>
to org.apache.provisionr/provisionr-branding/0.5.0-incubating-SNAPSHOT/provisionr-branding-0.5.0-incubating-SNAPSHOT-sources.jar
[JENKINS] Archiving <https://builds.apache.org/job/provisionr-master/ws/examples/pom.xml>
to org.apache.provisionr/provisionr-examples/0.5.0-incubating-SNAPSHOT/provisionr-examples-0.5.0-incubating-SNAPSHOT.pom
[JENKINS] Archiving <https://builds.apache.org/job/provisionr-master/ws/examples/target/provisionr-examples-0.5.0-incubating-SNAPSHOT.jar>
to org.apache.provisionr/provisionr-examples/0.5.0-incubating-SNAPSHOT/provisionr-examples-0.5.0-incubating-SNAPSHOT.jar
[JENKINS] Archiving <https://builds.apache.org/job/provisionr-master/ws/examples/target/provisionr-examples-0.5.0-incubating-SNAPSHOT-sources.jar>
to org.apache.provisionr/provisionr-examples/0.5.0-incubating-SNAPSHOT/provisionr-examples-0.5.0-incubating-SNAPSHOT-sources.jar
[JENKINS] Archiving <https://builds.apache.org/job/provisionr-master/ws/examples/target/classes/features.xml>
to org.apache.provisionr/provisionr-examples/0.5.0-incubating-SNAPSHOT/provisionr-examples-0.5.0-incubating-SNAPSHOT-features.xml
[JENKINS] Archiving <https://builds.apache.org/job/provisionr-master/ws/examples/target/classes/org/apache/provisionr/examples/templates/cdh3.xml>
to org.apache.provisionr/provisionr-examples/0.5.0-incubating-SNAPSHOT/provisionr-examples-0.5.0-incubating-SNAPSHOT-cdh3.template
[JENKINS] Archiving <https://builds.apache.org/job/provisionr-master/ws/examples/target/classes/org/apache/provisionr/examples/templates/cdh4.xml>
to org.apache.provisionr/provisionr-examples/0.5.0-incubating-SNAPSHOT/provisionr-examples-0.5.0-incubating-SNAPSHOT-cdh4.template
[JENKINS] Archiving <https://builds.apache.org/job/provisionr-master/ws/examples/target/classes/org/apache/provisionr/examples/templates/jenkins.xml>
to org.apache.provisionr/provisionr-examples/0.5.0-incubating-SNAPSHOT/provisionr-examples-0.5.0-incubating-SNAPSHOT-jenkins.template
[JENKINS] Archiving <https://builds.apache.org/job/provisionr-master/ws/providers/amazon-tests/pom.xml>
to org.apache.provisionr/provisionr-amazon-tests/0.5.0-incubating-SNAPSHOT/provisionr-amazon-tests-0.5.0-incubating-SNAPSHOT.pom
[JENKINS] Archiving <https://builds.apache.org/job/provisionr-master/ws/providers/amazon-tests/target/provisionr-amazon-tests-0.5.0-incubating-SNAPSHOT.jar>
to org.apache.provisionr/provisionr-amazon-tests/0.5.0-incubating-SNAPSHOT/provisionr-amazon-tests-0.5.0-incubating-SNAPSHOT.jar
[JENKINS] Archiving <https://builds.apache.org/job/provisionr-master/ws/providers/amazon-tests/target/provisionr-amazon-tests-0.5.0-incubating-SNAPSHOT-sources.jar>
to org.apache.provisionr/provisionr-amazon-tests/0.5.0-incubating-SNAPSHOT/provisionr-amazon-tests-0.5.0-incubating-SNAPSHOT-sources.jar
[JENKINS] Archiving <https://builds.apache.org/job/provisionr-master/ws/karaf/assembly-tests/pom.xml>
to org.apache.provisionr/provisionr-assembly-tests/0.5.0-incubating-SNAPSHOT/provisionr-assembly-tests-0.5.0-incubating-SNAPSHOT.pom
[JENKINS] Archiving <https://builds.apache.org/job/provisionr-master/ws/karaf/assembly-tests/target/provisionr-assembly-tests-0.5.0-incubating-SNAPSHOT.jar>
to org.apache.provisionr/provisionr-assembly-tests/0.5.0-incubating-SNAPSHOT/provisionr-assembly-tests-0.5.0-incubating-SNAPSHOT.jar
[JENKINS] Archiving <https://builds.apache.org/job/provisionr-master/ws/karaf/assembly-tests/target/provisionr-assembly-tests-0.5.0-incubating-SNAPSHOT-sources.jar>
to org.apache.provisionr/provisionr-assembly-tests/0.5.0-incubating-SNAPSHOT/provisionr-assembly-tests-0.5.0-incubating-SNAPSHOT-sources.jar
[JENKINS] Archiving <https://builds.apache.org/job/provisionr-master/ws/core/pom.xml>
to org.apache.provisionr/provisionr-core/0.5.0-incubating-SNAPSHOT/provisionr-core-0.5.0-incubating-SNAPSHOT.pom
[JENKINS] Archiving <https://builds.apache.org/job/provisionr-master/ws/core/target/provisionr-core-0.5.0-incubating-SNAPSHOT.jar>
to org.apache.provisionr/provisionr-core/0.5.0-incubating-SNAPSHOT/provisionr-core-0.5.0-incubating-SNAPSHOT.jar
[JENKINS] Archiving <https://builds.apache.org/job/provisionr-master/ws/core/target/provisionr-core-0.5.0-incubating-SNAPSHOT-sources.jar>
to org.apache.provisionr/provisionr-core/0.5.0-incubating-SNAPSHOT/provisionr-core-0.5.0-incubating-SNAPSHOT-sources.jar
[JENKINS] Archiving <https://builds.apache.org/job/provisionr-master/ws/core/target/classes/features.xml>
to org.apache.provisionr/provisionr-core/0.5.0-incubating-SNAPSHOT/provisionr-core-0.5.0-incubating-SNAPSHOT-features.xml
[JENKINS] Archiving <https://builds.apache.org/job/provisionr-master/ws/core/target/classes/org.apache.provisionr.cfg>
to org.apache.provisionr/provisionr-core/0.5.0-incubating-SNAPSHOT/provisionr-core-0.5.0-incubating-SNAPSHOT-defaults.cfg
[JENKINS] Archiving <https://builds.apache.org/job/provisionr-master/ws/core/target/classes/org.apache.felix.fileinstall-templates.cfg>
to org.apache.provisionr/provisionr-core/0.5.0-incubating-SNAPSHOT/provisionr-core-0.5.0-incubating-SNAPSHOT-fileinstall.cfg
[JENKINS] Archiving <https://builds.apache.org/job/provisionr-master/ws/providers/amazon/pom.xml>
to org.apache.provisionr/provisionr-amazon/0.5.0-incubating-SNAPSHOT/provisionr-amazon-0.5.0-incubating-SNAPSHOT.pom
[JENKINS] Archiving <https://builds.apache.org/job/provisionr-master/ws/providers/amazon/target/provisionr-amazon-0.5.0-incubating-SNAPSHOT.jar>
to org.apache.provisionr/provisionr-amazon/0.5.0-incubating-SNAPSHOT/provisionr-amazon-0.5.0-incubating-SNAPSHOT.jar
[JENKINS] Archiving <https://builds.apache.org/job/provisionr-master/ws/providers/amazon/target/provisionr-amazon-0.5.0-incubating-SNAPSHOT-sources.jar>
to org.apache.provisionr/provisionr-amazon/0.5.0-incubating-SNAPSHOT/provisionr-amazon-0.5.0-incubating-SNAPSHOT-sources.jar
[JENKINS] Archiving <https://builds.apache.org/job/provisionr-master/ws/providers/amazon/target/classes/features.xml>
to org.apache.provisionr/provisionr-amazon/0.5.0-incubating-SNAPSHOT/provisionr-amazon-0.5.0-incubating-SNAPSHOT-features.xml
[JENKINS] Archiving <https://builds.apache.org/job/provisionr-master/ws/providers/amazon/target/classes/org.apache.provisionr.amazon.cfg>
to org.apache.provisionr/provisionr-amazon/0.5.0-incubating-SNAPSHOT/provisionr-amazon-0.5.0-incubating-SNAPSHOT-defaults.cfg
[JENKINS] Archiving <https://builds.apache.org/job/provisionr-master/ws/integration/rundeck/pom.xml>
to org.apache.provisionr/provisionr-rundeck/0.5.0-incubating-SNAPSHOT/provisionr-rundeck-0.5.0-incubating-SNAPSHOT.pom
[JENKINS] Archiving <https://builds.apache.org/job/provisionr-master/ws/integration/rundeck/target/provisionr-rundeck-0.5.0-incubating-SNAPSHOT.jar>
to org.apache.provisionr/provisionr-rundeck/0.5.0-incubating-SNAPSHOT/provisionr-rundeck-0.5.0-incubating-SNAPSHOT.jar
[JENKINS] Archiving <https://builds.apache.org/job/provisionr-master/ws/integration/rundeck/target/provisionr-rundeck-0.5.0-incubating-SNAPSHOT-sources.jar>
to org.apache.provisionr/provisionr-rundeck/0.5.0-incubating-SNAPSHOT/provisionr-rundeck-0.5.0-incubating-SNAPSHOT-sources.jar
[JENKINS] Archiving <https://builds.apache.org/job/provisionr-master/ws/integration/rundeck/target/classes/features.xml>
to org.apache.provisionr/provisionr-rundeck/0.5.0-incubating-SNAPSHOT/provisionr-rundeck-0.5.0-incubating-SNAPSHOT-features.xml
[JENKINS] Archiving <https://builds.apache.org/job/provisionr-master/ws/karaf/assembly/pom.xml>
to org.apache.provisionr/provisionr-assembly/0.5.0-incubating-SNAPSHOT/provisionr-assembly-0.5.0-incubating-SNAPSHOT.pom
[JENKINS] Archiving <https://builds.apache.org/job/provisionr-master/ws/karaf/assembly/target/provisionr-assembly-0.5.0-incubating-SNAPSHOT.jar>
to org.apache.provisionr/provisionr-assembly/0.5.0-incubating-SNAPSHOT/provisionr-assembly-0.5.0-incubating-SNAPSHOT.jar
[JENKINS] Archiving <https://builds.apache.org/job/provisionr-master/ws/karaf/assembly/target/provisionr-assembly-0.5.0-incubating-SNAPSHOT-sources.jar>
to org.apache.provisionr/provisionr-assembly/0.5.0-incubating-SNAPSHOT/provisionr-assembly-0.5.0-incubating-SNAPSHOT-sources.jar
[JENKINS] Archiving <https://builds.apache.org/job/provisionr-master/ws/karaf/assembly/target/provisionr-0.5.0-incubating-SNAPSHOT.tar.gz>
to org.apache.provisionr/provisionr-assembly/0.5.0-incubating-SNAPSHOT/provisionr-assembly-0.5.0-incubating-SNAPSHOT.tar.gz
[JENKINS] Archiving <https://builds.apache.org/job/provisionr-master/ws/pom.xml> to
org.apache.provisionr/provisionr-aggregator/0.5.0-incubating-SNAPSHOT/provisionr-aggregator-0.5.0-incubating-SNAPSHOT.pom
[JENKINS] Archiving <https://builds.apache.org/job/provisionr-master/ws/parent/pom.xml>
to org.apache.provisionr/provisionr-parent/0.5.0-incubating-SNAPSHOT/provisionr-parent-0.5.0-incubating-SNAPSHOT.pom
[JENKINS] Archiving <https://builds.apache.org/job/provisionr-master/ws/activiti/database/pom.xml>
to org.apache.provisionr/activiti-database/0.5.0-incubating-SNAPSHOT/activiti-database-0.5.0-incubating-SNAPSHOT.pom
[JENKINS] Archiving <https://builds.apache.org/job/provisionr-master/ws/activiti/database/target/activiti-database-0.5.0-incubating-SNAPSHOT.jar>
to org.apache.provisionr/activiti-database/0.5.0-incubating-SNAPSHOT/activiti-database-0.5.0-incubating-SNAPSHOT.jar
[JENKINS] Archiving <https://builds.apache.org/job/provisionr-master/ws/activiti/database/target/activiti-database-0.5.0-incubating-SNAPSHOT-sources.jar>
to org.apache.provisionr/activiti-database/0.5.0-incubating-SNAPSHOT/activiti-database-0.5.0-incubating-SNAPSHOT-sources.jar
[JENKINS] Archiving <https://builds.apache.org/job/provisionr-master/ws/api/pom.xml>
to org.apache.provisionr/provisionr-api/0.5.0-incubating-SNAPSHOT/provisionr-api-0.5.0-incubating-SNAPSHOT.pom
[JENKINS] Archiving <https://builds.apache.org/job/provisionr-master/ws/api/target/provisionr-api-0.5.0-incubating-SNAPSHOT.jar>
to org.apache.provisionr/provisionr-api/0.5.0-incubating-SNAPSHOT/provisionr-api-0.5.0-incubating-SNAPSHOT.jar
[JENKINS] Archiving <https://builds.apache.org/job/provisionr-master/ws/api/target/provisionr-api-0.5.0-incubating-SNAPSHOT-sources.jar>
to org.apache.provisionr/provisionr-api/0.5.0-incubating-SNAPSHOT/provisionr-api-0.5.0-incubating-SNAPSHOT-sources.jar
[JENKINS] Archiving <https://builds.apache.org/job/provisionr-master/ws/activiti/commands/pom.xml>
to org.apache.provisionr/activiti-karaf-commands/0.5.0-incubating-SNAPSHOT/activiti-karaf-commands-0.5.0-incubating-SNAPSHOT.pom
[JENKINS] Archiving <https://builds.apache.org/job/provisionr-master/ws/activiti/commands/target/activiti-karaf-commands-0.5.0-incubating-SNAPSHOT.jar>
to org.apache.provisionr/activiti-karaf-commands/0.5.0-incubating-SNAPSHOT/activiti-karaf-commands-0.5.0-incubating-SNAPSHOT.jar
[JENKINS] Archiving <https://builds.apache.org/job/provisionr-master/ws/activiti/commands/target/activiti-karaf-commands-0.5.0-incubating-SNAPSHOT-sources.jar>
to org.apache.provisionr/activiti-karaf-commands/0.5.0-incubating-SNAPSHOT/activiti-karaf-commands-0.5.0-incubating-SNAPSHOT-sources.jar
[JENKINS] Archiving <https://builds.apache.org/job/provisionr-master/ws/karaf/commands/pom.xml>
to org.apache.provisionr/provisionr-commands/0.5.0-incubating-SNAPSHOT/provisionr-commands-0.5.0-incubating-SNAPSHOT.pom
[JENKINS] Archiving <https://builds.apache.org/job/provisionr-master/ws/karaf/commands/target/provisionr-commands-0.5.0-incubating-SNAPSHOT.jar>
to org.apache.provisionr/provisionr-commands/0.5.0-incubating-SNAPSHOT/provisionr-commands-0.5.0-incubating-SNAPSHOT.jar
[JENKINS] Archiving <https://builds.apache.org/job/provisionr-master/ws/karaf/commands/target/provisionr-commands-0.5.0-incubating-SNAPSHOT-sources.jar>
to org.apache.provisionr/provisionr-commands/0.5.0-incubating-SNAPSHOT/provisionr-commands-0.5.0-incubating-SNAPSHOT-sources.jar
channel stopped
Archiving artifacts
Maven RedeployPublisher use remote ubuntu5 maven settings from : /home/jenkins/.m2/settings.xml
[INFO] Deployment in https://repository.apache.org/content/repositories/snapshots (id=apache.snapshots.https,uniqueVersion=true)
Deploying the main artifact jenkins-4428417309683278454activiti-database-0.5.0-incubating-SNAPSHOT.jar
Downloading: https://repository.apache.org/content/repositories/snapshots/org/apache/provisionr/activiti-database/0.5.0-incubating-SNAPSHOT/maven-metadata.xml
Downloaded: https://repository.apache.org/content/repositories/snapshots/org/apache/provisionr/activiti-database/0.5.0-incubating-SNAPSHOT/maven-metadata.xml
(2 KB at 0.0 KB/sec)
Uploading: https://repository.apache.org/content/repositories/snapshots/org/apache/provisionr/activiti-database/0.5.0-incubating-SNAPSHOT/activiti-database-0.5.0-incubating-20131105.104727-109.jar
Uploaded: https://repository.apache.org/content/repositories/snapshots/org/apache/provisionr/activiti-database/0.5.0-incubating-SNAPSHOT/activiti-database-0.5.0-incubating-20131105.104727-109.jar
(539 KB at 29.6 KB/sec)
Uploading: https://repository.apache.org/content/repositories/snapshots/org/apache/provisionr/activiti-database/0.5.0-incubating-SNAPSHOT/activiti-database-0.5.0-incubating-20131105.104727-109.pom
ERROR: Failed to deploy artifacts: Could not transfer artifact org.apache.provisionr:activiti-database:pom:0.5.0-incubating-20131105.104727-109
from/to apache.snapshots.https (https://repository.apache.org/content/repositories/snapshots):
The target server failed to respond
org.apache.maven.artifact.deployer.ArtifactDeploymentException: Failed to deploy artifacts:
Could not transfer artifact org.apache.provisionr:activiti-database:pom:0.5.0-incubating-20131105.104727-109
from/to apache.snapshots.https (https://repository.apache.org/content/repositories/snapshots):
The target server failed to respond
	at org.apache.maven.artifact.deployer.DefaultArtifactDeployer.deploy(DefaultArtifactDeployer.java:143)
	at hudson.maven.reporters.MavenArtifactRecord.deploy(MavenArtifactRecord.java:191)
	at hudson.maven.RedeployPublisher.perform(RedeployPublisher.java:176)
	at hudson.tasks.BuildStepMonitor$1.perform(BuildStepMonitor.java:20)
	at hudson.model.AbstractBuild$AbstractBuildExecution.perform(AbstractBuild.java:781)
	at hudson.model.AbstractBuild$AbstractBuildExecution.performAllBuildSteps(AbstractBuild.java:753)
	at hudson.maven.MavenModuleSetBuild$MavenModuleSetBuildExecution.post2(MavenModuleSetBuild.java:1020)
	at hudson.model.AbstractBuild$AbstractBuildExecution.post(AbstractBuild.java:706)
	at hudson.model.Run.execute(Run.java:1690)
	at hudson.maven.MavenModuleSetBuild.run(MavenModuleSetBuild.java:509)
	at hudson.model.ResourceController.execute(ResourceController.java:88)
	at hudson.model.Executor.run(Executor.java:230)
Caused by: org.eclipse.aether.deployment.DeploymentException: Failed to deploy artifacts:
Could not transfer artifact org.apache.provisionr:activiti-database:pom:0.5.0-incubating-20131105.104727-109
from/to apache.snapshots.https (https://repository.apache.org/content/repositories/snapshots):
The target server failed to respond
	at org.eclipse.aether.internal.impl.DefaultDeployer.deploy(DefaultDeployer.java:341)
	at org.eclipse.aether.internal.impl.DefaultDeployer.deploy(DefaultDeployer.java:269)
	at org.eclipse.aether.internal.impl.DefaultRepositorySystem.deploy(DefaultRepositorySystem.java:413)
	at org.apache.maven.artifact.deployer.DefaultArtifactDeployer.deploy(DefaultArtifactDeployer.java:139)
	... 11 more
Caused by: org.eclipse.aether.transfer.ArtifactTransferException: Could not transfer artifact
org.apache.provisionr:activiti-database:pom:0.5.0-incubating-20131105.104727-109 from/to apache.snapshots.https
(https://repository.apache.org/content/repositories/snapshots): The target server failed to
respond
	at org.eclipse.aether.connector.wagon.WagonRepositoryConnector$6.wrap(WagonRepositoryConnector.java:1016)
	at org.eclipse.aether.connector.wagon.WagonRepositoryConnector$6.wrap(WagonRepositoryConnector.java:1004)
	at org.eclipse.aether.connector.wagon.WagonRepositoryConnector$PutTask.run(WagonRepositoryConnector.java:895)
	at org.eclipse.aether.connector.wagon.WagonRepositoryConnector.put(WagonRepositoryConnector.java:522)
	at org.eclipse.aether.internal.impl.DefaultDeployer.deploy(DefaultDeployer.java:335)
	... 14 more
Caused by: org.apache.maven.wagon.TransferFailedException: The target server failed to respond
	at org.apache.maven.wagon.shared.http4.AbstractHttpClientWagon.put(AbstractHttpClientWagon.java:580)
	at org.apache.maven.wagon.shared.http4.AbstractHttpClientWagon.put(AbstractHttpClientWagon.java:524)
	at org.apache.maven.wagon.shared.http4.AbstractHttpClientWagon.put(AbstractHttpClientWagon.java:505)
	at org.apache.maven.wagon.shared.http4.AbstractHttpClientWagon.put(AbstractHttpClientWagon.java:485)
	at org.eclipse.aether.connector.wagon.WagonRepositoryConnector$PutTask.run(WagonRepositoryConnector.java:871)
	... 16 more
Caused by: org.apache.http.NoHttpResponseException: The target server failed to respond
	at org.apache.http.impl.conn.DefaultHttpResponseParser.parseHead(DefaultHttpResponseParser.java:95)
	at org.apache.http.impl.conn.DefaultHttpResponseParser.parseHead(DefaultHttpResponseParser.java:62)
	at org.apache.http.impl.io.AbstractMessageParser.parse(AbstractMessageParser.java:254)
	at org.apache.http.impl.AbstractHttpClientConnection.receiveResponseHeader(AbstractHttpClientConnection.java:289)
	at org.apache.http.impl.conn.DefaultClientConnection.receiveResponseHeader(DefaultClientConnection.java:252)
	at org.apache.http.impl.conn.ManagedClientConnectionImpl.receiveResponseHeader(ManagedClientConnectionImpl.java:191)
	at org.apache.http.protocol.HttpRequestExecutor.doReceiveResponse(HttpRequestExecutor.java:300)
	at org.apache.http.protocol.HttpRequestExecutor.execute(HttpRequestExecutor.java:127)
	at org.apache.http.impl.client.DefaultRequestDirector.tryExecute(DefaultRequestDirector.java:715)
	at org.apache.http.impl.client.DefaultRequestDirector.execute(DefaultRequestDirector.java:520)
	at org.apache.http.impl.client.AbstractHttpClient.execute(AbstractHttpClient.java:906)
	at org.apache.http.impl.client.AbstractHttpClient.execute(AbstractHttpClient.java:805)
	at org.apache.maven.wagon.shared.http4.AbstractHttpClientWagon.execute(AbstractHttpClientWagon.java:746)
	at org.apache.maven.wagon.shared.http4.AbstractHttpClientWagon.put(AbstractHttpClientWagon.java:574)
	... 20 more
[INFO] Deployment failed after 1 min 43 sec
Build step 'Deploy artifacts to Maven repository' changed build result to FAILURE

Mime
View raw message