provisionr-dev mailing list archives

Site index · List index
Message view « Date » · « Thread »
Top « Date » · « Thread »
From Apache Jenkins Server <jenk...@builds.apache.org>
Subject Build failed in Jenkins: provisionr-master #172
Date Sat, 09 Nov 2013 08:32:10 GMT
See <https://builds.apache.org/job/provisionr-master/172/>

------------------------------------------
[...truncated 4097 lines...]
[INFO] Copying bundle: org.apache.aries.jpa:org.apache.aries.jpa.container:jar:1.0.0
[INFO] Copying bundle: com.github.spullara.mustache.java:compiler:jar:0.8.8
[INFO] Copying bundle: org.eclipse.jetty:jetty-server:jar:7.6.8.v20121106
[INFO] Copying bundle: org.ops4j.pax.web:pax-web-extender-whiteboard:jar:1.1.12
[INFO] Copying bundle: org.jbundle.util.osgi.wrapped:org.jbundle.util.osgi.wrapped.org.apache.http.client:jar:4.1.2
[INFO] Copying bundle: org.eclipse.jetty:jetty-http:jar:7.6.8.v20121106
[INFO] Copying bundle: org.apache.aries.transaction:org.apache.aries.transaction.blueprint:jar:1.0.0
[INFO] Copying bundle: org.ops4j.pax.web:pax-web-runtime:jar:1.1.12
[INFO] Copying bundle: org.apache.karaf.management.mbeans:org.apache.karaf.management.mbeans.log:jar:2.3.1
[INFO] Copying bundle: org.apache.karaf.management.mbeans:org.apache.karaf.management.mbeans.system:jar:2.3.1
[INFO] Copying bundle: com.google.guava:guava:jar:13.0
[INFO] Copying bundle: org.eclipse.jetty:jetty-jndi:jar:7.6.8.v20121106
[INFO] Copying bundle: org.ops4j.pax.url:pax-url-war:jar:1.3.5
[INFO] Copying bundle: commons-io:commons-io:jar:2.0.1
[INFO] Copying bundle: org.apache.aries.jmx:org.apache.aries.jmx.blueprint.core:jar:1.1.0
[INFO] Copying bundle: org.apache.servicemix.bundles:org.apache.servicemix.bundles.cglib:jar:2.2.2_1
[INFO] Copying bundle: org.springframework:spring-context:jar:3.1.4.RELEASE
[INFO] Copying bundle: org.eclipse.jetty:jetty-client:jar:7.6.8.v20121106
[INFO] Copying bundle: org.springframework.osgi:spring-osgi-web:jar:1.2.1
[INFO] Copying bundle: org.apache.provisionr:provisionr-core:xml:features:0.5.0-incubating-SNAPSHOT
[INFO] Copying bundle: org.apache.provisionr:activiti-database:jar:0.5.0-incubating-SNAPSHOT
[INFO] Copying bundle: org.apache.provisionr:activiti-karaf-web-explorer:war:0.5.0-incubating-SNAPSHOT
[INFO] Copying bundle: org.apache.karaf.webconsole:org.apache.karaf.webconsole.features:jar:2.3.1
[INFO] Copying bundle: org.eclipse.jetty:jetty-io:jar:7.6.8.v20121106
[INFO] Copying bundle: org.apache.provisionr:provisionr-console:xml:features:0.5.0-incubating-SNAPSHOT
[INFO] Copying bundle: org.apache.provisionr:provisionr-rundeck:jar:0.5.0-incubating-SNAPSHOT
[INFO] Copying bundle: org.apache.aries.transaction:org.apache.aries.transaction.manager:jar:1.0.1
[INFO] Copying bundle: org.eclipse.jetty:jetty-servlet:jar:7.6.8.v20121106
[INFO] Copying bundle: org.apache.karaf:apache-karaf:xml:jettyconfig:2.3.1
[INFO] Copying bundle: org.apache.servicemix.bundles:org.apache.servicemix.bundles.jzlib:jar:1.0.7_1
[INFO] Copying bundle: org.springframework:spring-asm:jar:3.1.4.RELEASE
[INFO] Copying bundle: org.apache.provisionr:provisionr-core:jar:0.5.0-incubating-SNAPSHOT
[INFO] Copying bundle: org.ops4j.pax.web:pax-web-extender-war:jar:1.1.12
[INFO] Copying bundle: org.apache.karaf.management.mbeans:org.apache.karaf.management.mbeans.web:jar:2.3.1
[INFO] Copying bundle: org.springframework.osgi:spring-osgi-extender:jar:1.2.1
[INFO] Copying bundle: org.springframework:spring-orm:jar:3.1.4.RELEASE
[INFO] Copying bundle: org.apache.provisionr:provisionr-examples:template:jenkins:0.5.0-incubating-SNAPSHOT
[INFO] Copying bundle: org.apache.karaf.shell:org.apache.karaf.shell.config:jar:2.3.1
[INFO] Copying bundle: com.google.code.gson:gson:jar:1.7.1
[INFO] Copying bundle: org.apache.servicemix.bundles:org.apache.servicemix.bundles.aws-java-sdk:jar:1.3.14_1
[INFO] Copying bundle: org.apache.provisionr:provisionr-core:cfg:fileinstall:0.5.0-incubating-SNAPSHOT
[INFO] Copying bundle: org.apache.geronimo.specs:geronimo-jta_1.1_spec:jar:1.1.1
[INFO] Copying bundle: org.eclipse.jetty:jetty-continuation:jar:7.6.8.v20121106
[INFO] Copying bundle: javax.mail:mail:jar:1.4.4
[INFO] Copying bundle: org.apache.karaf.webconsole:org.apache.karaf.webconsole.admin:jar:2.3.1
[INFO] Copying bundle: javax.mail:mail:jar:1.4.5
[INFO] Copying bundle: org.apache.geronimo.specs:geronimo-jpa_2.0_spec:jar:1.1
[INFO] Copying bundle: org.apache.provisionr:provisionr-features:xml:features:0.5.0-incubating-SNAPSHOT
[INFO] Copying bundle: org.apache.servicemix.bundles:org.apache.servicemix.bundles.commons-codec:jar:1.3_5
[INFO] Copying bundle: org.apache.karaf.shell:org.apache.karaf.shell.web:jar:2.3.1
[INFO] Copying bundle: org.springframework:spring-core:jar:3.1.4.RELEASE
[INFO] Copying bundle: org.springframework:spring-expression:jar:3.1.4.RELEASE
[INFO] Copying bundle: org.eclipse.jetty:jetty-util:jar:7.6.8.v20121106
[INFO] Copying bundle: org.apache.karaf.webconsole:org.apache.karaf.webconsole.console:jar:2.3.1
[INFO] Copying bundle: org.eclipse.jetty:jetty-security:jar:7.6.8.v20121106
[INFO] Copying bundle: org.apache.provisionr:provisionr-amazon:jar:0.5.0-incubating-SNAPSHOT
[INFO] Copying bundle: org.apache.provisionr:provisionr-commands:jar:0.5.0-incubating-SNAPSHOT
[INFO] Copying bundle: org.apache.aries.jpa:org.apache.aries.jpa.blueprint.aries:jar:1.0.1
[INFO] Copying bundle: org.apache.karaf.management.mbeans:org.apache.karaf.management.mbeans.services:jar:2.3.1
[INFO] Copying bundle: org.eclipse.jetty:jetty-jmx:jar:7.6.8.v20121106
[INFO] Copying bundle: org.apache.provisionr:provisionr-examples:template:cdh4:0.5.0-incubating-SNAPSHOT
[INFO] Copying bundle: org.apache.karaf.assemblies.features:enterprise:xml:features:2.3.1
[INFO] Copying bundle: org.apache.servicemix.bundles:org.apache.servicemix.bundles.aopalliance:jar:1.0_6
[INFO] Copying bundle: org.activiti:activiti-osgi:jar:5.10
[INFO] Copying bundle: org.bouncycastle:bcprov-jdk16:jar:1.46
[INFO] Copying bundle: org.springframework.osgi:spring-osgi-annotation:jar:1.2.1
[INFO] Copying bundle: org.apache.karaf.webconsole:org.apache.karaf.webconsole.branding:jar:2.3.1
[INFO] Copying bundle: org.ops4j.pax.web:pax-web-spi:jar:1.1.12
[INFO] Copying bundle: org.apache.karaf.management.mbeans:org.apache.karaf.management.mbeans.config:jar:2.3.1
[INFO] Copying bundle: org.eclipse.jetty:jetty-servlets:jar:7.6.8.v20121106
[INFO] Copying bundle: org.eclipse.jetty:jetty-xml:jar:7.6.8.v20121106
[INFO] Copying bundle: org.apache.servicemix.specs:org.apache.servicemix.specs.activation-api-1.1:jar:2.2.0
[INFO] Copying bundle: org.apache.karaf.management.mbeans:org.apache.karaf.management.mbeans.bundles:jar:2.3.1
[INFO] Copying bundle: org.apache.provisionr:provisionr-core:cfg:defaults:0.5.0-incubating-SNAPSHOT
[INFO] Copying bundle: org.apache.karaf.webconsole:org.apache.karaf.webconsole.gogo:jar:2.3.1
[INFO] Copying bundle: org.springframework:spring-jdbc:jar:3.1.4.RELEASE
[INFO] Copying bundle: org.springframework.osgi:spring-osgi-io:jar:1.2.1
[INFO] Copying bundle: org.codehaus.groovy:groovy-all:jar:2.1.5
[INFO] Copying bundle: org.ops4j.pax.web:pax-web-deployer:jar:1.1.12
[INFO] Copying bundle: org.apache.provisionr:activiti-karaf-commands:jar:0.5.0-incubating-SNAPSHOT
[INFO] Copying bundle: org.apache.cxf.karaf:apache-cxf:xml:features:2.7.2
[INFO] Copying bundle: org.apache.provisionr:provisionr-cloudstack:xml:features:0.5.0-incubating-SNAPSHOT
[INFO] Copying bundle: org.apache.provisionr:provisionr-amazon:cfg:defaults:0.5.0-incubating-SNAPSHOT
[INFO] Copying bundle: net.schmizz:sshj:jar:0.8.1
[INFO] Copying bundle: org.apache.provisionr:provisionr-api:jar:0.5.0-incubating-SNAPSHOT
[INFO] Copying bundle: com.vaadin:vaadin:jar:6.6.2
[INFO] Copying bundle: commons-fileupload:commons-fileupload:jar:1.2.2
[INFO] Copying bundle: org.apache.karaf.assemblies.features:standard:xml:features:2.3.1
[INFO] Copying bundle: org.apache.provisionr:provisionr-rundeck:xml:features:0.5.0-incubating-SNAPSHOT
[INFO] Copying bundle: org.ops4j.pax.web:pax-web-jetty:jar:1.1.12
[INFO] Copying bundle: org.eclipse.jetty:jetty-plus:jar:7.6.8.v20121106
[INFO] Copying bundle: org.springframework:spring-webmvc:jar:3.1.4.RELEASE
[INFO] Copying bundle: org.apache.felix:org.apache.felix.webconsole.plugins.event:jar:1.0.2
[INFO] Copying bundle: org.codehaus.jackson:jackson-core-asl:jar:1.4.3
[INFO] Copying bundle: org.apache.karaf.management.mbeans:org.apache.karaf.management.mbeans.dev:jar:2.3.1
[INFO] Copying bundle: org.apache.provisionr:provisionr-examples:xml:features:0.5.0-incubating-SNAPSHOT
[INFO] Copying bundle: org.apache.geronimo.specs:geronimo-servlet_2.5_spec:jar:1.2
[INFO] Copying bundle: org.apache.provisionr:provisionr-amazon:xml:features:0.5.0-incubating-SNAPSHOT
[INFO] Copying bundle: org.springframework:spring-tx:jar:3.1.4.RELEASE
[INFO] Copying bundle: org.eclipse.jetty:jetty-websocket:jar:7.6.8.v20121106
[INFO] Copying bundle: org.springframework.osgi:spring-osgi-core:jar:1.2.1
[INFO] Copying bundle: org.apache.karaf.deployer:org.apache.karaf.deployer.spring:jar:2.3.1
[INFO] Copying bundle: org.apache.provisionr:provisionr-examples:template:cdh3:0.5.0-incubating-SNAPSHOT
[INFO] Copying bundle: org.apache.aries.jmx:org.apache.aries.jmx.core:jar:1.1.1
[INFO] Copying bundle: org.springframework:spring-aop:jar:3.1.4.RELEASE
[INFO] Copying bundle: org.codehaus.jackson:jackson-mapper-asl:jar:1.4.3
[INFO] Copying bundle: org.ops4j.pax.web:pax-web-jsp:jar:1.1.12
[INFO] Copying bundle: org.apache.aries.jpa:org.apache.aries.jpa.container.context:jar:1.0.1
[INFO] Copying bundle: org.apache.karaf.management:org.apache.karaf.management.server:jar:2.3.1
[INFO] Copying bundle: org.apache.felix:org.apache.felix.metatype:jar:1.0.6
[INFO] Copying bundle: org.activiti:activiti-engine:jar:5.10
[INFO] Copying bundle: org.apache.aries.jpa:org.apache.aries.jpa.api:jar:1.0.0
[INFO] Copying bundle: org.apache.karaf.management.mbeans:org.apache.karaf.management.mbeans.packages:jar:2.3.1
[INFO] Copying bundle: org.springframework:spring-context-support:jar:3.1.4.RELEASE
[INFO] Copying bundle: com.h2database:h2:jar:1.3.168
[INFO] Copying bundle: org.springframework:spring-beans:jar:3.1.4.RELEASE
[INFO] Copying bundle: org.jclouds.karaf:jclouds-karaf:xml:features:1.5.3_1
[INFO] Copying bundle: org.ops4j.pax.web:pax-web-api:jar:1.1.12
[INFO] Copying bundle: org.apache.aries.jmx:org.apache.aries.jmx.api:jar:1.1.0
[INFO] Copying bundle: org.mybatis:mybatis:jar:3.1.1
[INFO] Copying bundle: org.apache.aries.jmx:org.apache.aries.jmx.blueprint.api:jar:1.1.0
[INFO] Copying bundle: org.eclipse.jetty:jetty-webapp:jar:7.6.8.v20121106
[INFO] 
[INFO] --- maven-resources-plugin:2.6:testResources (default-testResources) @ provisionr-assembly
---
[INFO] Using 'UTF-8' encoding to copy filtered resources.
[INFO] skip non existing resourceDirectory <https://builds.apache.org/job/provisionr-master/ws/karaf/assembly/src/test/resources>
[INFO] Copying 3 resources
[INFO] 
[INFO] --- maven-compiler-plugin:3.0:testCompile (default-testCompile) @ provisionr-assembly
---
[INFO] No sources to compile
[INFO] 
[INFO] --- maven-surefire-plugin:2.13:test (default-test) @ provisionr-assembly ---
[INFO] 
[INFO] --- maven-jar-plugin:2.4:jar (default-jar) @ provisionr-assembly ---
[INFO] Building jar: <https://builds.apache.org/job/provisionr-master/ws/karaf/assembly/target/provisionr-assembly-0.5.0-incubating-SNAPSHOT.jar>
[INFO] 
[INFO] --- maven-site-plugin:3.2:attach-descriptor (attach-descriptor) @ provisionr-assembly
---
[WARNING] Failed to getClass for org.apache.maven.plugin.source.SourceJarMojo
[INFO] 
[INFO] --- maven-source-plugin:2.2.1:jar (default) @ provisionr-assembly ---
[INFO] Building jar: <https://builds.apache.org/job/provisionr-master/ws/karaf/assembly/target/provisionr-assembly-0.5.0-incubating-SNAPSHOT-sources.jar>
[INFO] 
[INFO] --- apache-rat-plugin:0.9:check (default) @ provisionr-assembly ---
[INFO] 51 implicit excludes (use -debug for more details).
[INFO] Exclude: **/*.md
[INFO] Exclude: NOTICE
[INFO] Exclude: .git/**
[INFO] Exclude: .repository/**
[INFO] Exclude: .gitignore
[INFO] Exclude: .idea/**
[INFO] Exclude: **/*.iml
[INFO] Exclude: **/*.project
[INFO] Exclude: **/*.classpath
[INFO] Exclude: **/*.prefs
[INFO] Exclude: **/id_rsa_test
[INFO] Exclude: **/id_rsa_test.pub
[INFO] Exclude: **/*.bpmn20.xml
[INFO] Exclude: **/*.activiti
[INFO] Exclude: **/*.csv
[INFO] Exclude: **/target/**
[INFO] 8 resources included (use -debug for more details)
[INFO] Rat check: Summary of files. Unapproved: 0 unknown: 0 generated: 0 approved: 7 licence.
[INFO] 
[INFO] --- maven-assembly-plugin:2.4:single (bin) @ provisionr-assembly ---
[INFO] Reading assembly descriptor: src/main/assembly/bin.xml
[INFO] Building tar: <https://builds.apache.org/job/provisionr-master/ws/karaf/assembly/target/provisionr-0.5.0-incubating-SNAPSHOT.tar.gz>
[INFO] 
[INFO] --- maven-assembly-plugin:2.4:single (src) @ provisionr-assembly ---
[INFO] Reading assembly descriptor: src/main/assembly/src.xml
[INFO] Building tar: <https://builds.apache.org/job/provisionr-master/ws/karaf/assembly/target/provisionr-0.5.0-incubating-SNAPSHOT-src.tar.gz>
[WARNING] Artifact org.apache.provisionr:provisionr-assembly:tar.gz:0.5.0-incubating-SNAPSHOT
already attached to project, ignoring duplicate
Build timed out (after 60 minutes). Marking the build as failed.
[INFO] ------------------------------------------------------------------------
[INFO] Reactor Summary:
[INFO] 
[INFO] Apache Provisionr :: Parent ....................... SUCCESS [34.547s]
[INFO] Apache Provisionr :: API .......................... SUCCESS [20.905s]
[INFO] Apache Provisionr :: Activiti Database ............ SUCCESS [22.541s]
[INFO] Apache Provisionr :: Test Support ................. SUCCESS [1:01.368s]
[INFO] Apache Provisionr :: Core ......................... SUCCESS [23.215s]
[INFO] Apache Provisionr :: Examples ..................... SUCCESS [22.071s]
[INFO] Apache Provisionr :: Web Console & REST API ....... SUCCESS [27.851s]
[INFO] Apache Provisionr :: Amazon ....................... SUCCESS [20.673s]
[INFO] Apache Provisionr :: CloudStack ................... SUCCESS [16.027s]
[INFO] Apache Provisionr :: Rundeck ...................... SUCCESS [17.534s]
[INFO] Apache Provisionr :: Activiti Karaf :: Commands ... SUCCESS [17.026s]
[INFO] Apache Provisionr :: Activiti Karaf :: Explorer ... SUCCESS [43.757s]
[INFO] Apache Provisionr :: Karaf Commands ............... SUCCESS [19.388s]
[INFO] Apache Provisionr :: Karaf Branding ............... SUCCESS [9.491s]
[INFO] Apache Provisionr :: Karaf Features ............... SUCCESS [16.597s]
[INFO] Apache Provisionr :: Amazon Integration Tests ..... SUCCESS [12.166s]
[INFO] Apache Provisionr :: CloudStack Integration Tests . SUCCESS [8.495s]
[INFO] Apache Provisionr :: Custom Karaf Distribution .... FAILURE [4:54.486s]
[INFO] Apache Provisionr :: Custom Karaf Distribution Tests  SKIPPED
[INFO] Apache Provisionr :: Aggregator ................... SKIPPED
[INFO] ------------------------------------------------------------------------
[INFO] BUILD FAILURE
[INFO] ------------------------------------------------------------------------
[INFO] Total time: 59:40.943s
[INFO] Finished at: Sat Nov 09 08:25:29 UTC 2013
[INFO] Final Memory: 52M/256M
[INFO] ------------------------------------------------------------------------
[ERROR] Internal error: java.lang.IllegalStateException: Unable to call isArchivingDisabled.
Invalid object ID 18 -> [Help 1]
org.apache.maven.InternalErrorException: Internal error: java.lang.IllegalStateException:
Unable to call isArchivingDisabled. Invalid object ID 18
	at org.apache.maven.DefaultMaven.execute(DefaultMaven.java:168)
	at org.jvnet.hudson.maven3.launcher.Maven3Launcher.main(Maven3Launcher.java:117)
	at sun.reflect.NativeMethodAccessorImpl.invoke0(Native Method)
	at sun.reflect.NativeMethodAccessorImpl.invoke(NativeMethodAccessorImpl.java:39)
	at sun.reflect.DelegatingMethodAccessorImpl.invoke(DelegatingMethodAccessorImpl.java:25)
	at java.lang.reflect.Method.invoke(Method.java:597)
	at org.codehaus.plexus.classworlds.launcher.Launcher.launchStandard(Launcher.java:329)
	at org.codehaus.plexus.classworlds.launcher.Launcher.launch(Launcher.java:239)
	at org.jvnet.hudson.maven3.agent.Maven3Main.launch(Maven3Main.java:178)
	at sun.reflect.NativeMethodAccessorImpl.invoke0(Native Method)
	at sun.reflect.NativeMethodAccessorImpl.invoke(NativeMethodAccessorImpl.java:39)
	at sun.reflect.DelegatingMethodAccessorImpl.invoke(DelegatingMethodAccessorImpl.java:25)
	at java.lang.reflect.Method.invoke(Method.java:597)
	at hudson.maven.Maven3Builder.call(Maven3Builder.java:134)
	at hudson.maven.Maven3Builder.call(Maven3Builder.java:69)
	at hudson.remoting.UserRequest.perform(UserRequest.java:118)
	at hudson.remoting.UserRequest.perform(UserRequest.java:48)
	at hudson.remoting.Request$2.run(Request.java:326)
	at hudson.remoting.InterceptingExecutorService$1.call(InterceptingExecutorService.java:72)
	at java.util.concurrent.FutureTask$Sync.innerRun(FutureTask.java:303)
	at java.util.concurrent.FutureTask.run(FutureTask.java:138)
	at java.util.concurrent.ThreadPoolExecutor$Worker.runTask(ThreadPoolExecutor.java:895)
	at java.util.concurrent.ThreadPoolExecutor$Worker.run(ThreadPoolExecutor.java:918)
	at java.lang.Thread.run(Thread.java:662)
Caused by: java.lang.IllegalStateException: Unable to call isArchivingDisabled. Invalid object
ID 18
	at hudson.remoting.RemoteInvocationHandler$RPCRequest.perform(RemoteInvocationHandler.java:293)
	at hudson.remoting.RemoteInvocationHandler$RPCRequest.call(RemoteInvocationHandler.java:280)
	at hudson.remoting.RemoteInvocationHandler$RPCRequest.call(RemoteInvocationHandler.java:239)
	at hudson.remoting.UserRequest.perform(UserRequest.java:118)
	at hudson.remoting.UserRequest.perform(UserRequest.java:48)
	at hudson.remoting.Request$2.run(Request.java:326)
	at hudson.remoting.InterceptingExecutorService$1.call(InterceptingExecutorService.java:72)
	at java.util.concurrent.FutureTask$Sync.innerRun(FutureTask.java:334)
	at java.util.concurrent.FutureTask.run(FutureTask.java:166)
	at java.util.concurrent.ThreadPoolExecutor.runWorker(ThreadPoolExecutor.java:1145)
	at java.util.concurrent.ThreadPoolExecutor$Worker.run(ThreadPoolExecutor.java:615)
	at java.lang.Thread.run(Thread.java:724)
[ERROR] 
[ERROR] To see the full stack trace of the errors, re-run Maven with the -e switch.
[ERROR] Re-run Maven using the -X switch to enable full debug logging.
[ERROR] 
[ERROR] For more information about the errors and possible solutions, please read the following
articles:
[ERROR] [Help 1] http://cwiki.apache.org/confluence/display/MAVEN/InternalErrorException
channel stopped
Archiving artifacts

Mime
View raw message