provisionr-dev mailing list archives

Site index · List index
Message view « Date » · « Thread »
Top « Date » · « Thread »
From Apache Jenkins Server <jenk...@builds.apache.org>
Subject Build failed in Jenkins: provisionr-master #167
Date Mon, 04 Nov 2013 03:05:11 GMT
See <https://builds.apache.org/job/provisionr-master/167/>

------------------------------------------
[...truncated 161 lines...]
Tests run: 1, Failures: 0, Errors: 0, Skipped: 0, Time elapsed: 0.001 sec
Running org.apache.provisionr.api.network.RuleTest
Tests run: 1, Failures: 0, Errors: 0, Skipped: 0, Time elapsed: 0 sec

Results :

Tests run: 12, Failures: 0, Errors: 0, Skipped: 0

[JENKINS] Recording test results
[INFO] 
[INFO] --- maven-bundle-plugin:2.3.6:bundle (default-bundle) @ provisionr-api ---
[INFO] 
[INFO] --- maven-site-plugin:3.2:attach-descriptor (attach-descriptor) @ provisionr-api ---
[WARNING] Failed to getClass for org.apache.maven.plugin.source.SourceJarMojo
[INFO] 
[INFO] --- maven-source-plugin:2.2.1:jar (default) @ provisionr-api ---
[INFO] Building jar: <https://builds.apache.org/job/provisionr-master/ws/api/target/provisionr-api-0.5.0-incubating-SNAPSHOT-sources.jar>
[INFO] 
[INFO] --- apache-rat-plugin:0.9:check (default) @ provisionr-api ---
[INFO] 51 implicit excludes (use -debug for more details).
[INFO] Exclude: **/*.md
[INFO] Exclude: NOTICE
[INFO] Exclude: .git/**
[INFO] Exclude: .repository/**
[INFO] Exclude: .gitignore
[INFO] Exclude: .idea/**
[INFO] Exclude: **/*.iml
[INFO] Exclude: **/*.project
[INFO] Exclude: **/*.classpath
[INFO] Exclude: **/*.prefs
[INFO] Exclude: **/id_rsa_test
[INFO] Exclude: **/id_rsa_test.pub
[INFO] Exclude: **/*.bpmn20.xml
[INFO] Exclude: **/*.activiti
[INFO] Exclude: **/*.csv
[INFO] Exclude: **/target/**
[INFO] 36 resources included (use -debug for more details)
[INFO] Rat check: Summary of files. Unapproved: 0 unknown: 0 generated: 0 approved: 36 licence.
[INFO] 
[INFO] --- maven-install-plugin:2.3.1:install (default-install) @ provisionr-api ---
[INFO] Installing <https://builds.apache.org/job/provisionr-master/ws/api/target/provisionr-api-0.5.0-incubating-SNAPSHOT.jar>
to /home/jenkins/jenkins-slave/maven-repositories/1/org/apache/provisionr/provisionr-api/0.5.0-incubating-SNAPSHOT/provisionr-api-0.5.0-incubating-SNAPSHOT.jar
[INFO] Installing <https://builds.apache.org/job/provisionr-master/ws/api/pom.xml> to
/home/jenkins/jenkins-slave/maven-repositories/1/org/apache/provisionr/provisionr-api/0.5.0-incubating-SNAPSHOT/provisionr-api-0.5.0-incubating-SNAPSHOT.pom
[INFO] Installing <https://builds.apache.org/job/provisionr-master/ws/api/target/provisionr-api-0.5.0-incubating-SNAPSHOT-sources.jar>
to /home/jenkins/jenkins-slave/maven-repositories/1/org/apache/provisionr/provisionr-api/0.5.0-incubating-SNAPSHOT/provisionr-api-0.5.0-incubating-SNAPSHOT-sources.jar
[INFO] 
[INFO] --- maven-bundle-plugin:2.3.6:install (default-install) @ provisionr-api ---
[INFO] Installing org/apache/provisionr/provisionr-api/0.5.0-incubating-SNAPSHOT/provisionr-api-0.5.0-incubating-SNAPSHOT.jar
[INFO] Writing OBR metadata
[INFO]                                                                         
[INFO] ------------------------------------------------------------------------
[INFO] Building Apache Provisionr :: Activiti Database 0.5.0-incubating-SNAPSHOT
[INFO] ------------------------------------------------------------------------
[INFO] 
[INFO] --- maven-clean-plugin:2.5:clean (default-clean) @ activiti-database ---
[INFO] 
[INFO] --- maven-remote-resources-plugin:1.4:process (default) @ activiti-database ---
[INFO] 
[INFO] --- maven-resources-plugin:2.6:resources (default-resources) @ activiti-database ---
[INFO] Using 'UTF-8' encoding to copy filtered resources.
[INFO] skip non existing resourceDirectory <https://builds.apache.org/job/provisionr-master/ws/activiti/database/src/main/resources>
[INFO] Copying 3 resources
[INFO] 
[INFO] --- maven-compiler-plugin:3.0:compile (default-compile) @ activiti-database ---
[INFO] No sources to compile
[INFO] 
[JENKINS] Recording test results[INFO] --- maven-resources-plugin:2.6:testResources (default-testResources)
@ activiti-database ---
[INFO] Using 'UTF-8' encoding to copy filtered resources.
[INFO] skip non existing resourceDirectory <https://builds.apache.org/job/provisionr-master/ws/activiti/database/src/test/resources>
[INFO] Copying 3 resources
[INFO] 
[INFO] --- maven-compiler-plugin:3.0:testCompile (default-testCompile) @ activiti-database
---
[INFO] No sources to compile
[INFO] 
[INFO] --- maven-surefire-plugin:2.13:test (default-test) @ activiti-database ---
[INFO] 
[INFO] --- maven-bundle-plugin:2.3.6:bundle (default-bundle) @ activiti-database ---

[INFO] 
[INFO] --- maven-site-plugin:3.2:attach-descriptor (attach-descriptor) @ activiti-database
---
[WARNING] Failed to getClass for org.apache.maven.plugin.source.SourceJarMojo
[INFO] 
[INFO] --- maven-source-plugin:2.2.1:jar (default) @ activiti-database ---
[INFO] Building jar: <https://builds.apache.org/job/provisionr-master/ws/activiti/database/target/activiti-database-0.5.0-incubating-SNAPSHOT-sources.jar>
[INFO] 
[INFO] --- apache-rat-plugin:0.9:check (default) @ activiti-database ---
[INFO] 51 implicit excludes (use -debug for more details).
[INFO] Exclude: **/*.md
[INFO] Exclude: NOTICE
[INFO] Exclude: .git/**
[INFO] Exclude: .repository/**
[INFO] Exclude: .gitignore
[INFO] Exclude: .idea/**
[INFO] Exclude: **/*.iml
[INFO] Exclude: **/*.project
[INFO] Exclude: **/*.classpath
[INFO] Exclude: **/*.prefs
[INFO] Exclude: **/id_rsa_test
[INFO] Exclude: **/id_rsa_test.pub
[INFO] Exclude: **/*.bpmn20.xml
[INFO] Exclude: **/*.activiti
[INFO] Exclude: **/*.csv
[INFO] Exclude: **/target/**
[INFO] 1 resources included (use -debug for more details)
[INFO] Rat check: Summary of files. Unapproved: 0 unknown: 0 generated: 0 approved: 1 licence.
[INFO] 
[INFO] --- maven-install-plugin:2.3.1:install (default-install) @ activiti-database ---
[INFO] Installing <https://builds.apache.org/job/provisionr-master/ws/activiti/database/target/activiti-database-0.5.0-incubating-SNAPSHOT.jar>
to /home/jenkins/jenkins-slave/maven-repositories/1/org/apache/provisionr/activiti-database/0.5.0-incubating-SNAPSHOT/activiti-database-0.5.0-incubating-SNAPSHOT.jar
[INFO] Installing <https://builds.apache.org/job/provisionr-master/ws/activiti/database/pom.xml>
to /home/jenkins/jenkins-slave/maven-repositories/1/org/apache/provisionr/activiti-database/0.5.0-incubating-SNAPSHOT/activiti-database-0.5.0-incubating-SNAPSHOT.pom
[INFO] Installing <https://builds.apache.org/job/provisionr-master/ws/activiti/database/target/activiti-database-0.5.0-incubating-SNAPSHOT-sources.jar>
to /home/jenkins/jenkins-slave/maven-repositories/1/org/apache/provisionr/activiti-database/0.5.0-incubating-SNAPSHOT/activiti-database-0.5.0-incubating-SNAPSHOT-sources.jar
[INFO] 
[INFO] --- maven-bundle-plugin:2.3.6:install (default-install) @ activiti-database ---
[INFO] Installing org/apache/provisionr/activiti-database/0.5.0-incubating-SNAPSHOT/activiti-database-0.5.0-incubating-SNAPSHOT.jar
[INFO] Writing OBR metadata
[INFO] ------------------------------------------------------------------------
[INFO] Reactor Summary:
[INFO] 
[INFO] Apache Provisionr :: Parent ....................... SUCCESS [25.688s]
[INFO] Apache Provisionr :: API .......................... SUCCESS [26.731s]
[INFO] Apache Provisionr :: Activiti Database ............ FAILURE [18.324s]
[INFO] Apache Provisionr :: Test Support ................. SKIPPED
[INFO] Apache Provisionr :: Core ......................... SKIPPED
[INFO] Apache Provisionr :: Examples ..................... SKIPPED
[INFO] Apache Provisionr :: Web Console & REST API ....... SKIPPED
[INFO] Apache Provisionr :: Amazon ....................... SKIPPED
[INFO] Apache Provisionr :: CloudStack ................... SKIPPED
[INFO] Apache Provisionr :: Rundeck ...................... SKIPPED
[INFO] Apache Provisionr :: Activiti Karaf :: Commands ... SKIPPED
[INFO] Apache Provisionr :: Activiti Karaf :: Explorer ... SKIPPED
[INFO] Apache Provisionr :: Karaf Commands ............... SKIPPED
[INFO] Apache Provisionr :: Karaf Branding ............... SKIPPED
[INFO] Apache Provisionr :: Karaf Features ............... SKIPPED
[INFO] Apache Provisionr :: Amazon Integration Tests ..... SKIPPED
[INFO] Apache Provisionr :: CloudStack Integration Tests . SKIPPED
[INFO] Apache Provisionr :: Custom Karaf Distribution .... SKIPPED
[INFO] Apache Provisionr :: Custom Karaf Distribution Tests  SKIPPED
[INFO] Apache Provisionr :: Aggregator ................... SKIPPED
[INFO] ------------------------------------------------------------------------
[INFO] BUILD FAILURE
[INFO] ------------------------------------------------------------------------
[INFO] Total time: 2:50.860s
[INFO] Finished at: Mon Nov 04 02:50:53 UTC 2013
[INFO] Final Memory: 25M/315M
[INFO] ------------------------------------------------------------------------
Waiting for Jenkins to finish collecting data
[ERROR] Internal error: hudson.remoting.RemotingSystemException: java.io.StreamCorruptedException:
invalid type code: A0 -> [Help 1]
org.apache.maven.InternalErrorException: Internal error: hudson.remoting.RemotingSystemException:
java.io.StreamCorruptedException: invalid type code: A0
	at org.apache.maven.lifecycle.internal.BuilderCommon.handleBuildError(BuilderCommon.java:128)
	at org.apache.maven.lifecycle.internal.LifecycleModuleBuilder.buildProject(LifecycleModuleBuilder.java:95)
	at org.apache.maven.lifecycle.internal.LifecycleModuleBuilder.buildProject(LifecycleModuleBuilder.java:59)
	at org.apache.maven.lifecycle.internal.LifecycleStarter.singleThreadedBuild(LifecycleStarter.java:183)
	at org.apache.maven.lifecycle.internal.LifecycleStarter.execute(LifecycleStarter.java:161)
	at org.apache.maven.DefaultMaven.doExecute(DefaultMaven.java:320)
	at org.apache.maven.DefaultMaven.execute(DefaultMaven.java:156)
	at org.jvnet.hudson.maven3.launcher.Maven3Launcher.main(Maven3Launcher.java:117)
	at sun.reflect.NativeMethodAccessorImpl.invoke0(Native Method)
	at sun.reflect.NativeMethodAccessorImpl.invoke(NativeMethodAccessorImpl.java:39)
	at sun.reflect.DelegatingMethodAccessorImpl.invoke(DelegatingMethodAccessorImpl.java:25)
	at java.lang.reflect.Method.invoke(Method.java:597)
	at org.codehaus.plexus.classworlds.launcher.Launcher.launchStandard(Launcher.java:329)
	at org.codehaus.plexus.classworlds.launcher.Launcher.launch(Launcher.java:239)
	at org.jvnet.hudson.maven3.agent.Maven3Main.launch(Maven3Main.java:178)
	at sun.reflect.NativeMethodAccessorImpl.invoke0(Native Method)
	at sun.reflect.NativeMethodAccessorImpl.invoke(NativeMethodAccessorImpl.java:39)
	at sun.reflect.DelegatingMethodAccessorImpl.invoke(DelegatingMethodAccessorImpl.java:25)
	at java.lang.reflect.Method.invoke(Method.java:597)
	at hudson.maven.Maven3Builder.call(Maven3Builder.java:134)
	at hudson.maven.Maven3Builder.call(Maven3Builder.java:69)
	at hudson.remoting.UserRequest.perform(UserRequest.java:118)
	at hudson.remoting.UserRequest.perform(UserRequest.java:48)
	at hudson.remoting.Request$2.run(Request.java:326)
	at hudson.remoting.InterceptingExecutorService$1.call(InterceptingExecutorService.java:72)
	at java.util.concurrent.FutureTask$Sync.innerRun(FutureTask.java:303)
	at java.util.concurrent.FutureTask.run(FutureTask.java:138)
	at java.util.concurrent.ThreadPoolExecutor$Worker.runTask(ThreadPoolExecutor.java:895)
	at java.util.concurrent.ThreadPoolExecutor$Worker.run(ThreadPoolExecutor.java:918)
	at java.lang.Thread.run(Thread.java:662)
Caused by: hudson.remoting.RemotingSystemException: java.io.StreamCorruptedException: invalid
type code: A0
	at hudson.remoting.RemoteInvocationHandler.invoke(RemoteInvocationHandler.java:183)
	at com.sun.proxy.$Proxy7.setExecutedMojos(Unknown Source)
	at hudson.maven.MavenBuildProxy$Filter.setExecutedMojos(MavenBuildProxy.java:257)
	at hudson.maven.Maven3Builder$MavenExecutionListener.recordMojoEnded(Maven3Builder.java:624)
	at hudson.maven.Maven3Builder$MavenExecutionListener.mojoSucceeded(Maven3Builder.java:610)
	at org.apache.maven.lifecycle.internal.DefaultExecutionEventCatapult.fire(DefaultExecutionEventCatapult.java:87)
	at org.apache.maven.lifecycle.internal.DefaultExecutionEventCatapult.fire(DefaultExecutionEventCatapult.java:42)
	at org.apache.maven.lifecycle.internal.MojoExecutor.execute(MojoExecutor.java:228)
	at org.apache.maven.lifecycle.internal.MojoExecutor.execute(MojoExecutor.java:153)
	at org.apache.maven.lifecycle.internal.MojoExecutor.execute(MojoExecutor.java:145)
	at org.apache.maven.lifecycle.internal.LifecycleModuleBuilder.buildProject(LifecycleModuleBuilder.java:84)
	... 28 more
Caused by: java.io.StreamCorruptedException: invalid type code: A0
	at java.io.ObjectInputStream.readObject0(ObjectInputStream.java:1375)
	at java.io.ObjectInputStream.readArray(ObjectInputStream.java:1704)
	at java.io.ObjectInputStream.readObject0(ObjectInputStream.java:1342)
	at java.io.ObjectInputStream.defaultReadFields(ObjectInputStream.java:1989)
	at java.io.ObjectInputStream.defaultReadObject(ObjectInputStream.java:499)
	at java.lang.Throwable.readObject(Throwable.java:913)
	at sun.reflect.GeneratedMethodAccessor128.invoke(Unknown Source)
	at sun.reflect.DelegatingMethodAccessorImpl.invoke(DelegatingMethodAccessorImpl.java:43)
	at java.lang.reflect.Method.invoke(Method.java:606)
	at java.io.ObjectStreamClass.invokeReadObject(ObjectStreamClass.java:1017)
	at java.io.ObjectInputStream.readSerialData(ObjectInputStream.java:1891)
	at java.io.ObjectInputStream.readOrdinaryObject(ObjectInputStream.java:1796)
	at java.io.ObjectInputStream.readObject0(ObjectInputStream.java:1348)
	at java.io.ObjectInputStream.defaultReadFields(ObjectInputStream.java:1989)
	at java.io.ObjectInputStream.readSerialData(ObjectInputStream.java:1913)
	at java.io.ObjectInputStream.readOrdinaryObject(ObjectInputStream.java:1796)
	at java.io.ObjectInputStream.readObject0(ObjectInputStream.java:1348)
	at java.io.ObjectInputStream.readObject(ObjectInputStream.java:370)
	at hudson.remoting.UserRequest.deserialize(UserRequest.java:182)
	at hudson.remoting.UserRequest.perform(UserRequest.java:98)
	at hudson.remoting.UserRequest.perform(UserRequest.java:48)
	at hudson.remoting.Request$2.run(Request.java:326)
	at hudson.remoting.InterceptingExecutorService$1.call(InterceptingExecutorService.java:72)
	at java.util.concurrent.FutureTask$Sync.innerRun(FutureTask.java:334)
	at java.util.concurrent.FutureTask.run(FutureTask.java:166)
	at java.util.concurrent.ThreadPoolExecutor.runWorker(ThreadPoolExecutor.java:1145)
	at java.util.concurrent.ThreadPoolExecutor$Worker.run(ThreadPoolExecutor.java:615)
	at java.lang.Thread.run(Thread.java:724)
[ERROR] 
[ERROR] To see the full stack trace of the errors, re-run Maven with the -e switch.
[ERROR] Re-run Maven using the -X switch to enable full debug logging.
[ERROR] 
[ERROR] For more information about the errors and possible solutions, please read the following
articles:
[ERROR] [Help 1] http://cwiki.apache.org/confluence/display/MAVEN/InternalErrorException
[JENKINS] Archiving <https://builds.apache.org/job/provisionr-master/ws/test-support/pom.xml>
to org.apache.provisionr/provisionr-test-support/0.5.0-incubating-SNAPSHOT/provisionr-test-support-0.5.0-incubating-SNAPSHOT.pom
[JENKINS] Archiving <https://builds.apache.org/job/provisionr-master/ws/activiti/explorer/pom.xml>
to org.apache.provisionr/activiti-karaf-web-explorer/0.5.0-incubating-SNAPSHOT/activiti-karaf-web-explorer-0.5.0-incubating-SNAPSHOT.pom
[JENKINS] Archiving <https://builds.apache.org/job/provisionr-master/ws/providers/cloudstack/pom.xml>
to org.apache.provisionr/provisionr-cloudstack/0.5.0-incubating-SNAPSHOT/provisionr-cloudstack-0.5.0-incubating-SNAPSHOT.pom
[JENKINS] Archiving <https://builds.apache.org/job/provisionr-master/ws/karaf/features/pom.xml>
to org.apache.provisionr/provisionr-features/0.5.0-incubating-SNAPSHOT/provisionr-features-0.5.0-incubating-SNAPSHOT.pom
[JENKINS] Archiving <https://builds.apache.org/job/provisionr-master/ws/providers/cloudstack-tests/pom.xml>
to org.apache.provisionr/provisionr-cloudstack-tests/0.5.0-incubating-SNAPSHOT/provisionr-cloudstack-tests-0.5.0-incubating-SNAPSHOT.pom
[JENKINS] Archiving <https://builds.apache.org/job/provisionr-master/ws/console/pom.xml>
to org.apache.provisionr/provisionr-console/0.5.0-incubating-SNAPSHOT/provisionr-console-0.5.0-incubating-SNAPSHOT.pom
[JENKINS] Archiving <https://builds.apache.org/job/provisionr-master/ws/karaf/branding/pom.xml>
to org.apache.provisionr/provisionr-branding/0.5.0-incubating-SNAPSHOT/provisionr-branding-0.5.0-incubating-SNAPSHOT.pom
[JENKINS] Archiving <https://builds.apache.org/job/provisionr-master/ws/examples/pom.xml>
to org.apache.provisionr/provisionr-examples/0.5.0-incubating-SNAPSHOT/provisionr-examples-0.5.0-incubating-SNAPSHOT.pom
[JENKINS] Archiving <https://builds.apache.org/job/provisionr-master/ws/providers/amazon-tests/pom.xml>
to org.apache.provisionr/provisionr-amazon-tests/0.5.0-incubating-SNAPSHOT/provisionr-amazon-tests-0.5.0-incubating-SNAPSHOT.pom
[JENKINS] Archiving <https://builds.apache.org/job/provisionr-master/ws/karaf/assembly-tests/pom.xml>
to org.apache.provisionr/provisionr-assembly-tests/0.5.0-incubating-SNAPSHOT/provisionr-assembly-tests-0.5.0-incubating-SNAPSHOT.pom
[JENKINS] Archiving <https://builds.apache.org/job/provisionr-master/ws/core/pom.xml>
to org.apache.provisionr/provisionr-core/0.5.0-incubating-SNAPSHOT/provisionr-core-0.5.0-incubating-SNAPSHOT.pom
[JENKINS] Archiving <https://builds.apache.org/job/provisionr-master/ws/providers/amazon/pom.xml>
to org.apache.provisionr/provisionr-amazon/0.5.0-incubating-SNAPSHOT/provisionr-amazon-0.5.0-incubating-SNAPSHOT.pom
[JENKINS] Archiving <https://builds.apache.org/job/provisionr-master/ws/integration/rundeck/pom.xml>
to org.apache.provisionr/provisionr-rundeck/0.5.0-incubating-SNAPSHOT/provisionr-rundeck-0.5.0-incubating-SNAPSHOT.pom
[JENKINS] Archiving <https://builds.apache.org/job/provisionr-master/ws/karaf/assembly/pom.xml>
to org.apache.provisionr/provisionr-assembly/0.5.0-incubating-SNAPSHOT/provisionr-assembly-0.5.0-incubating-SNAPSHOT.pom
[JENKINS] Archiving <https://builds.apache.org/job/provisionr-master/ws/pom.xml> to
org.apache.provisionr/provisionr-aggregator/0.5.0-incubating-SNAPSHOT/provisionr-aggregator-0.5.0-incubating-SNAPSHOT.pom
[JENKINS] Archiving <https://builds.apache.org/job/provisionr-master/ws/parent/pom.xml>
to org.apache.provisionr/provisionr-parent/0.5.0-incubating-SNAPSHOT/provisionr-parent-0.5.0-incubating-SNAPSHOT.pom
[JENKINS] Archiving <https://builds.apache.org/job/provisionr-master/ws/activiti/database/pom.xml>
to org.apache.provisionr/activiti-database/0.5.0-incubating-SNAPSHOT/activiti-database-0.5.0-incubating-SNAPSHOT.pom
[JENKINS] Archiving <https://builds.apache.org/job/provisionr-master/ws/activiti/database/target/activiti-database-0.5.0-incubating-SNAPSHOT.jar>
to org.apache.provisionr/activiti-database/0.5.0-incubating-SNAPSHOT/activiti-database-0.5.0-incubating-SNAPSHOT.jar
[JENKINS] Archiving <https://builds.apache.org/job/provisionr-master/ws/activiti/database/target/activiti-database-0.5.0-incubating-SNAPSHOT-sources.jar>
to org.apache.provisionr/activiti-database/0.5.0-incubating-SNAPSHOT/activiti-database-0.5.0-incubating-SNAPSHOT-sources.jar
[JENKINS] Archiving <https://builds.apache.org/job/provisionr-master/ws/api/pom.xml>
to org.apache.provisionr/provisionr-api/0.5.0-incubating-SNAPSHOT/provisionr-api-0.5.0-incubating-SNAPSHOT.pom
[JENKINS] Archiving <https://builds.apache.org/job/provisionr-master/ws/api/target/provisionr-api-0.5.0-incubating-SNAPSHOT.jar>
to org.apache.provisionr/provisionr-api/0.5.0-incubating-SNAPSHOT/provisionr-api-0.5.0-incubating-SNAPSHOT.jar
[JENKINS] Archiving <https://builds.apache.org/job/provisionr-master/ws/api/target/provisionr-api-0.5.0-incubating-SNAPSHOT-sources.jar>
to org.apache.provisionr/provisionr-api/0.5.0-incubating-SNAPSHOT/provisionr-api-0.5.0-incubating-SNAPSHOT-sources.jar
[JENKINS] Archiving <https://builds.apache.org/job/provisionr-master/ws/activiti/commands/pom.xml>
to org.apache.provisionr/activiti-karaf-commands/0.5.0-incubating-SNAPSHOT/activiti-karaf-commands-0.5.0-incubating-SNAPSHOT.pom
[JENKINS] Archiving <https://builds.apache.org/job/provisionr-master/ws/karaf/commands/pom.xml>
to org.apache.provisionr/provisionr-commands/0.5.0-incubating-SNAPSHOT/provisionr-commands-0.5.0-incubating-SNAPSHOT.pom
channel stopped
Archiving artifacts

Mime
View raw message