provisionr-dev mailing list archives

Site index · List index
Message view « Date » · « Thread »
Top « Date » · « Thread »
From Apache Jenkins Server <jenk...@builds.apache.org>
Subject Build failed in Jenkins: provisionr-master #170
Date Thu, 07 Nov 2013 14:17:10 GMT
See <https://builds.apache.org/job/provisionr-master/170/>

------------------------------------------
[...truncated 2776 lines...]
[org.activiti.engine.impl.persistence.entity.ResourceEntity.deleteResourcesByDeploymentId]
: ==>  Preparing: delete from ACT_GE_BYTEARRAY where DEPLOYMENT_ID_ = ? 
[org.activiti.engine.impl.persistence.entity.ResourceEntity.deleteResourcesByDeploymentId]
: ==> Parameters: 11(String)
[org.activiti.engine.impl.persistence.entity.DeploymentEntity.deleteDeployment] : ooo Using
Connection [Transaction-aware proxy for target Connection [conn25: url=jdbc:h2:mem:activiti
user=SA]]
[org.activiti.engine.impl.persistence.entity.DeploymentEntity.deleteDeployment] : ==> 
Preparing: delete from ACT_RE_DEPLOYMENT where ID_ = ? 
[org.activiti.engine.impl.persistence.entity.DeploymentEntity.deleteDeployment] : ==> Parameters:
11(String)
[org.apache.ibatis.transaction.managed.ManagedTransaction] : Closing JDBC Connection [Transaction-aware
proxy for target Connection [conn25: url=jdbc:h2:mem:activiti user=SA]]
[org.springframework.jdbc.datasource.DataSourceTransactionManager] : Initiating transaction
commit
[org.springframework.jdbc.datasource.DataSourceTransactionManager] : Committing JDBC transaction
on Connection [conn25: url=jdbc:h2:mem:activiti user=SA]
[org.springframework.jdbc.datasource.DataSourceTransactionManager] : Releasing JDBC Connection
[conn25: url=jdbc:h2:mem:activiti user=SA] after transaction
[org.springframework.jdbc.datasource.DataSourceUtils] : Returning JDBC Connection to DataSource
[org.springframework.test.context.support.DirtiesContextTestExecutionListener] : After test
class: context [[TestContext@87e9bf testClass = InfoActivitiCommandTest, testInstance = [null],
testMethod = [null], testException = [null], mergedContextConfiguration = [MergedContextConfiguration@15fa713
testClass = InfoActivitiCommandTest, locations = '{classpath:activiti.cfg.xml}', classes =
'{}', activeProfiles = '{}', contextLoader = 'org.springframework.test.context.support.DelegatingSmartContextLoader']]],
dirtiesContext [false].
Tests run: 1, Failures: 0, Errors: 0, Skipped: 0, Time elapsed: 1.552 sec
[org.springframework.context.support.GenericApplicationContext] : Closing org.springframework.context.support.GenericApplicationContext@1f8c6df:
startup date [Thu Nov 07 13:49:24 UTC 2013]; root of context hierarchy
[org.springframework.beans.factory.support.DefaultListableBeanFactory] : Returning cached
instance of singleton bean 'lifecycleProcessor'
[org.springframework.beans.factory.support.DefaultListableBeanFactory] : Destroying singletons
in org.springframework.beans.factory.support.DefaultListableBeanFactory@e1eea8: defining beans
[dataSource,transactionManager,processEngineConfiguration,processEngine,repositoryService,runtimeService,taskService,historyService,managementService,activitiRule,org.springframework.aop.config.internalAutoProxyCreator,org.springframework.transaction.annotation.AnnotationTransactionAttributeSource#0,org.springframework.transaction.interceptor.TransactionInterceptor#0,org.springframework.transaction.config.internalTransactionAdvisor,org.springframework.context.annotation.internalConfigurationAnnotationProcessor,org.springframework.context.annotation.internalAutowiredAnnotationProcessor,org.springframework.context.annotation.internalRequiredAnnotationProcessor,org.springframework.context.annotation.internalCommonAnnotationProcessor,org.springframework.context.annotation.ConfigurationClassPostProcessor.importAwareProcessor];
root of factory hierarchy
[org.springframework.beans.factory.support.DefaultListableBeanFactory] : Retrieved dependent
beans for bean 'activitiRule': [org.apache.provisionr.activiti.karaf.commands.ListActivitiCommandTest,
org.apache.provisionr.activiti.karaf.commands.InfoActivitiCommandTest]
[org.springframework.beans.factory.support.DisposableBeanAdapter] : Invoking destroy() on
bean with name 'processEngine'
[org.springframework.jdbc.datasource.DataSourceTransactionManager] : Creating new transaction
with name [null]: PROPAGATION_REQUIRED,ISOLATION_DEFAULT
[org.springframework.jdbc.datasource.SimpleDriverDataSource] : Creating new JDBC Driver Connection
to [jdbc:h2:mem:activiti;DB_CLOSE_DELAY=1000]
[org.springframework.jdbc.datasource.DataSourceTransactionManager] : Acquired Connection [conn27:
url=jdbc:h2:mem:activiti user=SA] for JDBC transaction
[org.springframework.jdbc.datasource.DataSourceTransactionManager] : Switching JDBC Connection
[conn27: url=jdbc:h2:mem:activiti user=SA] to manual commit
[org.springframework.jdbc.datasource.DataSourceTransactionManager] : Initiating transaction
commit
[org.springframework.jdbc.datasource.DataSourceTransactionManager] : Committing JDBC transaction
on Connection [conn27: url=jdbc:h2:mem:activiti user=SA]
[org.springframework.jdbc.datasource.DataSourceTransactionManager] : Releasing JDBC Connection
[conn27: url=jdbc:h2:mem:activiti user=SA] after transaction
[org.springframework.jdbc.datasource.DataSourceUtils] : Returning JDBC Connection to DataSource

Results :

Tests run: 5, Failures: 0, Errors: 0, Skipped: 0

[JENKINS] Recording test results
[INFO] 
[INFO] --- maven-bundle-plugin:2.3.6:bundle (default-bundle) @ activiti-karaf-commands ---
[WARNING] Bundle org.apache.provisionr:activiti-karaf-commands:bundle:0.5.0-incubating-SNAPSHOT
: Instructions in Export-Package that are never used: org\.apache\.provisionr\.activiti\.karaf\.commandsiti\.karaf\.commands\.haorg\.apache\.provisionr\.activiti\.karaf\.commandsorg\.activiti\.karaf\.commands\.util
Classpath: Jar:.,Jar:activiti-engine,Jar:commons-email,Jar:mail,Jar:activation,Jar:commons-lang,Jar:livetribe-jsr223,Jar:org.osgi.core,Jar:org.osgi.compendium,Jar:org.apache.karaf.shell.console,Jar:jline,Jar:jansi,Jar:org.apache.karaf.jaas.boot,Jar:org.apache.karaf.jaas.modules,Jar:org.apache.karaf.jaas.config,Jar:org.apache.felix.utils,Jar:org.apache.karaf.util,Jar:org.apache.aries.blueprint.core,Jar:org.apache.aries.blueprint.api,Jar:org.apache.aries.util,Jar:org.apache.aries.quiesce.api,Jar:org.apache.aries.proxy.api,Jar:org.apache.felix.gogo.runtime,Jar:sshd-core,Jar:mina-core,Jar:slf4j-api,Jar:guava,Jar:gson

[WARNING] Bundle org.apache.provisionr:activiti-karaf-commands:bundle:0.5.0-incubating-SNAPSHOT
: Superfluous export-package instructions: [org.apache.provisionr.activiti.karaf.commandsiti.karaf.commands.haorg.apache.provisionr.activiti.karaf.commandsorg.activiti.karaf.commands.util]
[INFO] 
[INFO] --- maven-site-plugin:3.2:attach-descriptor (attach-descriptor) @ activiti-karaf-commands
---
[WARNING] Failed to getClass for org.apache.maven.plugin.source.SourceJarMojo
[INFO] 
[INFO] --- maven-source-plugin:2.2.1:jar (default) @ activiti-karaf-commands ---
[INFO] Building jar: <https://builds.apache.org/job/provisionr-master/ws/activiti/commands/target/activiti-karaf-commands-0.5.0-incubating-SNAPSHOT-sources.jar>
[INFO] 
[INFO] --- apache-rat-plugin:0.9:check (default) @ activiti-karaf-commands ---
[INFO] 51 implicit excludes (use -debug for more details).
[INFO] Exclude: **/*.md
[INFO] Exclude: NOTICE
[INFO] Exclude: .git/**
[INFO] Exclude: .repository/**
[INFO] Exclude: .gitignore
[INFO] Exclude: .idea/**
[INFO] Exclude: **/*.iml
[INFO] Exclude: **/*.project
[INFO] Exclude: **/*.classpath
[INFO] Exclude: **/*.prefs
[INFO] Exclude: **/id_rsa_test
[INFO] Exclude: **/id_rsa_test.pub
[INFO] Exclude: **/*.bpmn20.xml
[INFO] Exclude: **/*.activiti
[INFO] Exclude: **/*.csv
[INFO] Exclude: **/target/**
[INFO] 30 resources included (use -debug for more details)
[INFO] Rat check: Summary of files. Unapproved: 0 unknown: 0 generated: 0 approved: 27 licence.
[INFO] 
[INFO] --- maven-install-plugin:2.3.1:install (default-install) @ activiti-karaf-commands
---
[INFO] Installing <https://builds.apache.org/job/provisionr-master/ws/activiti/commands/target/activiti-karaf-commands-0.5.0-incubating-SNAPSHOT.jar>
to /home/jenkins/jenkins-slave/maven-repositories/0/org/apache/provisionr/activiti-karaf-commands/0.5.0-incubating-SNAPSHOT/activiti-karaf-commands-0.5.0-incubating-SNAPSHOT.jar
[INFO] Installing <https://builds.apache.org/job/provisionr-master/ws/activiti/commands/pom.xml>
to /home/jenkins/jenkins-slave/maven-repositories/0/org/apache/provisionr/activiti-karaf-commands/0.5.0-incubating-SNAPSHOT/activiti-karaf-commands-0.5.0-incubating-SNAPSHOT.pom
[INFO] Installing <https://builds.apache.org/job/provisionr-master/ws/activiti/commands/target/activiti-karaf-commands-0.5.0-incubating-SNAPSHOT-sources.jar>
to /home/jenkins/jenkins-slave/maven-repositories/0/org/apache/provisionr/activiti-karaf-commands/0.5.0-incubating-SNAPSHOT/activiti-karaf-commands-0.5.0-incubating-SNAPSHOT-sources.jar
[INFO] 
[INFO] --- maven-bundle-plugin:2.3.6:install (default-install) @ activiti-karaf-commands ---
[INFO] Installing org/apache/provisionr/activiti-karaf-commands/0.5.0-incubating-SNAPSHOT/activiti-karaf-commands-0.5.0-incubating-SNAPSHOT.jar
[INFO] Writing OBR metadata
[INFO]                                                                         
[INFO] ------------------------------------------------------------------------
[INFO] Building Apache Provisionr :: Activiti Karaf :: Explorer 0.5.0-incubating-SNAPSHOT
[INFO] ------------------------------------------------------------------------
[INFO] 
[INFO] --- maven-clean-plugin:2.5:clean (default-clean) @ activiti-karaf-web-explorer ---
[INFO] 
[INFO] --- maven-remote-resources-plugin:1.4:process (default) @ activiti-karaf-web-explorer
---
[INFO] 
[INFO] --- maven-resources-plugin:2.6:resources (default-resources) @ activiti-karaf-web-explorer
---
[INFO] Using 'UTF-8' encoding to copy filtered resources.
[INFO] skip non existing resourceDirectory <https://builds.apache.org/job/provisionr-master/ws/activiti/explorer/src/main/resources>
[INFO] Copying 3 resources
[INFO] 
[INFO] --- maven-dependency-plugin:2.1:unpack (unpack-vadin) @ activiti-karaf-web-explorer
---
[INFO] Configured Artifact: com.vaadin:vaadin:?:jar
[INFO] Unpacking /home/jenkins/jenkins-slave/maven-repositories/0/com/vaadin/vaadin/6.6.2/vaadin-6.6.2.jar
to
  <https://builds.apache.org/job/provisionr-master/ws/activiti/explorer/target/activiti-karaf-web-explorer-0.5.0-incubating-SNAPSHOT>
   with includes VAADIN/widgetsets/**/*.* and excludes:null
[INFO] 
[JENKINS] Recording test results[INFO] --- maven-dependency-plugin:2.1:unpack (unpack-explorer2)
@ activiti-karaf-web-explorer ---
[INFO] Configured Artifact: org.activiti:activiti-webapp-explorer2:5.10:war
[INFO] Unpacking /home/jenkins/jenkins-slave/maven-repositories/0/org/activiti/activiti-webapp-explorer2/5.10/activiti-webapp-explorer2-5.10.war
to
  <https://builds.apache.org/job/provisionr-master/ws/activiti/explorer/target/unpacked-classes>

   with includes WEB-INF/classes/**/*.* and excludes:WEB-INF/classes/db.properties,WEB-INF/classes/logging.properties,WEB-INF/classes/activiti.cfg.xml
[INFO] 
[INFO] --- maven-resources-plugin:2.6:copy-resources (copy-unpacked-classes-explorer2) @ activiti-karaf-web-explorer
---
[INFO] Using 'UTF-8' encoding to copy filtered resources.
[INFO] Copying 385 resources
[INFO] 
[INFO] --- maven-compiler-plugin:3.0:compile (default-compile) @ activiti-karaf-web-explorer
---
[INFO] No sources to compile
[INFO] 
[INFO] --- maven-bundle-plugin:2.3.6:manifest (bundle-manifest) @ activiti-karaf-web-explorer
---
[INFO] Writing BND instructions to <https://builds.apache.org/job/provisionr-master/ws/activiti/explorer/target/bundle-instructions.txt>
[INFO] Writing BND classpath to <https://builds.apache.org/job/provisionr-master/ws/activiti/explorer/target/bundle-classpath.txt>
[WARNING] Manifest org.apache.provisionr:activiti-karaf-web-explorer:war:0.5.0-incubating-SNAPSHOT
: No sub JAR or directory WEB-INF/classes
[WARNING] Manifest org.apache.provisionr:activiti-karaf-web-explorer:war:0.5.0-incubating-SNAPSHOT
: Superfluous export-package instructions: [org, org.activiti]
[WARNING] Manifest org.apache.provisionr:activiti-karaf-web-explorer:war:0.5.0-incubating-SNAPSHOT
: Did not find matching referal for !VAADIN.theams.activiti.*
[WARNING] Manifest org.apache.provisionr:activiti-karaf-web-explorer:war:0.5.0-incubating-SNAPSHOT
: Did not find matching referal for !org.activiti.explorer.*
[WARNING] Manifest org.apache.provisionr:activiti-karaf-web-explorer:war:0.5.0-incubating-SNAPSHOT
: Did not find matching referal for !org.activiti.karaf.web.explorer.*
[WARNING] Manifest org.apache.provisionr:activiti-karaf-web-explorer:war:0.5.0-incubating-SNAPSHOT
: Did not find matching referal for VAADIN.*
[WARNING] Manifest org.apache.provisionr:activiti-karaf-web-explorer:war:0.5.0-incubating-SNAPSHOT
: Did not find matching referal for org.activiti.osgi*
[WARNING] Manifest org.apache.provisionr:activiti-karaf-web-explorer:war:0.5.0-incubating-SNAPSHOT
: Did not find matching referal for org.activiti.osgi.*
[WARNING] Manifest org.apache.provisionr:activiti-karaf-web-explorer:war:0.5.0-incubating-SNAPSHOT
: Did not find matching referal for org.activiti.spring.*
[WARNING] Manifest org.apache.provisionr:activiti-karaf-web-explorer:war:0.5.0-incubating-SNAPSHOT
: Did not find matching referal for org.springframework.jdbc.*
[INFO] 
[INFO] --- maven-resources-plugin:2.6:testResources (default-testResources) @ activiti-karaf-web-explorer
---
[INFO] Using 'UTF-8' encoding to copy filtered resources.
[INFO] skip non existing resourceDirectory <https://builds.apache.org/job/provisionr-master/ws/activiti/explorer/src/test/resources>
[INFO] Copying 3 resources
[INFO] 
[INFO] --- maven-compiler-plugin:3.0:testCompile (default-testCompile) @ activiti-karaf-web-explorer
---
[INFO] No sources to compile
[INFO] 
[INFO] --- maven-surefire-plugin:2.13:test (default-test) @ activiti-karaf-web-explorer ---
[INFO] 
[INFO] --- maven-war-plugin:2.3:war (default-war) @ activiti-karaf-web-explorer ---
[INFO] Packaging webapp
[INFO] Assembling webapp [activiti-karaf-web-explorer] in [<https://builds.apache.org/job/provisionr-master/ws/activiti/explorer/target/activiti-karaf-web-explorer-0.5.0-incubating-SNAPSHOT]>
[INFO] Processing overlay [ id org.activiti:activiti-webapp-explorer2]
[INFO] Processing war project
[INFO] Copying webapp resources [<https://builds.apache.org/job/provisionr-master/ws/activiti/explorer/src/main/webapp]>
[INFO] Webapp assembled in [2908 msecs]
[INFO] Building war: <https://builds.apache.org/job/provisionr-master/ws/activiti/explorer/target/activiti-karaf-web-explorer-0.5.0-incubating-SNAPSHOT.war>
[INFO] 
[INFO] --- maven-site-plugin:3.2:attach-descriptor (attach-descriptor) @ activiti-karaf-web-explorer
---
[WARNING] Failed to getClass for org.apache.maven.plugin.source.SourceJarMojo
[INFO] 
[INFO] --- maven-source-plugin:2.2.1:jar (default) @ activiti-karaf-web-explorer ---
[INFO] Building jar: <https://builds.apache.org/job/provisionr-master/ws/activiti/explorer/target/activiti-karaf-web-explorer-0.5.0-incubating-SNAPSHOT-sources.jar>
[INFO] 
[INFO] --- apache-rat-plugin:0.9:check (default) @ activiti-karaf-web-explorer ---
[INFO] 51 implicit excludes (use -debug for more details).
[INFO] Exclude: **/*.md
[INFO] Exclude: NOTICE
[INFO] Exclude: .git/**
[INFO] Exclude: .repository/**
[INFO] Exclude: .gitignore
[INFO] Exclude: .idea/**
[INFO] Exclude: **/*.iml
[INFO] Exclude: **/*.project
[INFO] Exclude: **/*.classpath
[INFO] Exclude: **/*.prefs
[INFO] Exclude: **/id_rsa_test
[INFO] Exclude: **/id_rsa_test.pub
[INFO] Exclude: **/*.bpmn20.xml
[INFO] Exclude: **/*.activiti
[INFO] Exclude: **/*.csv
[INFO] Exclude: **/target/**
[INFO] 4 resources included (use -debug for more details)
[INFO] Rat check: Summary of files. Unapproved: 0 unknown: 0 generated: 0 approved: 4 licence.
[INFO] 
[INFO] --- maven-install-plugin:2.3.1:install (default-install) @ activiti-karaf-web-explorer
---
[INFO] Installing <https://builds.apache.org/job/provisionr-master/ws/activiti/explorer/target/activiti-karaf-web-explorer-0.5.0-incubating-SNAPSHOT.war>
to /home/jenkins/jenkins-slave/maven-repositories/0/org/apache/provisionr/activiti-karaf-web-explorer/0.5.0-incubating-SNAPSHOT/activiti-karaf-web-explorer-0.5.0-incubating-SNAPSHOT.war
[INFO] Installing <https://builds.apache.org/job/provisionr-master/ws/activiti/explorer/pom.xml>
to /home/jenkins/jenkins-slave/maven-repositories/0/org/apache/provisionr/activiti-karaf-web-explorer/0.5.0-incubating-SNAPSHOT/activiti-karaf-web-explorer-0.5.0-incubating-SNAPSHOT.pom
[INFO] Installing <https://builds.apache.org/job/provisionr-master/ws/activiti/explorer/target/activiti-karaf-web-explorer-0.5.0-incubating-SNAPSHOT-sources.jar>
to /home/jenkins/jenkins-slave/maven-repositories/0/org/apache/provisionr/activiti-karaf-web-explorer/0.5.0-incubating-SNAPSHOT/activiti-karaf-web-explorer-0.5.0-incubating-SNAPSHOT-sources.jar
Build timed out (after 60 minutes). Marking the build as failed.
[INFO] ------------------------------------------------------------------------
[INFO] Reactor Summary:
[INFO] 
[INFO] Apache Provisionr :: Parent ....................... SUCCESS [46.748s]
[INFO] Apache Provisionr :: API .......................... SUCCESS [22.204s]
[INFO] Apache Provisionr :: Activiti Database ............ SUCCESS [44.617s]
[INFO] Apache Provisionr :: Test Support ................. SUCCESS [1:09.742s]
[INFO] Apache Provisionr :: Core ......................... SUCCESS [33.857s]
[INFO] Apache Provisionr :: Examples ..................... SUCCESS [22.866s]
[INFO] Apache Provisionr :: Web Console & REST API ....... SUCCESS [20.320s]
[INFO] Apache Provisionr :: Amazon ....................... SUCCESS [25.824s]
[INFO] Apache Provisionr :: CloudStack ................... SUCCESS [16.216s]
[INFO] Apache Provisionr :: Rundeck ...................... SUCCESS [43.467s]
[INFO] Apache Provisionr :: Activiti Karaf :: Commands ... SUCCESS [50.953s]
[INFO] Apache Provisionr :: Activiti Karaf :: Explorer ... FAILURE [2:14.337s]
[INFO] Apache Provisionr :: Karaf Commands ............... SKIPPED
[INFO] Apache Provisionr :: Karaf Branding ............... SKIPPED
[INFO] Apache Provisionr :: Karaf Features ............... SKIPPED
[INFO] Apache Provisionr :: Amazon Integration Tests ..... SKIPPED
[INFO] Apache Provisionr :: CloudStack Integration Tests . SKIPPED
[INFO] Apache Provisionr :: Custom Karaf Distribution .... SKIPPED
[INFO] Apache Provisionr :: Custom Karaf Distribution Tests  SKIPPED
[INFO] Apache Provisionr :: Aggregator ................... SKIPPED
[INFO] ------------------------------------------------------------------------
[INFO] BUILD FAILURE
[INFO] ------------------------------------------------------------------------
[INFO] Total time: 59:47.774s
[INFO] Finished at: Thu Nov 07 13:57:17 UTC 2013
[INFO] Final Memory: 51M/275M
[INFO] ------------------------------------------------------------------------
[ERROR] Internal error: java.lang.IllegalStateException: Unable to call isArchivingDisabled.
Invalid object ID 18 -> [Help 1]
org.apache.maven.InternalErrorException: Internal error: java.lang.IllegalStateException:
Unable to call isArchivingDisabled. Invalid object ID 18
	at org.apache.maven.DefaultMaven.execute(DefaultMaven.java:168)
	at org.jvnet.hudson.maven3.launcher.Maven3Launcher.main(Maven3Launcher.java:117)
	at sun.reflect.NativeMethodAccessorImpl.invoke0(Native Method)
	at sun.reflect.NativeMethodAccessorImpl.invoke(NativeMethodAccessorImpl.java:39)
	at sun.reflect.DelegatingMethodAccessorImpl.invoke(DelegatingMethodAccessorImpl.java:25)
	at java.lang.reflect.Method.invoke(Method.java:597)
	at org.codehaus.plexus.classworlds.launcher.Launcher.launchStandard(Launcher.java:329)
	at org.codehaus.plexus.classworlds.launcher.Launcher.launch(Launcher.java:239)
	at org.jvnet.hudson.maven3.agent.Maven3Main.launch(Maven3Main.java:178)
	at sun.reflect.NativeMethodAccessorImpl.invoke0(Native Method)
	at sun.reflect.NativeMethodAccessorImpl.invoke(NativeMethodAccessorImpl.java:39)
	at sun.reflect.DelegatingMethodAccessorImpl.invoke(DelegatingMethodAccessorImpl.java:25)
	at java.lang.reflect.Method.invoke(Method.java:597)
	at hudson.maven.Maven3Builder.call(Maven3Builder.java:134)
	at hudson.maven.Maven3Builder.call(Maven3Builder.java:69)
	at hudson.remoting.UserRequest.perform(UserRequest.java:118)
	at hudson.remoting.UserRequest.perform(UserRequest.java:48)
	at hudson.remoting.Request$2.run(Request.java:326)
	at hudson.remoting.InterceptingExecutorService$1.call(InterceptingExecutorService.java:72)
	at java.util.concurrent.FutureTask$Sync.innerRun(FutureTask.java:303)
	at java.util.concurrent.FutureTask.run(FutureTask.java:138)
	at java.util.concurrent.ThreadPoolExecutor$Worker.runTask(ThreadPoolExecutor.java:895)
	at java.util.concurrent.ThreadPoolExecutor$Worker.run(ThreadPoolExecutor.java:918)
	at java.lang.Thread.run(Thread.java:662)
Caused by: java.lang.IllegalStateException: Unable to call isArchivingDisabled. Invalid object
ID 18
	at hudson.remoting.RemoteInvocationHandler$RPCRequest.perform(RemoteInvocationHandler.java:293)
	at hudson.remoting.RemoteInvocationHandler$RPCRequest.call(RemoteInvocationHandler.java:280)
	at hudson.remoting.RemoteInvocationHandler$RPCRequest.call(RemoteInvocationHandler.java:239)
	at hudson.remoting.UserRequest.perform(UserRequest.java:118)
	at hudson.remoting.UserRequest.perform(UserRequest.java:48)
	at hudson.remoting.Request$2.run(Request.java:326)
	at hudson.remoting.InterceptingExecutorService$1.call(InterceptingExecutorService.java:72)
	at java.util.concurrent.FutureTask$Sync.innerRun(FutureTask.java:334)
	at java.util.concurrent.FutureTask.run(FutureTask.java:166)
	at java.util.concurrent.ThreadPoolExecutor.runWorker(ThreadPoolExecutor.java:1145)
	at java.util.concurrent.ThreadPoolExecutor$Worker.run(ThreadPoolExecutor.java:615)
	at java.lang.Thread.run(Thread.java:724)
[ERROR] 
[ERROR] To see the full stack trace of the errors, re-run Maven with the -e switch.
[ERROR] Re-run Maven using the -X switch to enable full debug logging.
[ERROR] 
[ERROR] For more information about the errors and possible solutions, please read the following
articles:
[ERROR] [Help 1] http://cwiki.apache.org/confluence/display/MAVEN/InternalErrorException
channel stopped
Archiving artifacts

Mime
View raw message