provisionr-dev mailing list archives

Site index · List index
Message view « Date » · « Thread »
Top « Date » · « Thread »
From Apache Jenkins Server <jenk...@builds.apache.org>
Subject Build failed in Jenkins: provisionr-master #166
Date Sat, 02 Nov 2013 17:27:52 GMT
See <https://builds.apache.org/job/provisionr-master/166/>

------------------------------------------
[...truncated 1338 lines...]
[INFO] 51 implicit excludes (use -debug for more details).
[INFO] Exclude: **/*.md
[INFO] Exclude: NOTICE
[INFO] Exclude: .git/**
[INFO] Exclude: .repository/**
[INFO] Exclude: .gitignore
[INFO] Exclude: .idea/**
[INFO] Exclude: **/*.iml
[INFO] Exclude: **/*.project
[INFO] Exclude: **/*.classpath
[INFO] Exclude: **/*.prefs
[INFO] Exclude: **/id_rsa_test
[INFO] Exclude: **/id_rsa_test.pub
[INFO] Exclude: **/*.bpmn20.xml
[INFO] Exclude: **/*.activiti
[INFO] Exclude: **/*.csv
[INFO] Exclude: **/target/**
[INFO] 59 resources included (use -debug for more details)
[INFO] Rat check: Summary of files. Unapproved: 0 unknown: 0 generated: 0 approved: 58 licence.
[INFO] 
[INFO] --- build-helper-maven-plugin:1.8:attach-artifact (attach-artifacts) @ provisionr-amazon
---
[INFO] 
[INFO] --- maven-remote-resources-plugin:1.4:process (default) @ provisionr-amazon ---
[INFO] 
[INFO] --- maven-resources-plugin:2.6:resources (default-resources) @ provisionr-amazon ---
[INFO] Using 'UTF-8' encoding to copy filtered resources.
[INFO] Copying 11 resources
[INFO] Copying 3 resources
[INFO] Copying 3 resources
[INFO] 
[INFO] --- maven-compiler-plugin:3.0:compile (default-compile) @ provisionr-amazon ---
[INFO] Changes detected - recompiling the module!
[INFO] Compiling 34 source files to <https://builds.apache.org/job/provisionr-master/ws/providers/amazon/target/classes>
[WARNING] Failed to getClass for org.apache.karaf.tooling.features.AddFeaturesToRepoMojo
[INFO] 
[INFO] --- features-maven-plugin:2.3.1:add-features-to-repo (add-features-to-repo) @ provisionr-amazon
---
[INFO] Copying bundle: org.apache.karaf.assemblies.features:standard:xml:features:2.3.1
[INFO] Copying bundle: org.apache.karaf.assemblies.features:enterprise:xml:features:2.3.1
[INFO] Copying bundle: org.apache.karaf.assemblies.features:enterprise:xml:features:2.3.1
[INFO] Copying bundle: org.apache.karaf.assemblies.features:standard:xml:features:2.3.1
[INFO] Copying bundle: org.apache.provisionr:provisionr-core:xml:features:0.5.0-incubating-SNAPSHOT
[INFO] Adding contents of transitive feature: transaction/1.0.1
[INFO] Adding contents of transitive feature: activiti-karaf/5.10
[INFO] Adding contents of transitive feature: provisionr-amazon/0.5.0-incubating-SNAPSHOT
[INFO] Adding contents of transitive feature: provisionr-core/0.5.0-incubating-SNAPSHOT
[INFO] Base repo: file:///home/jenkins/jenkins-slave/maven-repositories/1/
[INFO] Copying bundle: org.apache.provisionr:provisionr-core:jar:0.5.0-incubating-SNAPSHOT
[INFO] Copying bundle: org.activiti:activiti-osgi:jar:5.10
[INFO] Copying bundle: org.bouncycastle:bcprov-jdk16:jar:1.46
[INFO] Copying bundle: com.github.spullara.mustache.java:compiler:jar:0.8.8
[INFO] Copying bundle: org.jbundle.util.osgi.wrapped:org.jbundle.util.osgi.wrapped.org.apache.http.client:jar:4.1.2
[INFO] Copying bundle: com.google.code.gson:gson:jar:1.7.1
[INFO] Copying bundle: org.apache.servicemix.bundles:org.apache.servicemix.bundles.aws-java-sdk:jar:1.3.14_1
[INFO] Copying bundle: org.apache.aries.transaction:org.apache.aries.transaction.blueprint:jar:1.0.0
[INFO] Copying bundle: org.apache.provisionr:provisionr-core:cfg:fileinstall:0.5.0-incubating-SNAPSHOT
[INFO] Copying bundle: org.apache.geronimo.specs:geronimo-jta_1.1_spec:jar:1.1.1
[INFO] Copying bundle: org.springframework:spring-tx:jar:3.1.4.RELEASE
[INFO] Copying bundle: com.google.guava:guava:jar:13.0
[INFO] Copying bundle: org.apache.provisionr:provisionr-core:cfg:defaults:0.5.0-incubating-SNAPSHOT
[INFO] Copying bundle: javax.mail:mail:jar:1.4.4
[INFO] Copying bundle: org.springframework:spring-jdbc:jar:3.1.4.RELEASE
[INFO] Copying bundle: org.apache.servicemix.bundles:org.apache.servicemix.bundles.commons-codec:jar:1.3_5
[INFO] Copying bundle: org.codehaus.groovy:groovy-all:jar:2.1.5
[INFO] Copying bundle: org.springframework:spring-core:jar:3.1.4.RELEASE
[INFO] Copying bundle: org.springframework:spring-context:jar:3.1.4.RELEASE
[INFO] Copying bundle: org.activiti:activiti-engine:jar:5.10
[INFO] Copying bundle: org.apache.provisionr:provisionr-amazon:jar:0.5.0-incubating-SNAPSHOT
[INFO] Copying bundle: org.apache.provisionr:activiti-database:jar:0.5.0-incubating-SNAPSHOT
[INFO] Copying bundle: org.springframework:spring-beans:jar:3.1.4.RELEASE
[INFO] Copying bundle: com.h2database:h2:jar:1.3.168
[INFO] Copying bundle: org.apache.provisionr:provisionr-amazon:cfg:defaults:0.5.0-incubating-SNAPSHOT
[INFO] Copying bundle: net.schmizz:sshj:jar:0.8.1
[INFO] Copying bundle: org.mybatis:mybatis:jar:3.1.1
[INFO] Copying bundle: org.apache.aries.transaction:org.apache.aries.transaction.manager:jar:1.0.1
[INFO] Copying bundle: org.apache.provisionr:provisionr-api:jar:0.5.0-incubating-SNAPSHOT
[INFO] Copying bundle: org.apache.servicemix.bundles:org.apache.servicemix.bundles.jzlib:jar:1.0.7_1
[INFO] 
[INFO] --- maven-install-plugin:2.3.1:install (default-install) @ provisionr-amazon ---
[INFO] Installing <https://builds.apache.org/job/provisionr-master/ws/providers/amazon/target/provisionr-amazon-0.5.0-incubating-SNAPSHOT.jar>
to /home/jenkins/jenkins-slave/maven-repositories/1/org/apache/provisionr/provisionr-amazon/0.5.0-incubating-SNAPSHOT/provisionr-amazon-0.5.0-incubating-SNAPSHOT.jar
[INFO] Installing <https://builds.apache.org/job/provisionr-master/ws/providers/amazon/pom.xml>
to /home/jenkins/jenkins-slave/maven-repositories/1/org/apache/provisionr/provisionr-amazon/0.5.0-incubating-SNAPSHOT/provisionr-amazon-0.5.0-incubating-SNAPSHOT.pom
[INFO] Installing <https://builds.apache.org/job/provisionr-master/ws/providers/amazon/target/provisionr-amazon-0.5.0-incubating-SNAPSHOT-sources.jar>
to /home/jenkins/jenkins-slave/maven-repositories/1/org/apache/provisionr/provisionr-amazon/0.5.0-incubating-SNAPSHOT/provisionr-amazon-0.5.0-incubating-SNAPSHOT-sources.jar
[INFO] Installing <https://builds.apache.org/job/provisionr-master/ws/providers/amazon/target/classes/features.xml>
to /home/jenkins/jenkins-slave/maven-repositories/1/org/apache/provisionr/provisionr-amazon/0.5.0-incubating-SNAPSHOT/provisionr-amazon-0.5.0-incubating-SNAPSHOT-features.xml
[INFO] Installing <https://builds.apache.org/job/provisionr-master/ws/providers/amazon/target/classes/org.apache.provisionr.amazon.cfg>
to /home/jenkins/jenkins-slave/maven-repositories/1/org/apache/provisionr/provisionr-amazon/0.5.0-incubating-SNAPSHOT/provisionr-amazon-0.5.0-incubating-SNAPSHOT-defaults.cfg
[INFO] 
[INFO] --- maven-bundle-plugin:2.3.6:install (default-install) @ provisionr-amazon ---
[INFO] Installing org/apache/provisionr/provisionr-amazon/0.5.0-incubating-SNAPSHOT/provisionr-amazon-0.5.0-incubating-SNAPSHOT.jar
[INFO] Writing OBR metadata
[INFO] ------------------------------------------------------------------------
[INFO] Reactor Summary:
[INFO] 
[INFO] Apache Provisionr :: Parent ....................... SUCCESS [26.136s]
[INFO] Apache Provisionr :: API .......................... SUCCESS [23.878s]
[INFO] Apache Provisionr :: Activiti Database ............ SUCCESS [13.325s]
[INFO] Apache Provisionr :: Test Support ................. SUCCESS [35.469s]
[INFO] Apache Provisionr :: Core ......................... SUCCESS [21.649s]
[INFO] Apache Provisionr :: Examples ..................... SUCCESS [13.345s]
[INFO] Apache Provisionr :: Web Console & REST API ....... SUCCESS [21.102s]
[INFO] Apache Provisionr :: Amazon ....................... FAILURE [27.740s]
[INFO] Apache Provisionr :: CloudStack ................... SKIPPED
[INFO] Apache Provisionr :: Rundeck ...................... SKIPPED
[INFO] Apache Provisionr :: Activiti Karaf :: Commands ... SKIPPED
[INFO] Apache Provisionr :: Activiti Karaf :: Explorer ... SKIPPED
[INFO] Apache Provisionr :: Karaf Commands ............... SKIPPED
[INFO] Apache Provisionr :: Karaf Branding ............... SKIPPED
[INFO] Apache Provisionr :: Karaf Features ............... SKIPPED
[INFO] Apache Provisionr :: Amazon Integration Tests ..... SKIPPED
[INFO] Apache Provisionr :: CloudStack Integration Tests . SKIPPED
[INFO] Apache Provisionr :: Custom Karaf Distribution .... SKIPPED
[INFO] Apache Provisionr :: Custom Karaf Distribution Tests  SKIPPED
[INFO] Apache Provisionr :: Aggregator ................... SKIPPED
[INFO] ------------------------------------------------------------------------
[INFO] BUILD FAILURE
[INFO] ------------------------------------------------------------------------
[INFO] Total time: 16:10.266s
[INFO] Finished at: Sat Nov 02 17:16:57 UTC 2013
[INFO] Final Memory: 41M/264M
[INFO] ------------------------------------------------------------------------
Waiting for Jenkins to finish collecting data
[ERROR] Internal error: hudson.remoting.RemotingSystemException: java.io.StreamCorruptedException:
invalid type code: 7F -> [Help 1]
org.apache.maven.InternalErrorException: Internal error: hudson.remoting.RemotingSystemException:
java.io.StreamCorruptedException: invalid type code: 7F
	at org.apache.maven.lifecycle.internal.BuilderCommon.handleBuildError(BuilderCommon.java:128)
	at org.apache.maven.lifecycle.internal.LifecycleModuleBuilder.buildProject(LifecycleModuleBuilder.java:95)
	at org.apache.maven.lifecycle.internal.LifecycleModuleBuilder.buildProject(LifecycleModuleBuilder.java:59)
	at org.apache.maven.lifecycle.internal.LifecycleStarter.singleThreadedBuild(LifecycleStarter.java:183)
	at org.apache.maven.lifecycle.internal.LifecycleStarter.execute(LifecycleStarter.java:161)
	at org.apache.maven.DefaultMaven.doExecute(DefaultMaven.java:320)
	at org.apache.maven.DefaultMaven.execute(DefaultMaven.java:156)
	at org.jvnet.hudson.maven3.launcher.Maven3Launcher.main(Maven3Launcher.java:117)
	at sun.reflect.NativeMethodAccessorImpl.invoke0(Native Method)
	at sun.reflect.NativeMethodAccessorImpl.invoke(NativeMethodAccessorImpl.java:39)
	at sun.reflect.DelegatingMethodAccessorImpl.invoke(DelegatingMethodAccessorImpl.java:25)
	at java.lang.reflect.Method.invoke(Method.java:597)
	at org.codehaus.plexus.classworlds.launcher.Launcher.launchStandard(Launcher.java:329)
	at org.codehaus.plexus.classworlds.launcher.Launcher.launch(Launcher.java:239)
	at org.jvnet.hudson.maven3.agent.Maven3Main.launch(Maven3Main.java:178)
	at sun.reflect.NativeMethodAccessorImpl.invoke0(Native Method)
	at sun.reflect.NativeMethodAccessorImpl.invoke(NativeMethodAccessorImpl.java:39)
	at sun.reflect.DelegatingMethodAccessorImpl.invoke(DelegatingMethodAccessorImpl.java:25)
	at java.lang.reflect.Method.invoke(Method.java:597)
	at hudson.maven.Maven3Builder.call(Maven3Builder.java:134)
	at hudson.maven.Maven3Builder.call(Maven3Builder.java:69)
	at hudson.remoting.UserRequest.perform(UserRequest.java:118)
	at hudson.remoting.UserRequest.perform(UserRequest.java:48)
	at hudson.remoting.Request$2.run(Request.java:326)
	at hudson.remoting.InterceptingExecutorService$1.call(InterceptingExecutorService.java:72)
	at java.util.concurrent.FutureTask$Sync.innerRun(FutureTask.java:303)
	at java.util.concurrent.FutureTask.run(FutureTask.java:138)
	at java.util.concurrent.ThreadPoolExecutor$Worker.runTask(ThreadPoolExecutor.java:895)
	at java.util.concurrent.ThreadPoolExecutor$Worker.run(ThreadPoolExecutor.java:918)
	at java.lang.Thread.run(Thread.java:662)
Caused by: hudson.remoting.RemotingSystemException: java.io.StreamCorruptedException: invalid
type code: 7F
	at hudson.remoting.RemoteInvocationHandler.invoke(RemoteInvocationHandler.java:183)
	at com.sun.proxy.$Proxy7.setExecutedMojos(Unknown Source)
	at hudson.maven.MavenBuildProxy$Filter.setExecutedMojos(MavenBuildProxy.java:257)
	at hudson.maven.Maven3Builder$MavenExecutionListener.recordMojoEnded(Maven3Builder.java:624)
	at hudson.maven.Maven3Builder$MavenExecutionListener.mojoSucceeded(Maven3Builder.java:610)
	at org.apache.maven.lifecycle.internal.DefaultExecutionEventCatapult.fire(DefaultExecutionEventCatapult.java:87)
	at org.apache.maven.lifecycle.internal.DefaultExecutionEventCatapult.fire(DefaultExecutionEventCatapult.java:42)
	at org.apache.maven.lifecycle.internal.MojoExecutor.execute(MojoExecutor.java:228)
	at org.apache.maven.lifecycle.internal.MojoExecutor.execute(MojoExecutor.java:153)
	at org.apache.maven.lifecycle.internal.MojoExecutor.execute(MojoExecutor.java:145)
	at org.apache.maven.lifecycle.internal.LifecycleModuleBuilder.buildProject(LifecycleModuleBuilder.java:84)
	... 28 more
Caused by: java.io.StreamCorruptedException: invalid type code: 7F
	at java.io.ObjectInputStream.readObject0(ObjectInputStream.java:1375)
	at java.io.ObjectInputStream.defaultReadFields(ObjectInputStream.java:1989)
	at java.io.ObjectInputStream.readSerialData(ObjectInputStream.java:1913)
	at java.io.ObjectInputStream.readOrdinaryObject(ObjectInputStream.java:1796)
	at java.io.ObjectInputStream.readObject0(ObjectInputStream.java:1348)
	at java.io.ObjectInputStream.readObject(ObjectInputStream.java:370)
	at java.util.concurrent.CopyOnWriteArrayList.readObject(CopyOnWriteArrayList.java:879)
	at sun.reflect.GeneratedMethodAccessor487.invoke(Unknown Source)
	at sun.reflect.DelegatingMethodAccessorImpl.invoke(DelegatingMethodAccessorImpl.java:43)
	at java.lang.reflect.Method.invoke(Method.java:606)
	at java.io.ObjectStreamClass.invokeReadObject(ObjectStreamClass.java:1017)
	at java.io.ObjectInputStream.readSerialData(ObjectInputStream.java:1891)
	at java.io.ObjectInputStream.readOrdinaryObject(ObjectInputStream.java:1796)
	at java.io.ObjectInputStream.readObject0(ObjectInputStream.java:1348)
	at java.io.ObjectInputStream.readArray(ObjectInputStream.java:1704)
	at java.io.ObjectInputStream.readObject0(ObjectInputStream.java:1342)
	at java.io.ObjectInputStream.defaultReadFields(ObjectInputStream.java:1989)
	at java.io.ObjectInputStream.readSerialData(ObjectInputStream.java:1913)
	at java.io.ObjectInputStream.readOrdinaryObject(ObjectInputStream.java:1796)
	at java.io.ObjectInputStream.readObject0(ObjectInputStream.java:1348)
	at java.io.ObjectInputStream.readObject(ObjectInputStream.java:370)
	at hudson.remoting.UserRequest.deserialize(UserRequest.java:182)
	at hudson.remoting.UserRequest.perform(UserRequest.java:98)
	at hudson.remoting.UserRequest.perform(UserRequest.java:48)
	at hudson.remoting.Request$2.run(Request.java:326)
	at hudson.remoting.InterceptingExecutorService$1.call(InterceptingExecutorService.java:72)
	at java.util.concurrent.FutureTask$Sync.innerRun(FutureTask.java:334)
	at java.util.concurrent.FutureTask.run(FutureTask.java:166)
	at java.util.concurrent.ThreadPoolExecutor.runWorker(ThreadPoolExecutor.java:1145)
	at java.util.concurrent.ThreadPoolExecutor$Worker.run(ThreadPoolExecutor.java:615)
	at java.lang.Thread.run(Thread.java:724)
[ERROR] 
[JENKINS] Archiving <https://builds.apache.org/job/provisionr-master/ws/test-support/pom.xml>
to org.apache.provisionr/provisionr-test-support/0.5.0-incubating-SNAPSHOT/provisionr-test-support-0.5.0-incubating-SNAPSHOT.pom
[JENKINS] Archiving <https://builds.apache.org/job/provisionr-master/ws/test-support/target/provisionr-test-support-0.5.0-incubating-SNAPSHOT.jar>
to org.apache.provisionr/provisionr-test-support/0.5.0-incubating-SNAPSHOT/provisionr-test-support-0.5.0-incubating-SNAPSHOT.jar
[JENKINS] Archiving <https://builds.apache.org/job/provisionr-master/ws/test-support/target/provisionr-test-support-0.5.0-incubating-SNAPSHOT-sources.jar>
to org.apache.provisionr/provisionr-test-support/0.5.0-incubating-SNAPSHOT/provisionr-test-support-0.5.0-incubating-SNAPSHOT-sources.jar
[JENKINS] Archiving <https://builds.apache.org/job/provisionr-master/ws/test-support/target/features.xml>
to org.apache.provisionr/provisionr-test-support/0.5.0-incubating-SNAPSHOT/provisionr-test-support-0.5.0-incubating-SNAPSHOT-features.xml
[ERROR] To see the full stack trace of the errors, re-run Maven with the -e switch.
[ERROR] Re-run Maven using the -X switch to enable full debug logging.
[ERROR] 
[ERROR] For more information about the errors and possible solutions, please read the following
articles:
[ERROR] [Help 1] http://cwiki.apache.org/confluence/display/MAVEN/InternalErrorException
[JENKINS] Archiving <https://builds.apache.org/job/provisionr-master/ws/activiti/explorer/pom.xml>
to org.apache.provisionr/activiti-karaf-web-explorer/0.5.0-incubating-SNAPSHOT/activiti-karaf-web-explorer-0.5.0-incubating-SNAPSHOT.pom
[JENKINS] Archiving <https://builds.apache.org/job/provisionr-master/ws/providers/cloudstack/pom.xml>
to org.apache.provisionr/provisionr-cloudstack/0.5.0-incubating-SNAPSHOT/provisionr-cloudstack-0.5.0-incubating-SNAPSHOT.pom
[JENKINS] Archiving <https://builds.apache.org/job/provisionr-master/ws/karaf/features/pom.xml>
to org.apache.provisionr/provisionr-features/0.5.0-incubating-SNAPSHOT/provisionr-features-0.5.0-incubating-SNAPSHOT.pom
[JENKINS] Archiving <https://builds.apache.org/job/provisionr-master/ws/providers/cloudstack-tests/pom.xml>
to org.apache.provisionr/provisionr-cloudstack-tests/0.5.0-incubating-SNAPSHOT/provisionr-cloudstack-tests-0.5.0-incubating-SNAPSHOT.pom
[JENKINS] Archiving <https://builds.apache.org/job/provisionr-master/ws/console/pom.xml>
to org.apache.provisionr/provisionr-console/0.5.0-incubating-SNAPSHOT/provisionr-console-0.5.0-incubating-SNAPSHOT.pom
[JENKINS] Archiving <https://builds.apache.org/job/provisionr-master/ws/console/target/provisionr-console-0.5.0-incubating-SNAPSHOT.jar>
to org.apache.provisionr/provisionr-console/0.5.0-incubating-SNAPSHOT/provisionr-console-0.5.0-incubating-SNAPSHOT.jar
[JENKINS] Archiving <https://builds.apache.org/job/provisionr-master/ws/console/target/provisionr-console-0.5.0-incubating-SNAPSHOT-sources.jar>
to org.apache.provisionr/provisionr-console/0.5.0-incubating-SNAPSHOT/provisionr-console-0.5.0-incubating-SNAPSHOT-sources.jar
[JENKINS] Archiving <https://builds.apache.org/job/provisionr-master/ws/console/target/classes/features.xml>
to org.apache.provisionr/provisionr-console/0.5.0-incubating-SNAPSHOT/provisionr-console-0.5.0-incubating-SNAPSHOT-features.xml
[JENKINS] Archiving <https://builds.apache.org/job/provisionr-master/ws/console/target/classes/org.apache.provisionr.console.cfg>
to org.apache.provisionr/provisionr-console/0.5.0-incubating-SNAPSHOT/provisionr-console-0.5.0-incubating-SNAPSHOT-defaults.cfg
[JENKINS] Archiving <https://builds.apache.org/job/provisionr-master/ws/karaf/branding/pom.xml>
to org.apache.provisionr/provisionr-branding/0.5.0-incubating-SNAPSHOT/provisionr-branding-0.5.0-incubating-SNAPSHOT.pom
[JENKINS] Archiving <https://builds.apache.org/job/provisionr-master/ws/examples/pom.xml>
to org.apache.provisionr/provisionr-examples/0.5.0-incubating-SNAPSHOT/provisionr-examples-0.5.0-incubating-SNAPSHOT.pom
[JENKINS] Archiving <https://builds.apache.org/job/provisionr-master/ws/examples/target/provisionr-examples-0.5.0-incubating-SNAPSHOT.jar>
to org.apache.provisionr/provisionr-examples/0.5.0-incubating-SNAPSHOT/provisionr-examples-0.5.0-incubating-SNAPSHOT.jar
[JENKINS] Archiving <https://builds.apache.org/job/provisionr-master/ws/examples/target/provisionr-examples-0.5.0-incubating-SNAPSHOT-sources.jar>
to org.apache.provisionr/provisionr-examples/0.5.0-incubating-SNAPSHOT/provisionr-examples-0.5.0-incubating-SNAPSHOT-sources.jar
[JENKINS] Archiving <https://builds.apache.org/job/provisionr-master/ws/examples/target/classes/features.xml>
to org.apache.provisionr/provisionr-examples/0.5.0-incubating-SNAPSHOT/provisionr-examples-0.5.0-incubating-SNAPSHOT-features.xml
[JENKINS] Archiving <https://builds.apache.org/job/provisionr-master/ws/examples/target/classes/org/apache/provisionr/examples/templates/cdh3.xml>
to org.apache.provisionr/provisionr-examples/0.5.0-incubating-SNAPSHOT/provisionr-examples-0.5.0-incubating-SNAPSHOT-cdh3.template
[JENKINS] Archiving <https://builds.apache.org/job/provisionr-master/ws/examples/target/classes/org/apache/provisionr/examples/templates/cdh4.xml>
to org.apache.provisionr/provisionr-examples/0.5.0-incubating-SNAPSHOT/provisionr-examples-0.5.0-incubating-SNAPSHOT-cdh4.template
[JENKINS] Archiving <https://builds.apache.org/job/provisionr-master/ws/examples/target/classes/org/apache/provisionr/examples/templates/jenkins.xml>
to org.apache.provisionr/provisionr-examples/0.5.0-incubating-SNAPSHOT/provisionr-examples-0.5.0-incubating-SNAPSHOT-jenkins.template
[JENKINS] Archiving <https://builds.apache.org/job/provisionr-master/ws/providers/amazon-tests/pom.xml>
to org.apache.provisionr/provisionr-amazon-tests/0.5.0-incubating-SNAPSHOT/provisionr-amazon-tests-0.5.0-incubating-SNAPSHOT.pom
[JENKINS] Archiving <https://builds.apache.org/job/provisionr-master/ws/karaf/assembly-tests/pom.xml>
to org.apache.provisionr/provisionr-assembly-tests/0.5.0-incubating-SNAPSHOT/provisionr-assembly-tests-0.5.0-incubating-SNAPSHOT.pom
[JENKINS] Archiving <https://builds.apache.org/job/provisionr-master/ws/core/pom.xml>
to org.apache.provisionr/provisionr-core/0.5.0-incubating-SNAPSHOT/provisionr-core-0.5.0-incubating-SNAPSHOT.pom
[JENKINS] Archiving <https://builds.apache.org/job/provisionr-master/ws/core/target/provisionr-core-0.5.0-incubating-SNAPSHOT.jar>
to org.apache.provisionr/provisionr-core/0.5.0-incubating-SNAPSHOT/provisionr-core-0.5.0-incubating-SNAPSHOT.jar
[JENKINS] Archiving <https://builds.apache.org/job/provisionr-master/ws/core/target/provisionr-core-0.5.0-incubating-SNAPSHOT-sources.jar>
to org.apache.provisionr/provisionr-core/0.5.0-incubating-SNAPSHOT/provisionr-core-0.5.0-incubating-SNAPSHOT-sources.jar
[JENKINS] Archiving <https://builds.apache.org/job/provisionr-master/ws/core/target/classes/features.xml>
to org.apache.provisionr/provisionr-core/0.5.0-incubating-SNAPSHOT/provisionr-core-0.5.0-incubating-SNAPSHOT-features.xml
[JENKINS] Archiving <https://builds.apache.org/job/provisionr-master/ws/core/target/classes/org.apache.provisionr.cfg>
to org.apache.provisionr/provisionr-core/0.5.0-incubating-SNAPSHOT/provisionr-core-0.5.0-incubating-SNAPSHOT-defaults.cfg
[JENKINS] Archiving <https://builds.apache.org/job/provisionr-master/ws/core/target/classes/org.apache.felix.fileinstall-templates.cfg>
to org.apache.provisionr/provisionr-core/0.5.0-incubating-SNAPSHOT/provisionr-core-0.5.0-incubating-SNAPSHOT-fileinstall.cfg
[JENKINS] Archiving <https://builds.apache.org/job/provisionr-master/ws/providers/amazon/pom.xml>
to org.apache.provisionr/provisionr-amazon/0.5.0-incubating-SNAPSHOT/provisionr-amazon-0.5.0-incubating-SNAPSHOT.pom
[JENKINS] Archiving <https://builds.apache.org/job/provisionr-master/ws/providers/amazon/target/provisionr-amazon-0.5.0-incubating-SNAPSHOT.jar>
to org.apache.provisionr/provisionr-amazon/0.5.0-incubating-SNAPSHOT/provisionr-amazon-0.5.0-incubating-SNAPSHOT.jar
[JENKINS] Archiving <https://builds.apache.org/job/provisionr-master/ws/providers/amazon/target/provisionr-amazon-0.5.0-incubating-SNAPSHOT-sources.jar>
to org.apache.provisionr/provisionr-amazon/0.5.0-incubating-SNAPSHOT/provisionr-amazon-0.5.0-incubating-SNAPSHOT-sources.jar
[JENKINS] Archiving <https://builds.apache.org/job/provisionr-master/ws/providers/amazon/target/classes/features.xml>
to org.apache.provisionr/provisionr-amazon/0.5.0-incubating-SNAPSHOT/provisionr-amazon-0.5.0-incubating-SNAPSHOT-features.xml
[JENKINS] Archiving <https://builds.apache.org/job/provisionr-master/ws/providers/amazon/target/classes/org.apache.provisionr.amazon.cfg>
to org.apache.provisionr/provisionr-amazon/0.5.0-incubating-SNAPSHOT/provisionr-amazon-0.5.0-incubating-SNAPSHOT-defaults.cfg
[JENKINS] Archiving <https://builds.apache.org/job/provisionr-master/ws/integration/rundeck/pom.xml>
to org.apache.provisionr/provisionr-rundeck/0.5.0-incubating-SNAPSHOT/provisionr-rundeck-0.5.0-incubating-SNAPSHOT.pom
[JENKINS] Archiving <https://builds.apache.org/job/provisionr-master/ws/karaf/assembly/pom.xml>
to org.apache.provisionr/provisionr-assembly/0.5.0-incubating-SNAPSHOT/provisionr-assembly-0.5.0-incubating-SNAPSHOT.pom
[JENKINS] Archiving <https://builds.apache.org/job/provisionr-master/ws/pom.xml> to
org.apache.provisionr/provisionr-aggregator/0.5.0-incubating-SNAPSHOT/provisionr-aggregator-0.5.0-incubating-SNAPSHOT.pom
[JENKINS] Archiving <https://builds.apache.org/job/provisionr-master/ws/parent/pom.xml>
to org.apache.provisionr/provisionr-parent/0.5.0-incubating-SNAPSHOT/provisionr-parent-0.5.0-incubating-SNAPSHOT.pom
[JENKINS] Archiving <https://builds.apache.org/job/provisionr-master/ws/activiti/database/pom.xml>
to org.apache.provisionr/activiti-database/0.5.0-incubating-SNAPSHOT/activiti-database-0.5.0-incubating-SNAPSHOT.pom
[JENKINS] Archiving <https://builds.apache.org/job/provisionr-master/ws/activiti/database/target/activiti-database-0.5.0-incubating-SNAPSHOT.jar>
to org.apache.provisionr/activiti-database/0.5.0-incubating-SNAPSHOT/activiti-database-0.5.0-incubating-SNAPSHOT.jar
[JENKINS] Archiving <https://builds.apache.org/job/provisionr-master/ws/activiti/database/target/activiti-database-0.5.0-incubating-SNAPSHOT-sources.jar>
to org.apache.provisionr/activiti-database/0.5.0-incubating-SNAPSHOT/activiti-database-0.5.0-incubating-SNAPSHOT-sources.jar
[JENKINS] Archiving <https://builds.apache.org/job/provisionr-master/ws/api/pom.xml>
to org.apache.provisionr/provisionr-api/0.5.0-incubating-SNAPSHOT/provisionr-api-0.5.0-incubating-SNAPSHOT.pom
[JENKINS] Archiving <https://builds.apache.org/job/provisionr-master/ws/api/target/provisionr-api-0.5.0-incubating-SNAPSHOT.jar>
to org.apache.provisionr/provisionr-api/0.5.0-incubating-SNAPSHOT/provisionr-api-0.5.0-incubating-SNAPSHOT.jar
[JENKINS] Archiving <https://builds.apache.org/job/provisionr-master/ws/api/target/provisionr-api-0.5.0-incubating-SNAPSHOT-sources.jar>
to org.apache.provisionr/provisionr-api/0.5.0-incubating-SNAPSHOT/provisionr-api-0.5.0-incubating-SNAPSHOT-sources.jar
[JENKINS] Archiving <https://builds.apache.org/job/provisionr-master/ws/activiti/commands/pom.xml>
to org.apache.provisionr/activiti-karaf-commands/0.5.0-incubating-SNAPSHOT/activiti-karaf-commands-0.5.0-incubating-SNAPSHOT.pom
[JENKINS] Archiving <https://builds.apache.org/job/provisionr-master/ws/karaf/commands/pom.xml>
to org.apache.provisionr/provisionr-commands/0.5.0-incubating-SNAPSHOT/provisionr-commands-0.5.0-incubating-SNAPSHOT.pom
channel stopped
Archiving artifacts

Mime
View raw message