provisionr-dev mailing list archives

Site index · List index
Message view « Date » · « Thread »
Top « Date » · « Thread »
From Apache Jenkins Server <jenk...@builds.apache.org>
Subject Build failed in Jenkins: provisionr-master #93
Date Thu, 22 Aug 2013 02:03:12 GMT
See <https://builds.apache.org/job/provisionr-master/93/>

------------------------------------------
[...truncated 4846 lines...]
INFO: ------------------------------------------------------------------------
Aug 22, 2013 1:58:20 AM org.apache.maven.cli.event.ExecutionEventLogger logStats
INFO: Total time: 3:31.988s
Aug 22, 2013 1:58:20 AM org.apache.maven.cli.event.ExecutionEventLogger logStats
INFO: Finished at: Thu Aug 22 01:58:20 UTC 2013
Aug 22, 2013 1:58:20 AM org.apache.maven.cli.event.ExecutionEventLogger logStats
INFO: Final Memory: 55M/297M
[JENKINS] Archiving <https://builds.apache.org/job/provisionr-master/ws/integration/rundeck/pom.xml> to /home/hudson/hudson/jobs/provisionr-master/modules/org.apache.provisionr$provisionr-rundeck/builds/2013-08-22_01-54-44/archive/org.apache.provisionr/provisionr-rundeck/0.5.0-incubating-SNAPSHOT/provisionr-rundeck-0.5.0-incubating-SNAPSHOT.pomAug 22, 2013 1:58:20 AM org.apache.maven.cli.event.ExecutionEventLogger sessionEnded
INFO: ------------------------------------------------------------------------

[JENKINS] Archiving <https://builds.apache.org/job/provisionr-master/ws/integration/rundeck/target/provisionr-rundeck-0.5.0-incubating-SNAPSHOT.jar> to /home/hudson/hudson/jobs/provisionr-master/modules/org.apache.provisionr$provisionr-rundeck/builds/2013-08-22_01-54-44/archive/org.apache.provisionr/provisionr-rundeck/0.5.0-incubating-SNAPSHOT/provisionr-rundeck-0.5.0-incubating-SNAPSHOT.jar
[JENKINS] Archiving <https://builds.apache.org/job/provisionr-master/ws/integration/rundeck/target/provisionr-rundeck-0.5.0-incubating-SNAPSHOT-sources.jar> to /home/hudson/hudson/jobs/provisionr-master/modules/org.apache.provisionr$provisionr-rundeck/builds/2013-08-22_01-54-44/archive/org.apache.provisionr/provisionr-rundeck/0.5.0-incubating-SNAPSHOT/provisionr-rundeck-0.5.0-incubating-SNAPSHOT-sources.jar
[JENKINS] Archiving <https://builds.apache.org/job/provisionr-master/ws/integration/rundeck/target/classes/features.xml> to /home/hudson/hudson/jobs/provisionr-master/modules/org.apache.provisionr$provisionr-rundeck/builds/2013-08-22_01-54-44/archive/org.apache.provisionr/provisionr-rundeck/0.5.0-incubating-SNAPSHOT/provisionr-rundeck-0.5.0-incubating-SNAPSHOT-features.xml
[JENKINS] Archiving <https://builds.apache.org/job/provisionr-master/ws/providers/amazon-tests/pom.xml> to /home/hudson/hudson/jobs/provisionr-master/modules/org.apache.provisionr$provisionr-amazon-tests/builds/2013-08-22_01-54-44/archive/org.apache.provisionr/provisionr-amazon-tests/0.5.0-incubating-SNAPSHOT/provisionr-amazon-tests-0.5.0-incubating-SNAPSHOT.pom
[JENKINS] Archiving <https://builds.apache.org/job/provisionr-master/ws/providers/amazon-tests/target/provisionr-amazon-tests-0.5.0-incubating-SNAPSHOT.jar> to /home/hudson/hudson/jobs/provisionr-master/modules/org.apache.provisionr$provisionr-amazon-tests/builds/2013-08-22_01-54-44/archive/org.apache.provisionr/provisionr-amazon-tests/0.5.0-incubating-SNAPSHOT/provisionr-amazon-tests-0.5.0-incubating-SNAPSHOT.jar
[JENKINS] Archiving <https://builds.apache.org/job/provisionr-master/ws/providers/amazon-tests/target/provisionr-amazon-tests-0.5.0-incubating-SNAPSHOT-sources.jar> to /home/hudson/hudson/jobs/provisionr-master/modules/org.apache.provisionr$provisionr-amazon-tests/builds/2013-08-22_01-54-44/archive/org.apache.provisionr/provisionr-amazon-tests/0.5.0-incubating-SNAPSHOT/provisionr-amazon-tests-0.5.0-incubating-SNAPSHOT-sources.jar
[JENKINS] Archiving <https://builds.apache.org/job/provisionr-master/ws/console/pom.xml> to /home/hudson/hudson/jobs/provisionr-master/modules/org.apache.provisionr$provisionr-console/builds/2013-08-22_01-54-44/archive/org.apache.provisionr/provisionr-console/0.5.0-incubating-SNAPSHOT/provisionr-console-0.5.0-incubating-SNAPSHOT.pom
[JENKINS] Archiving <https://builds.apache.org/job/provisionr-master/ws/console/target/provisionr-console-0.5.0-incubating-SNAPSHOT.jar> to /home/hudson/hudson/jobs/provisionr-master/modules/org.apache.provisionr$provisionr-console/builds/2013-08-22_01-54-44/archive/org.apache.provisionr/provisionr-console/0.5.0-incubating-SNAPSHOT/provisionr-console-0.5.0-incubating-SNAPSHOT.jar
[JENKINS] Archiving <https://builds.apache.org/job/provisionr-master/ws/console/target/provisionr-console-0.5.0-incubating-SNAPSHOT-sources.jar> to /home/hudson/hudson/jobs/provisionr-master/modules/org.apache.provisionr$provisionr-console/builds/2013-08-22_01-54-44/archive/org.apache.provisionr/provisionr-console/0.5.0-incubating-SNAPSHOT/provisionr-console-0.5.0-incubating-SNAPSHOT-sources.jar
[JENKINS] Archiving <https://builds.apache.org/job/provisionr-master/ws/console/target/classes/features.xml> to /home/hudson/hudson/jobs/provisionr-master/modules/org.apache.provisionr$provisionr-console/builds/2013-08-22_01-54-44/archive/org.apache.provisionr/provisionr-console/0.5.0-incubating-SNAPSHOT/provisionr-console-0.5.0-incubating-SNAPSHOT-features.xml
[JENKINS] Archiving <https://builds.apache.org/job/provisionr-master/ws/console/target/classes/org.apache.provisionr.console.cfg> to /home/hudson/hudson/jobs/provisionr-master/modules/org.apache.provisionr$provisionr-console/builds/2013-08-22_01-54-44/archive/org.apache.provisionr/provisionr-console/0.5.0-incubating-SNAPSHOT/provisionr-console-0.5.0-incubating-SNAPSHOT-defaults.cfg
[JENKINS] Archiving <https://builds.apache.org/job/provisionr-master/ws/providers/cloudstack-tests/pom.xml> to /home/hudson/hudson/jobs/provisionr-master/modules/org.apache.provisionr$provisionr-cloudstack-tests/builds/2013-08-22_01-54-44/archive/org.apache.provisionr/provisionr-cloudstack-tests/0.5.0-incubating-SNAPSHOT/provisionr-cloudstack-tests-0.5.0-incubating-SNAPSHOT.pom
[JENKINS] Archiving <https://builds.apache.org/job/provisionr-master/ws/providers/cloudstack-tests/target/provisionr-cloudstack-tests-0.5.0-incubating-SNAPSHOT.jar> to /home/hudson/hudson/jobs/provisionr-master/modules/org.apache.provisionr$provisionr-cloudstack-tests/builds/2013-08-22_01-54-44/archive/org.apache.provisionr/provisionr-cloudstack-tests/0.5.0-incubating-SNAPSHOT/provisionr-cloudstack-tests-0.5.0-incubating-SNAPSHOT.jar
[JENKINS] Archiving <https://builds.apache.org/job/provisionr-master/ws/providers/cloudstack-tests/target/provisionr-cloudstack-tests-0.5.0-incubating-SNAPSHOT-sources.jar> to /home/hudson/hudson/jobs/provisionr-master/modules/org.apache.provisionr$provisionr-cloudstack-tests/builds/2013-08-22_01-54-44/archive/org.apache.provisionr/provisionr-cloudstack-tests/0.5.0-incubating-SNAPSHOT/provisionr-cloudstack-tests-0.5.0-incubating-SNAPSHOT-sources.jar
[JENKINS] Archiving <https://builds.apache.org/job/provisionr-master/ws/karaf/assembly-tests/pom.xml> to /home/hudson/hudson/jobs/provisionr-master/modules/org.apache.provisionr$provisionr-assembly-tests/builds/2013-08-22_01-54-44/archive/org.apache.provisionr/provisionr-assembly-tests/0.5.0-incubating-SNAPSHOT/provisionr-assembly-tests-0.5.0-incubating-SNAPSHOT.pom
[JENKINS] Archiving <https://builds.apache.org/job/provisionr-master/ws/karaf/assembly-tests/target/provisionr-assembly-tests-0.5.0-incubating-SNAPSHOT.jar> to /home/hudson/hudson/jobs/provisionr-master/modules/org.apache.provisionr$provisionr-assembly-tests/builds/2013-08-22_01-54-44/archive/org.apache.provisionr/provisionr-assembly-tests/0.5.0-incubating-SNAPSHOT/provisionr-assembly-tests-0.5.0-incubating-SNAPSHOT.jar
[JENKINS] Archiving <https://builds.apache.org/job/provisionr-master/ws/karaf/assembly-tests/target/provisionr-assembly-tests-0.5.0-incubating-SNAPSHOT-sources.jar> to /home/hudson/hudson/jobs/provisionr-master/modules/org.apache.provisionr$provisionr-assembly-tests/builds/2013-08-22_01-54-44/archive/org.apache.provisionr/provisionr-assembly-tests/0.5.0-incubating-SNAPSHOT/provisionr-assembly-tests-0.5.0-incubating-SNAPSHOT-sources.jar
[JENKINS] Archiving <https://builds.apache.org/job/provisionr-master/ws/karaf/branding/pom.xml> to /home/hudson/hudson/jobs/provisionr-master/modules/org.apache.provisionr$provisionr-branding/builds/2013-08-22_01-54-44/archive/org.apache.provisionr/provisionr-branding/0.5.0-incubating-SNAPSHOT/provisionr-branding-0.5.0-incubating-SNAPSHOT.pom
[JENKINS] Archiving <https://builds.apache.org/job/provisionr-master/ws/karaf/branding/target/provisionr-branding-0.5.0-incubating-SNAPSHOT.jar> to /home/hudson/hudson/jobs/provisionr-master/modules/org.apache.provisionr$provisionr-branding/builds/2013-08-22_01-54-44/archive/org.apache.provisionr/provisionr-branding/0.5.0-incubating-SNAPSHOT/provisionr-branding-0.5.0-incubating-SNAPSHOT.jar
[JENKINS] Archiving <https://builds.apache.org/job/provisionr-master/ws/karaf/branding/target/provisionr-branding-0.5.0-incubating-SNAPSHOT-sources.jar> to /home/hudson/hudson/jobs/provisionr-master/modules/org.apache.provisionr$provisionr-branding/builds/2013-08-22_01-54-44/archive/org.apache.provisionr/provisionr-branding/0.5.0-incubating-SNAPSHOT/provisionr-branding-0.5.0-incubating-SNAPSHOT-sources.jar
[JENKINS] Archiving <https://builds.apache.org/job/provisionr-master/ws/core/pom.xml> to /home/hudson/hudson/jobs/provisionr-master/modules/org.apache.provisionr$provisionr-core/builds/2013-08-22_01-54-44/archive/org.apache.provisionr/provisionr-core/0.5.0-incubating-SNAPSHOT/provisionr-core-0.5.0-incubating-SNAPSHOT.pom
[JENKINS] Archiving <https://builds.apache.org/job/provisionr-master/ws/core/target/provisionr-core-0.5.0-incubating-SNAPSHOT.jar> to /home/hudson/hudson/jobs/provisionr-master/modules/org.apache.provisionr$provisionr-core/builds/2013-08-22_01-54-44/archive/org.apache.provisionr/provisionr-core/0.5.0-incubating-SNAPSHOT/provisionr-core-0.5.0-incubating-SNAPSHOT.jar
[JENKINS] Archiving <https://builds.apache.org/job/provisionr-master/ws/core/target/provisionr-core-0.5.0-incubating-SNAPSHOT-sources.jar> to /home/hudson/hudson/jobs/provisionr-master/modules/org.apache.provisionr$provisionr-core/builds/2013-08-22_01-54-44/archive/org.apache.provisionr/provisionr-core/0.5.0-incubating-SNAPSHOT/provisionr-core-0.5.0-incubating-SNAPSHOT-sources.jar
[JENKINS] Archiving <https://builds.apache.org/job/provisionr-master/ws/core/target/classes/features.xml> to /home/hudson/hudson/jobs/provisionr-master/modules/org.apache.provisionr$provisionr-core/builds/2013-08-22_01-54-44/archive/org.apache.provisionr/provisionr-core/0.5.0-incubating-SNAPSHOT/provisionr-core-0.5.0-incubating-SNAPSHOT-features.xml
[JENKINS] Archiving <https://builds.apache.org/job/provisionr-master/ws/core/target/classes/org.apache.provisionr.cfg> to /home/hudson/hudson/jobs/provisionr-master/modules/org.apache.provisionr$provisionr-core/builds/2013-08-22_01-54-44/archive/org.apache.provisionr/provisionr-core/0.5.0-incubating-SNAPSHOT/provisionr-core-0.5.0-incubating-SNAPSHOT-defaults.cfg
[JENKINS] Archiving <https://builds.apache.org/job/provisionr-master/ws/core/target/classes/org.apache.felix.fileinstall-templates.cfg> to /home/hudson/hudson/jobs/provisionr-master/modules/org.apache.provisionr$provisionr-core/builds/2013-08-22_01-54-44/archive/org.apache.provisionr/provisionr-core/0.5.0-incubating-SNAPSHOT/provisionr-core-0.5.0-incubating-SNAPSHOT-fileinstall.cfg
[JENKINS] Archiving <https://builds.apache.org/job/provisionr-master/ws/karaf/commands/pom.xml> to /home/hudson/hudson/jobs/provisionr-master/modules/org.apache.provisionr$provisionr-commands/builds/2013-08-22_01-54-44/archive/org.apache.provisionr/provisionr-commands/0.5.0-incubating-SNAPSHOT/provisionr-commands-0.5.0-incubating-SNAPSHOT.pom
[JENKINS] Archiving <https://builds.apache.org/job/provisionr-master/ws/karaf/commands/target/provisionr-commands-0.5.0-incubating-SNAPSHOT.jar> to /home/hudson/hudson/jobs/provisionr-master/modules/org.apache.provisionr$provisionr-commands/builds/2013-08-22_01-54-44/archive/org.apache.provisionr/provisionr-commands/0.5.0-incubating-SNAPSHOT/provisionr-commands-0.5.0-incubating-SNAPSHOT.jar
[JENKINS] Archiving <https://builds.apache.org/job/provisionr-master/ws/karaf/commands/target/provisionr-commands-0.5.0-incubating-SNAPSHOT-sources.jar> to /home/hudson/hudson/jobs/provisionr-master/modules/org.apache.provisionr$provisionr-commands/builds/2013-08-22_01-54-44/archive/org.apache.provisionr/provisionr-commands/0.5.0-incubating-SNAPSHOT/provisionr-commands-0.5.0-incubating-SNAPSHOT-sources.jar
[JENKINS] Archiving <https://builds.apache.org/job/provisionr-master/ws/karaf/assembly/pom.xml> to /home/hudson/hudson/jobs/provisionr-master/modules/org.apache.provisionr$provisionr-assembly/builds/2013-08-22_01-54-44/archive/org.apache.provisionr/provisionr-assembly/0.5.0-incubating-SNAPSHOT/provisionr-assembly-0.5.0-incubating-SNAPSHOT.pom
[JENKINS] Archiving <https://builds.apache.org/job/provisionr-master/ws/karaf/assembly/target/provisionr-assembly-0.5.0-incubating-SNAPSHOT.jar> to /home/hudson/hudson/jobs/provisionr-master/modules/org.apache.provisionr$provisionr-assembly/builds/2013-08-22_01-54-44/archive/org.apache.provisionr/provisionr-assembly/0.5.0-incubating-SNAPSHOT/provisionr-assembly-0.5.0-incubating-SNAPSHOT.jar
[JENKINS] Archiving <https://builds.apache.org/job/provisionr-master/ws/karaf/assembly/target/provisionr-assembly-0.5.0-incubating-SNAPSHOT-sources.jar> to /home/hudson/hudson/jobs/provisionr-master/modules/org.apache.provisionr$provisionr-assembly/builds/2013-08-22_01-54-44/archive/org.apache.provisionr/provisionr-assembly/0.5.0-incubating-SNAPSHOT/provisionr-assembly-0.5.0-incubating-SNAPSHOT-sources.jar
[JENKINS] Archiving <https://builds.apache.org/job/provisionr-master/ws/karaf/assembly/target/provisionr-0.5.0-incubating-SNAPSHOT.tar.gz> to /home/hudson/hudson/jobs/provisionr-master/modules/org.apache.provisionr$provisionr-assembly/builds/2013-08-22_01-54-44/archive/org.apache.provisionr/provisionr-assembly/0.5.0-incubating-SNAPSHOT/provisionr-assembly-0.5.0-incubating-SNAPSHOT.tar.gz
[JENKINS] Archiving <https://builds.apache.org/job/provisionr-master/ws/activiti/commands/pom.xml> to /home/hudson/hudson/jobs/provisionr-master/modules/org.apache.provisionr$activiti-karaf-commands/builds/2013-08-22_01-54-44/archive/org.apache.provisionr/activiti-karaf-commands/0.5.0-incubating-SNAPSHOT/activiti-karaf-commands-0.5.0-incubating-SNAPSHOT.pom
[JENKINS] Archiving <https://builds.apache.org/job/provisionr-master/ws/activiti/commands/target/activiti-karaf-commands-0.5.0-incubating-SNAPSHOT.jar> to /home/hudson/hudson/jobs/provisionr-master/modules/org.apache.provisionr$activiti-karaf-commands/builds/2013-08-22_01-54-44/archive/org.apache.provisionr/activiti-karaf-commands/0.5.0-incubating-SNAPSHOT/activiti-karaf-commands-0.5.0-incubating-SNAPSHOT.jar
[JENKINS] Archiving <https://builds.apache.org/job/provisionr-master/ws/activiti/commands/target/activiti-karaf-commands-0.5.0-incubating-SNAPSHOT-sources.jar> to /home/hudson/hudson/jobs/provisionr-master/modules/org.apache.provisionr$activiti-karaf-commands/builds/2013-08-22_01-54-44/archive/org.apache.provisionr/activiti-karaf-commands/0.5.0-incubating-SNAPSHOT/activiti-karaf-commands-0.5.0-incubating-SNAPSHOT-sources.jar
[JENKINS] Archiving <https://builds.apache.org/job/provisionr-master/ws/examples/pom.xml> to /home/hudson/hudson/jobs/provisionr-master/modules/org.apache.provisionr$provisionr-examples/builds/2013-08-22_01-54-44/archive/org.apache.provisionr/provisionr-examples/0.5.0-incubating-SNAPSHOT/provisionr-examples-0.5.0-incubating-SNAPSHOT.pom
[JENKINS] Archiving <https://builds.apache.org/job/provisionr-master/ws/examples/target/provisionr-examples-0.5.0-incubating-SNAPSHOT.jar> to /home/hudson/hudson/jobs/provisionr-master/modules/org.apache.provisionr$provisionr-examples/builds/2013-08-22_01-54-44/archive/org.apache.provisionr/provisionr-examples/0.5.0-incubating-SNAPSHOT/provisionr-examples-0.5.0-incubating-SNAPSHOT.jar
[JENKINS] Archiving <https://builds.apache.org/job/provisionr-master/ws/examples/target/provisionr-examples-0.5.0-incubating-SNAPSHOT-sources.jar> to /home/hudson/hudson/jobs/provisionr-master/modules/org.apache.provisionr$provisionr-examples/builds/2013-08-22_01-54-44/archive/org.apache.provisionr/provisionr-examples/0.5.0-incubating-SNAPSHOT/provisionr-examples-0.5.0-incubating-SNAPSHOT-sources.jar
[JENKINS] Archiving <https://builds.apache.org/job/provisionr-master/ws/examples/target/classes/features.xml> to /home/hudson/hudson/jobs/provisionr-master/modules/org.apache.provisionr$provisionr-examples/builds/2013-08-22_01-54-44/archive/org.apache.provisionr/provisionr-examples/0.5.0-incubating-SNAPSHOT/provisionr-examples-0.5.0-incubating-SNAPSHOT-features.xml
[JENKINS] Archiving <https://builds.apache.org/job/provisionr-master/ws/examples/target/classes/org/apache/provisionr/examples/templates/cdh3.xml> to /home/hudson/hudson/jobs/provisionr-master/modules/org.apache.provisionr$provisionr-examples/builds/2013-08-22_01-54-44/archive/org.apache.provisionr/provisionr-examples/0.5.0-incubating-SNAPSHOT/provisionr-examples-0.5.0-incubating-SNAPSHOT-cdh3.template
[JENKINS] Archiving <https://builds.apache.org/job/provisionr-master/ws/examples/target/classes/org/apache/provisionr/examples/templates/cdh4.xml> to /home/hudson/hudson/jobs/provisionr-master/modules/org.apache.provisionr$provisionr-examples/builds/2013-08-22_01-54-44/archive/org.apache.provisionr/provisionr-examples/0.5.0-incubating-SNAPSHOT/provisionr-examples-0.5.0-incubating-SNAPSHOT-cdh4.template
[JENKINS] Archiving <https://builds.apache.org/job/provisionr-master/ws/examples/target/classes/org/apache/provisionr/examples/templates/jenkins.xml> to /home/hudson/hudson/jobs/provisionr-master/modules/org.apache.provisionr$provisionr-examples/builds/2013-08-22_01-54-44/archive/org.apache.provisionr/provisionr-examples/0.5.0-incubating-SNAPSHOT/provisionr-examples-0.5.0-incubating-SNAPSHOT-jenkins.template
[JENKINS] Archiving <https://builds.apache.org/job/provisionr-master/ws/activiti/explorer/pom.xml> to /home/hudson/hudson/jobs/provisionr-master/modules/org.apache.provisionr$activiti-karaf-web-explorer/builds/2013-08-22_01-54-44/archive/org.apache.provisionr/activiti-karaf-web-explorer/0.5.0-incubating-SNAPSHOT/activiti-karaf-web-explorer-0.5.0-incubating-SNAPSHOT.pom
[JENKINS] Archiving <https://builds.apache.org/job/provisionr-master/ws/activiti/explorer/target/activiti-karaf-web-explorer-0.5.0-incubating-SNAPSHOT.war> to /home/hudson/hudson/jobs/provisionr-master/modules/org.apache.provisionr$activiti-karaf-web-explorer/builds/2013-08-22_01-54-44/archive/org.apache.provisionr/activiti-karaf-web-explorer/0.5.0-incubating-SNAPSHOT/activiti-karaf-web-explorer-0.5.0-incubating-SNAPSHOT.war
[JENKINS] Archiving <https://builds.apache.org/job/provisionr-master/ws/activiti/explorer/target/activiti-karaf-web-explorer-0.5.0-incubating-SNAPSHOT-sources.jar> to /home/hudson/hudson/jobs/provisionr-master/modules/org.apache.provisionr$activiti-karaf-web-explorer/builds/2013-08-22_01-54-44/archive/org.apache.provisionr/activiti-karaf-web-explorer/0.5.0-incubating-SNAPSHOT/activiti-karaf-web-explorer-0.5.0-incubating-SNAPSHOT-sources.jar
[JENKINS] Archiving <https://builds.apache.org/job/provisionr-master/ws/providers/cloudstack/pom.xml> to /home/hudson/hudson/jobs/provisionr-master/modules/org.apache.provisionr$provisionr-cloudstack/builds/2013-08-22_01-54-44/archive/org.apache.provisionr/provisionr-cloudstack/0.5.0-incubating-SNAPSHOT/provisionr-cloudstack-0.5.0-incubating-SNAPSHOT.pom
[JENKINS] Archiving <https://builds.apache.org/job/provisionr-master/ws/providers/cloudstack/target/provisionr-cloudstack-0.5.0-incubating-SNAPSHOT.jar> to /home/hudson/hudson/jobs/provisionr-master/modules/org.apache.provisionr$provisionr-cloudstack/builds/2013-08-22_01-54-44/archive/org.apache.provisionr/provisionr-cloudstack/0.5.0-incubating-SNAPSHOT/provisionr-cloudstack-0.5.0-incubating-SNAPSHOT.jar
[JENKINS] Archiving <https://builds.apache.org/job/provisionr-master/ws/providers/cloudstack/target/provisionr-cloudstack-0.5.0-incubating-SNAPSHOT-sources.jar> to /home/hudson/hudson/jobs/provisionr-master/modules/org.apache.provisionr$provisionr-cloudstack/builds/2013-08-22_01-54-44/archive/org.apache.provisionr/provisionr-cloudstack/0.5.0-incubating-SNAPSHOT/provisionr-cloudstack-0.5.0-incubating-SNAPSHOT-sources.jar
[JENKINS] Archiving <https://builds.apache.org/job/provisionr-master/ws/providers/cloudstack/target/classes/features.xml> to /home/hudson/hudson/jobs/provisionr-master/modules/org.apache.provisionr$provisionr-cloudstack/builds/2013-08-22_01-54-44/archive/org.apache.provisionr/provisionr-cloudstack/0.5.0-incubating-SNAPSHOT/provisionr-cloudstack-0.5.0-incubating-SNAPSHOT-features.xml
[JENKINS] Archiving <https://builds.apache.org/job/provisionr-master/ws/providers/cloudstack/target/classes/org.apache.provisionr.cloudstack.cfg> to /home/hudson/hudson/jobs/provisionr-master/modules/org.apache.provisionr$provisionr-cloudstack/builds/2013-08-22_01-54-44/archive/org.apache.provisionr/provisionr-cloudstack/0.5.0-incubating-SNAPSHOT/provisionr-cloudstack-0.5.0-incubating-SNAPSHOT-defaults.cfg
[JENKINS] Archiving <https://builds.apache.org/job/provisionr-master/ws/api/pom.xml> to /home/hudson/hudson/jobs/provisionr-master/modules/org.apache.provisionr$provisionr-api/builds/2013-08-22_01-54-44/archive/org.apache.provisionr/provisionr-api/0.5.0-incubating-SNAPSHOT/provisionr-api-0.5.0-incubating-SNAPSHOT.pom
[JENKINS] Archiving <https://builds.apache.org/job/provisionr-master/ws/api/target/provisionr-api-0.5.0-incubating-SNAPSHOT.jar> to /home/hudson/hudson/jobs/provisionr-master/modules/org.apache.provisionr$provisionr-api/builds/2013-08-22_01-54-44/archive/org.apache.provisionr/provisionr-api/0.5.0-incubating-SNAPSHOT/provisionr-api-0.5.0-incubating-SNAPSHOT.jar
[JENKINS] Archiving <https://builds.apache.org/job/provisionr-master/ws/api/target/provisionr-api-0.5.0-incubating-SNAPSHOT-sources.jar> to /home/hudson/hudson/jobs/provisionr-master/modules/org.apache.provisionr$provisionr-api/builds/2013-08-22_01-54-44/archive/org.apache.provisionr/provisionr-api/0.5.0-incubating-SNAPSHOT/provisionr-api-0.5.0-incubating-SNAPSHOT-sources.jar
[JENKINS] Archiving <https://builds.apache.org/job/provisionr-master/ws/activiti/database/pom.xml> to /home/hudson/hudson/jobs/provisionr-master/modules/org.apache.provisionr$activiti-database/builds/2013-08-22_01-54-44/archive/org.apache.provisionr/activiti-database/0.5.0-incubating-SNAPSHOT/activiti-database-0.5.0-incubating-SNAPSHOT.pom
[JENKINS] Archiving <https://builds.apache.org/job/provisionr-master/ws/activiti/database/target/activiti-database-0.5.0-incubating-SNAPSHOT.jar> to /home/hudson/hudson/jobs/provisionr-master/modules/org.apache.provisionr$activiti-database/builds/2013-08-22_01-54-44/archive/org.apache.provisionr/activiti-database/0.5.0-incubating-SNAPSHOT/activiti-database-0.5.0-incubating-SNAPSHOT.jar
[JENKINS] Archiving <https://builds.apache.org/job/provisionr-master/ws/activiti/database/target/activiti-database-0.5.0-incubating-SNAPSHOT-sources.jar> to /home/hudson/hudson/jobs/provisionr-master/modules/org.apache.provisionr$activiti-database/builds/2013-08-22_01-54-44/archive/org.apache.provisionr/activiti-database/0.5.0-incubating-SNAPSHOT/activiti-database-0.5.0-incubating-SNAPSHOT-sources.jar
[JENKINS] Archiving <https://builds.apache.org/job/provisionr-master/ws/pom.xml> to /home/hudson/hudson/jobs/provisionr-master/modules/org.apache.provisionr$provisionr-aggregator/builds/2013-08-22_01-54-44/archive/org.apache.provisionr/provisionr-aggregator/0.5.0-incubating-SNAPSHOT/provisionr-aggregator-0.5.0-incubating-SNAPSHOT.pom
[JENKINS] Archiving <https://builds.apache.org/job/provisionr-master/ws/providers/amazon/pom.xml> to /home/hudson/hudson/jobs/provisionr-master/modules/org.apache.provisionr$provisionr-amazon/builds/2013-08-22_01-54-44/archive/org.apache.provisionr/provisionr-amazon/0.5.0-incubating-SNAPSHOT/provisionr-amazon-0.5.0-incubating-SNAPSHOT.pom
[JENKINS] Archiving <https://builds.apache.org/job/provisionr-master/ws/providers/amazon/target/provisionr-amazon-0.5.0-incubating-SNAPSHOT.jar> to /home/hudson/hudson/jobs/provisionr-master/modules/org.apache.provisionr$provisionr-amazon/builds/2013-08-22_01-54-44/archive/org.apache.provisionr/provisionr-amazon/0.5.0-incubating-SNAPSHOT/provisionr-amazon-0.5.0-incubating-SNAPSHOT.jar
[JENKINS] Archiving <https://builds.apache.org/job/provisionr-master/ws/providers/amazon/target/provisionr-amazon-0.5.0-incubating-SNAPSHOT-sources.jar> to /home/hudson/hudson/jobs/provisionr-master/modules/org.apache.provisionr$provisionr-amazon/builds/2013-08-22_01-54-44/archive/org.apache.provisionr/provisionr-amazon/0.5.0-incubating-SNAPSHOT/provisionr-amazon-0.5.0-incubating-SNAPSHOT-sources.jar
[JENKINS] Archiving <https://builds.apache.org/job/provisionr-master/ws/providers/amazon/target/classes/features.xml> to /home/hudson/hudson/jobs/provisionr-master/modules/org.apache.provisionr$provisionr-amazon/builds/2013-08-22_01-54-44/archive/org.apache.provisionr/provisionr-amazon/0.5.0-incubating-SNAPSHOT/provisionr-amazon-0.5.0-incubating-SNAPSHOT-features.xml
[JENKINS] Archiving <https://builds.apache.org/job/provisionr-master/ws/providers/amazon/target/classes/org.apache.provisionr.amazon.cfg> to /home/hudson/hudson/jobs/provisionr-master/modules/org.apache.provisionr$provisionr-amazon/builds/2013-08-22_01-54-44/archive/org.apache.provisionr/provisionr-amazon/0.5.0-incubating-SNAPSHOT/provisionr-amazon-0.5.0-incubating-SNAPSHOT-defaults.cfg
[JENKINS] Archiving <https://builds.apache.org/job/provisionr-master/ws/test-support/pom.xml> to /home/hudson/hudson/jobs/provisionr-master/modules/org.apache.provisionr$provisionr-test-support/builds/2013-08-22_01-54-44/archive/org.apache.provisionr/provisionr-test-support/0.5.0-incubating-SNAPSHOT/provisionr-test-support-0.5.0-incubating-SNAPSHOT.pom
[JENKINS] Archiving <https://builds.apache.org/job/provisionr-master/ws/test-support/target/provisionr-test-support-0.5.0-incubating-SNAPSHOT.jar> to /home/hudson/hudson/jobs/provisionr-master/modules/org.apache.provisionr$provisionr-test-support/builds/2013-08-22_01-54-44/archive/org.apache.provisionr/provisionr-test-support/0.5.0-incubating-SNAPSHOT/provisionr-test-support-0.5.0-incubating-SNAPSHOT.jar
[JENKINS] Archiving <https://builds.apache.org/job/provisionr-master/ws/test-support/target/provisionr-test-support-0.5.0-incubating-SNAPSHOT-sources.jar> to /home/hudson/hudson/jobs/provisionr-master/modules/org.apache.provisionr$provisionr-test-support/builds/2013-08-22_01-54-44/archive/org.apache.provisionr/provisionr-test-support/0.5.0-incubating-SNAPSHOT/provisionr-test-support-0.5.0-incubating-SNAPSHOT-sources.jar
[JENKINS] Archiving <https://builds.apache.org/job/provisionr-master/ws/test-support/target/features.xml> to /home/hudson/hudson/jobs/provisionr-master/modules/org.apache.provisionr$provisionr-test-support/builds/2013-08-22_01-54-44/archive/org.apache.provisionr/provisionr-test-support/0.5.0-incubating-SNAPSHOT/provisionr-test-support-0.5.0-incubating-SNAPSHOT-features.xml
[JENKINS] Archiving <https://builds.apache.org/job/provisionr-master/ws/karaf/features/pom.xml> to /home/hudson/hudson/jobs/provisionr-master/modules/org.apache.provisionr$provisionr-features/builds/2013-08-22_01-54-44/archive/org.apache.provisionr/provisionr-features/0.5.0-incubating-SNAPSHOT/provisionr-features-0.5.0-incubating-SNAPSHOT.pom
[JENKINS] Archiving <https://builds.apache.org/job/provisionr-master/ws/karaf/features/target/provisionr-features-0.5.0-incubating-SNAPSHOT.jar> to /home/hudson/hudson/jobs/provisionr-master/modules/org.apache.provisionr$provisionr-features/builds/2013-08-22_01-54-44/archive/org.apache.provisionr/provisionr-features/0.5.0-incubating-SNAPSHOT/provisionr-features-0.5.0-incubating-SNAPSHOT.jar
[JENKINS] Archiving <https://builds.apache.org/job/provisionr-master/ws/karaf/features/target/provisionr-features-0.5.0-incubating-SNAPSHOT-sources.jar> to /home/hudson/hudson/jobs/provisionr-master/modules/org.apache.provisionr$provisionr-features/builds/2013-08-22_01-54-44/archive/org.apache.provisionr/provisionr-features/0.5.0-incubating-SNAPSHOT/provisionr-features-0.5.0-incubating-SNAPSHOT-sources.jar
[JENKINS] Archiving <https://builds.apache.org/job/provisionr-master/ws/karaf/features/target/features.xml> to /home/hudson/hudson/jobs/provisionr-master/modules/org.apache.provisionr$provisionr-features/builds/2013-08-22_01-54-44/archive/org.apache.provisionr/provisionr-features/0.5.0-incubating-SNAPSHOT/provisionr-features-0.5.0-incubating-SNAPSHOT-features.xml
[JENKINS] Archiving <https://builds.apache.org/job/provisionr-master/ws/parent/pom.xml> to /home/hudson/hudson/jobs/provisionr-master/modules/org.apache.provisionr$provisionr-parent/builds/2013-08-22_01-54-44/archive/org.apache.provisionr/provisionr-parent/0.5.0-incubating-SNAPSHOT/provisionr-parent-0.5.0-incubating-SNAPSHOT.pom
Waiting for Jenkins to finish collecting data
channel stopped
Archiving artifacts
Maven RedeployPublisher use remote ubuntu3 maven settings from : /home/jenkins/.m2/settings.xml
[INFO] Deployment in https://repository.apache.org/content/repositories/snapshots (id=apache.snapshots.https,uniqueVersion=true)
Deploying the main artifact activiti-database-0.5.0-incubating-SNAPSHOT.jar
Downloading: https://repository.apache.org/content/repositories/snapshots/org/apache/provisionr/activiti-database/0.5.0-incubating-SNAPSHOT/maven-metadata.xml
Downloaded: https://repository.apache.org/content/repositories/snapshots/org/apache/provisionr/activiti-database/0.5.0-incubating-SNAPSHOT/maven-metadata.xml (2 KB at 0.3 KB/sec)
Uploading: https://repository.apache.org/content/repositories/snapshots/org/apache/provisionr/activiti-database/0.5.0-incubating-SNAPSHOT/activiti-database-0.5.0-incubating-20130822.020138-43.jar
Uploaded: https://repository.apache.org/content/repositories/snapshots/org/apache/provisionr/activiti-database/0.5.0-incubating-SNAPSHOT/activiti-database-0.5.0-incubating-20130822.020138-43.jar (539 KB at 2603.1 KB/sec)
Uploading: https://repository.apache.org/content/repositories/snapshots/org/apache/provisionr/activiti-database/0.5.0-incubating-SNAPSHOT/activiti-database-0.5.0-incubating-20130822.020138-43.pom
Uploaded: https://repository.apache.org/content/repositories/snapshots/org/apache/provisionr/activiti-database/0.5.0-incubating-SNAPSHOT/activiti-database-0.5.0-incubating-20130822.020138-43.pom (3 KB at 26.2 KB/sec)
Downloading: https://repository.apache.org/content/repositories/snapshots/org/apache/provisionr/activiti-database/maven-metadata.xml
Downloaded: https://repository.apache.org/content/repositories/snapshots/org/apache/provisionr/activiti-database/maven-metadata.xml (309 B at 1.6 KB/sec)
Uploading: https://repository.apache.org/content/repositories/snapshots/org/apache/provisionr/activiti-database/0.5.0-incubating-SNAPSHOT/maven-metadata.xml
Uploaded: https://repository.apache.org/content/repositories/snapshots/org/apache/provisionr/activiti-database/0.5.0-incubating-SNAPSHOT/maven-metadata.xml (2 KB at 10.1 KB/sec)
Uploading: https://repository.apache.org/content/repositories/snapshots/org/apache/provisionr/activiti-database/maven-metadata.xml
Uploaded: https://repository.apache.org/content/repositories/snapshots/org/apache/provisionr/activiti-database/maven-metadata.xml (309 B at 2.1 KB/sec)
Deploying the main artifact activiti-database-0.5.0-incubating-SNAPSHOT-sources.jar
Uploading: https://repository.apache.org/content/repositories/snapshots/org/apache/provisionr/activiti-database/0.5.0-incubating-SNAPSHOT/activiti-database-0.5.0-incubating-20130822.020138-43-sources.jar
Uploaded: https://repository.apache.org/content/repositories/snapshots/org/apache/provisionr/activiti-database/0.5.0-incubating-SNAPSHOT/activiti-database-0.5.0-incubating-20130822.020138-43-sources.jar (6 KB at 82.6 KB/sec)
Uploading: https://repository.apache.org/content/repositories/snapshots/org/apache/provisionr/activiti-database/0.5.0-incubating-SNAPSHOT/maven-metadata.xml
Uploaded: https://repository.apache.org/content/repositories/snapshots/org/apache/provisionr/activiti-database/0.5.0-incubating-SNAPSHOT/maven-metadata.xml (2 KB at 9.4 KB/sec)
[INFO] Deployment in https://repository.apache.org/content/repositories/snapshots (id=apache.snapshots.https,uniqueVersion=true)
Deploying the main artifact activiti-karaf-commands-0.5.0-incubating-SNAPSHOT.jar
Downloading: https://repository.apache.org/content/repositories/snapshots/org/apache/provisionr/activiti-karaf-commands/0.5.0-incubating-SNAPSHOT/maven-metadata.xml
Downloaded: https://repository.apache.org/content/repositories/snapshots/org/apache/provisionr/activiti-karaf-commands/0.5.0-incubating-SNAPSHOT/maven-metadata.xml (2 KB at 1.6 KB/sec)
Uploading: https://repository.apache.org/content/repositories/snapshots/org/apache/provisionr/activiti-karaf-commands/0.5.0-incubating-SNAPSHOT/activiti-karaf-commands-0.5.0-incubating-20130822.020145-43.jar
Uploaded: https://repository.apache.org/content/repositories/snapshots/org/apache/provisionr/activiti-karaf-commands/0.5.0-incubating-SNAPSHOT/activiti-karaf-commands-0.5.0-incubating-20130822.020145-43.jar (48 KB at 394.2 KB/sec)
Uploading: https://repository.apache.org/content/repositories/snapshots/org/apache/provisionr/activiti-karaf-commands/0.5.0-incubating-SNAPSHOT/activiti-karaf-commands-0.5.0-incubating-20130822.020145-43.pom
Uploaded: https://repository.apache.org/content/repositories/snapshots/org/apache/provisionr/activiti-karaf-commands/0.5.0-incubating-SNAPSHOT/activiti-karaf-commands-0.5.0-incubating-20130822.020145-43.pom (7 KB at 73.6 KB/sec)
Downloading: https://repository.apache.org/content/repositories/snapshots/org/apache/provisionr/activiti-karaf-commands/maven-metadata.xml
Downloaded: https://repository.apache.org/content/repositories/snapshots/org/apache/provisionr/activiti-karaf-commands/maven-metadata.xml (315 B at 4.2 KB/sec)
Uploading: https://repository.apache.org/content/repositories/snapshots/org/apache/provisionr/activiti-karaf-commands/0.5.0-incubating-SNAPSHOT/maven-metadata.xml
Uploaded: https://repository.apache.org/content/repositories/snapshots/org/apache/provisionr/activiti-karaf-commands/0.5.0-incubating-SNAPSHOT/maven-metadata.xml (2 KB at 8.7 KB/sec)
Uploading: https://repository.apache.org/content/repositories/snapshots/org/apache/provisionr/activiti-karaf-commands/maven-metadata.xml
Uploaded: https://repository.apache.org/content/repositories/snapshots/org/apache/provisionr/activiti-karaf-commands/maven-metadata.xml (315 B at 2.2 KB/sec)
Deploying the main artifact activiti-karaf-commands-0.5.0-incubating-SNAPSHOT-sources.jar
Uploading: https://repository.apache.org/content/repositories/snapshots/org/apache/provisionr/activiti-karaf-commands/0.5.0-incubating-SNAPSHOT/activiti-karaf-commands-0.5.0-incubating-20130822.020145-43-sources.jar
Uploaded: https://repository.apache.org/content/repositories/snapshots/org/apache/provisionr/activiti-karaf-commands/0.5.0-incubating-SNAPSHOT/activiti-karaf-commands-0.5.0-incubating-20130822.020145-43-sources.jar (35 KB at 240.6 KB/sec)
Uploading: https://repository.apache.org/content/repositories/snapshots/org/apache/provisionr/activiti-karaf-commands/0.5.0-incubating-SNAPSHOT/maven-metadata.xml
Uploaded: https://repository.apache.org/content/repositories/snapshots/org/apache/provisionr/activiti-karaf-commands/0.5.0-incubating-SNAPSHOT/maven-metadata.xml (2 KB at 10.5 KB/sec)
[INFO] Deployment in https://repository.apache.org/content/repositories/snapshots (id=apache.snapshots.https,uniqueVersion=true)
Deploying the main artifact activiti-karaf-web-explorer-0.5.0-incubating-SNAPSHOT.war
Downloading: https://repository.apache.org/content/repositories/snapshots/org/apache/provisionr/activiti-karaf-web-explorer/0.5.0-incubating-SNAPSHOT/maven-metadata.xml
Downloaded: https://repository.apache.org/content/repositories/snapshots/org/apache/provisionr/activiti-karaf-web-explorer/0.5.0-incubating-SNAPSHOT/maven-metadata.xml (2 KB at 3.2 KB/sec)
Uploading: https://repository.apache.org/content/repositories/snapshots/org/apache/provisionr/activiti-karaf-web-explorer/0.5.0-incubating-SNAPSHOT/activiti-karaf-web-explorer-0.5.0-incubating-20130822.020147-42.war
Uploaded: https://repository.apache.org/content/repositories/snapshots/org/apache/provisionr/activiti-karaf-web-explorer/0.5.0-incubating-SNAPSHOT/activiti-karaf-web-explorer-0.5.0-incubating-20130822.020147-42.war (1884 KB at 330.5 KB/sec)
Uploading: https://repository.apache.org/content/repositories/snapshots/org/apache/provisionr/activiti-karaf-web-explorer/0.5.0-incubating-SNAPSHOT/activiti-karaf-web-explorer-0.5.0-incubating-20130822.020147-42.pom
Uploaded: https://repository.apache.org/content/repositories/snapshots/org/apache/provisionr/activiti-karaf-web-explorer/0.5.0-incubating-SNAPSHOT/activiti-karaf-web-explorer-0.5.0-incubating-20130822.020147-42.pom (15 KB at 84.1 KB/sec)
Downloading: https://repository.apache.org/content/repositories/snapshots/org/apache/provisionr/activiti-karaf-web-explorer/maven-metadata.xml
Downloaded: https://repository.apache.org/content/repositories/snapshots/org/apache/provisionr/activiti-karaf-web-explorer/maven-metadata.xml (319 B at 1.9 KB/sec)
Uploading: https://repository.apache.org/content/repositories/snapshots/org/apache/provisionr/activiti-karaf-web-explorer/0.5.0-incubating-SNAPSHOT/maven-metadata.xml
Uploaded: https://repository.apache.org/content/repositories/snapshots/org/apache/provisionr/activiti-karaf-web-explorer/0.5.0-incubating-SNAPSHOT/maven-metadata.xml (2 KB at 7.6 KB/sec)
Uploading: https://repository.apache.org/content/repositories/snapshots/org/apache/provisionr/activiti-karaf-web-explorer/maven-metadata.xml
Uploaded: https://repository.apache.org/content/repositories/snapshots/org/apache/provisionr/activiti-karaf-web-explorer/maven-metadata.xml (319 B at 2.2 KB/sec)
Deploying the main artifact activiti-karaf-web-explorer-0.5.0-incubating-SNAPSHOT-sources.jar
Uploading: https://repository.apache.org/content/repositories/snapshots/org/apache/provisionr/activiti-karaf-web-explorer/0.5.0-incubating-SNAPSHOT/activiti-karaf-web-explorer-0.5.0-incubating-20130822.020147-42-sources.jar
Uploaded: https://repository.apache.org/content/repositories/snapshots/org/apache/provisionr/activiti-karaf-web-explorer/0.5.0-incubating-SNAPSHOT/activiti-karaf-web-explorer-0.5.0-incubating-20130822.020147-42-sources.jar (5 KB at 48.5 KB/sec)
Uploading: https://repository.apache.org/content/repositories/snapshots/org/apache/provisionr/activiti-karaf-web-explorer/0.5.0-incubating-SNAPSHOT/maven-metadata.xml
Uploaded: https://repository.apache.org/content/repositories/snapshots/org/apache/provisionr/activiti-karaf-web-explorer/0.5.0-incubating-SNAPSHOT/maven-metadata.xml (2 KB at 12.3 KB/sec)
[INFO] Deployment in https://repository.apache.org/content/repositories/snapshots (id=apache.snapshots.https,uniqueVersion=true)
Deploying the main artifact provisionr-aggregator-0.5.0-incubating-SNAPSHOT.pom
Downloading: https://repository.apache.org/content/repositories/snapshots/org/apache/provisionr/provisionr-aggregator/0.5.0-incubating-SNAPSHOT/maven-metadata.xml
Downloaded: https://repository.apache.org/content/repositories/snapshots/org/apache/provisionr/provisionr-aggregator/0.5.0-incubating-SNAPSHOT/maven-metadata.xml (643 B at 2.9 KB/sec)
Uploading: https://repository.apache.org/content/repositories/snapshots/org/apache/provisionr/provisionr-aggregator/0.5.0-incubating-SNAPSHOT/provisionr-aggregator-0.5.0-incubating-20130822.020203-42.pom
Uploaded: https://repository.apache.org/content/repositories/snapshots/org/apache/provisionr/provisionr-aggregator/0.5.0-incubating-SNAPSHOT/provisionr-aggregator-0.5.0-incubating-20130822.020203-42.pom (4 KB at 38.0 KB/sec)
Downloading: https://repository.apache.org/content/repositories/snapshots/org/apache/provisionr/provisionr-aggregator/maven-metadata.xml
Downloaded: https://repository.apache.org/content/repositories/snapshots/org/apache/provisionr/provisionr-aggregator/maven-metadata.xml (313 B at 1.2 KB/sec)
Uploading: https://repository.apache.org/content/repositories/snapshots/org/apache/provisionr/provisionr-aggregator/0.5.0-incubating-SNAPSHOT/maven-metadata.xml
Uploaded: https://repository.apache.org/content/repositories/snapshots/org/apache/provisionr/provisionr-aggregator/0.5.0-incubating-SNAPSHOT/maven-metadata.xml (643 B at 3.7 KB/sec)
Uploading: https://repository.apache.org/content/repositories/snapshots/org/apache/provisionr/provisionr-aggregator/maven-metadata.xml
Uploaded: https://repository.apache.org/content/repositories/snapshots/org/apache/provisionr/provisionr-aggregator/maven-metadata.xml (313 B at 1.3 KB/sec)
[INFO] Deployment in https://repository.apache.org/content/repositories/snapshots (id=apache.snapshots.https,uniqueVersion=true)
Deploying the main artifact provisionr-amazon-0.5.0-incubating-SNAPSHOT.jar
Downloading: https://repository.apache.org/content/repositories/snapshots/org/apache/provisionr/provisionr-amazon/0.5.0-incubating-SNAPSHOT/maven-metadata.xml
Downloaded: https://repository.apache.org/content/repositories/snapshots/org/apache/provisionr/provisionr-amazon/0.5.0-incubating-SNAPSHOT/maven-metadata.xml (2 KB at 5.7 KB/sec)
Uploading: https://repository.apache.org/content/repositories/snapshots/org/apache/provisionr/provisionr-amazon/0.5.0-incubating-SNAPSHOT/provisionr-amazon-0.5.0-incubating-20130822.020213-42.jar
Uploaded: https://repository.apache.org/content/repositories/snapshots/org/apache/provisionr/provisionr-amazon/0.5.0-incubating-SNAPSHOT/provisionr-amazon-0.5.0-incubating-20130822.020213-42.jar (92 KB at 126.3 KB/sec)
Uploading: https://repository.apache.org/content/repositories/snapshots/org/apache/provisionr/provisionr-amazon/0.5.0-incubating-SNAPSHOT/provisionr-amazon-0.5.0-incubating-20130822.020213-42.pom
Uploaded: https://repository.apache.org/content/repositories/snapshots/org/apache/provisionr/provisionr-amazon/0.5.0-incubating-SNAPSHOT/provisionr-amazon-0.5.0-incubating-20130822.020213-42.pom (9 KB at 67.9 KB/sec)
Downloading: https://repository.apache.org/content/repositories/snapshots/org/apache/provisionr/provisionr-amazon/maven-metadata.xml
Downloaded: https://repository.apache.org/content/repositories/snapshots/org/apache/provisionr/provisionr-amazon/maven-metadata.xml (309 B at 2.8 KB/sec)
Uploading: https://repository.apache.org/content/repositories/snapshots/org/apache/provisionr/provisionr-amazon/0.5.0-incubating-SNAPSHOT/maven-metadata.xml
Uploaded: https://repository.apache.org/content/repositories/snapshots/org/apache/provisionr/provisionr-amazon/0.5.0-incubating-SNAPSHOT/maven-metadata.xml (2 KB at 7.2 KB/sec)
Uploading: https://repository.apache.org/content/repositories/snapshots/org/apache/provisionr/provisionr-amazon/maven-metadata.xml
Uploaded: https://repository.apache.org/content/repositories/snapshots/org/apache/provisionr/provisionr-amazon/maven-metadata.xml (309 B at 2.4 KB/sec)
Deploying the main artifact provisionr-amazon-0.5.0-incubating-SNAPSHOT-sources.jar
Uploading: https://repository.apache.org/content/repositories/snapshots/org/apache/provisionr/provisionr-amazon/0.5.0-incubating-SNAPSHOT/provisionr-amazon-0.5.0-incubating-20130822.020213-42-sources.jar
Uploaded: https://repository.apache.org/content/repositories/snapshots/org/apache/provisionr/provisionr-amazon/0.5.0-incubating-SNAPSHOT/provisionr-amazon-0.5.0-incubating-20130822.020213-42-sources.jar (70 KB at 534.2 KB/sec)
Uploading: https://repository.apache.org/content/repositories/snapshots/org/apache/provisionr/provisionr-amazon/0.5.0-incubating-SNAPSHOT/maven-metadata.xml
Uploaded: https://repository.apache.org/content/repositories/snapshots/org/apache/provisionr/provisionr-amazon/0.5.0-incubating-SNAPSHOT/maven-metadata.xml (2 KB at 10.1 KB/sec)
Deploying the main artifact provisionr-amazon-0.5.0-incubating-SNAPSHOT-features.xml
Uploading: https://repository.apache.org/content/repositories/snapshots/org/apache/provisionr/provisionr-amazon/0.5.0-incubating-SNAPSHOT/provisionr-amazon-0.5.0-incubating-20130822.020213-42-features.xml
Uploaded: https://repository.apache.org/content/repositories/snapshots/org/apache/provisionr/provisionr-amazon/0.5.0-incubating-SNAPSHOT/provisionr-amazon-0.5.0-incubating-20130822.020213-42-features.xml (2 KB at 18.9 KB/sec)
Uploading: https://repository.apache.org/content/repositories/snapshots/org/apache/provisionr/provisionr-amazon/0.5.0-incubating-SNAPSHOT/maven-metadata.xml
Uploaded: https://repository.apache.org/content/repositories/snapshots/org/apache/provisionr/provisionr-amazon/0.5.0-incubating-SNAPSHOT/maven-metadata.xml (2 KB at 9.9 KB/sec)
Deploying the main artifact provisionr-amazon-0.5.0-incubating-SNAPSHOT-defaults.cfg
Uploading: https://repository.apache.org/content/repositories/snapshots/org/apache/provisionr/provisionr-amazon/0.5.0-incubating-SNAPSHOT/provisionr-amazon-0.5.0-incubating-20130822.020213-42-defaults.cfg
Uploaded: https://repository.apache.org/content/repositories/snapshots/org/apache/provisionr/provisionr-amazon/0.5.0-incubating-SNAPSHOT/provisionr-amazon-0.5.0-incubating-20130822.020213-42-defaults.cfg (905 B at 8.5 KB/sec)
Uploading: https://repository.apache.org/content/repositories/snapshots/org/apache/provisionr/provisionr-amazon/0.5.0-incubating-SNAPSHOT/maven-metadata.xml
Uploaded: https://repository.apache.org/content/repositories/snapshots/org/apache/provisionr/provisionr-amazon/0.5.0-incubating-SNAPSHOT/maven-metadata.xml (2 KB at 11.8 KB/sec)
[INFO] Deployment in https://repository.apache.org/content/repositories/snapshots (id=apache.snapshots.https,uniqueVersion=true)
Deploying the main artifact provisionr-amazon-tests-0.5.0-incubating-SNAPSHOT.jar
Downloading: https://repository.apache.org/content/repositories/snapshots/org/apache/provisionr/provisionr-amazon-tests/0.5.0-incubating-SNAPSHOT/maven-metadata.xml
Downloaded: https://repository.apache.org/content/repositories/snapshots/org/apache/provisionr/provisionr-amazon-tests/0.5.0-incubating-SNAPSHOT/maven-metadata.xml (2 KB at 0.1 KB/sec)
Uploading: https://repository.apache.org/content/repositories/snapshots/org/apache/provisionr/provisionr-amazon-tests/0.5.0-incubating-SNAPSHOT/provisionr-amazon-tests-0.5.0-incubating-20130822.020225-42.jar
Uploaded: https://repository.apache.org/content/repositories/snapshots/org/apache/provisionr/provisionr-amazon-tests/0.5.0-incubating-SNAPSHOT/provisionr-amazon-tests-0.5.0-incubating-20130822.020225-42.jar (13 KB at 128.9 KB/sec)
Uploading: https://repository.apache.org/content/repositories/snapshots/org/apache/provisionr/provisionr-amazon-tests/0.5.0-incubating-SNAPSHOT/provisionr-amazon-tests-0.5.0-incubating-20130822.020225-42.pom
Uploaded: https://repository.apache.org/content/repositories/snapshots/org/apache/provisionr/provisionr-amazon-tests/0.5.0-incubating-SNAPSHOT/provisionr-amazon-tests-0.5.0-incubating-20130822.020225-42.pom (5 KB at 37.3 KB/sec)
Downloading: https://repository.apache.org/content/repositories/snapshots/org/apache/provisionr/provisionr-amazon-tests/maven-metadata.xml
Downloaded: https://repository.apache.org/content/repositories/snapshots/org/apache/provisionr/provisionr-amazon-tests/maven-metadata.xml (437 B at 0.2 KB/sec)
Uploading: https://repository.apache.org/content/repositories/snapshots/org/apache/provisionr/provisionr-amazon-tests/0.5.0-incubating-SNAPSHOT/maven-metadata.xml
Uploading: https://repository.apache.org/content/repositories/snapshots/org/apache/provisionr/provisionr-amazon-tests/maven-metadata.xml
Uploaded: https://repository.apache.org/content/repositories/snapshots/org/apache/provisionr/provisionr-amazon-tests/maven-metadata.xml (437 B at 1.0 KB/sec)
ERROR: Failed to deploy metadata: Could not transfer metadata org.apache.provisionr:provisionr-amazon-tests:0.5.0-incubating-SNAPSHOT/maven-metadata.xml from/to apache.snapshots.https (https://repository.apache.org/content/repositories/snapshots): The target server failed to respond
org.apache.maven.artifact.deployer.ArtifactDeploymentException: Failed to deploy metadata: Could not transfer metadata org.apache.provisionr:provisionr-amazon-tests:0.5.0-incubating-SNAPSHOT/maven-metadata.xml from/to apache.snapshots.https (https://repository.apache.org/content/repositories/snapshots): The target server failed to respond
	at org.apache.maven.artifact.deployer.DefaultArtifactDeployer.deploy(DefaultArtifactDeployer.java:143)
	at hudson.maven.reporters.MavenArtifactRecord.deploy(MavenArtifactRecord.java:190)
	at hudson.maven.RedeployPublisher.perform(RedeployPublisher.java:176)
	at hudson.tasks.BuildStepMonitor$1.perform(BuildStepMonitor.java:20)
	at hudson.model.AbstractBuild$AbstractBuildExecution.perform(AbstractBuild.java:782)
	at hudson.model.AbstractBuild$AbstractBuildExecution.performAllBuildSteps(AbstractBuild.java:754)
	at hudson.maven.MavenModuleSetBuild$MavenModuleSetBuildExecution.post2(MavenModuleSetBuild.java:1007)
	at hudson.model.AbstractBuild$AbstractBuildExecution.post(AbstractBuild.java:707)
	at hudson.model.Run.execute(Run.java:1628)
	at hudson.maven.MavenModuleSetBuild.run(MavenModuleSetBuild.java:506)
	at hudson.model.ResourceController.execute(ResourceController.java:88)
	at hudson.model.Executor.run(Executor.java:247)
Caused by: org.eclipse.aether.deployment.DeploymentException: Failed to deploy metadata: Could not transfer metadata org.apache.provisionr:provisionr-amazon-tests:0.5.0-incubating-SNAPSHOT/maven-metadata.xml from/to apache.snapshots.https (https://repository.apache.org/content/repositories/snapshots): The target server failed to respond
	at org.eclipse.aether.internal.impl.DefaultDeployer.deploy(DefaultDeployer.java:372)
	at org.eclipse.aether.internal.impl.DefaultDeployer.deploy(DefaultDeployer.java:269)
	at org.eclipse.aether.internal.impl.DefaultRepositorySystem.deploy(DefaultRepositorySystem.java:413)
	at org.apache.maven.artifact.deployer.DefaultArtifactDeployer.deploy(DefaultArtifactDeployer.java:139)
	... 11 more
Caused by: org.eclipse.aether.transfer.MetadataTransferException: Could not transfer metadata org.apache.provisionr:provisionr-amazon-tests:0.5.0-incubating-SNAPSHOT/maven-metadata.xml from/to apache.snapshots.https (https://repository.apache.org/content/repositories/snapshots): The target server failed to respond
	at org.eclipse.aether.connector.wagon.WagonRepositoryConnector$5.wrap(WagonRepositoryConnector.java:995)
	at org.eclipse.aether.connector.wagon.WagonRepositoryConnector$5.wrap(WagonRepositoryConnector.java:983)
	at org.eclipse.aether.connector.wagon.WagonRepositoryConnector$PutTask.run(WagonRepositoryConnector.java:895)
	at org.eclipse.aether.connector.wagon.WagonRepositoryConnector.put(WagonRepositoryConnector.java:530)
	at org.eclipse.aether.internal.impl.DefaultDeployer.deploy(DefaultDeployer.java:366)
	... 14 more
Caused by: org.apache.maven.wagon.TransferFailedException: The target server failed to respond
	at org.apache.maven.wagon.shared.http4.AbstractHttpClientWagon.put(AbstractHttpClientWagon.java:580)
	at org.apache.maven.wagon.shared.http4.AbstractHttpClientWagon.put(AbstractHttpClientWagon.java:524)
	at org.apache.maven.wagon.shared.http4.AbstractHttpClientWagon.put(AbstractHttpClientWagon.java:505)
	at org.apache.maven.wagon.shared.http4.AbstractHttpClientWagon.put(AbstractHttpClientWagon.java:485)
	at org.eclipse.aether.connector.wagon.WagonRepositoryConnector$PutTask.run(WagonRepositoryConnector.java:871)
	... 16 more
Caused by: org.apache.http.NoHttpResponseException: The target server failed to respond
	at org.apache.http.impl.conn.DefaultHttpResponseParser.parseHead(DefaultHttpResponseParser.java:95)
	at org.apache.http.impl.conn.DefaultHttpResponseParser.parseHead(DefaultHttpResponseParser.java:62)
	at org.apache.http.impl.io.AbstractMessageParser.parse(AbstractMessageParser.java:254)
	at org.apache.http.impl.AbstractHttpClientConnection.receiveResponseHeader(AbstractHttpClientConnection.java:289)
	at org.apache.http.impl.conn.DefaultClientConnection.receiveResponseHeader(DefaultClientConnection.java:252)
	at org.apache.http.impl.conn.ManagedClientConnectionImpl.receiveResponseHeader(ManagedClientConnectionImpl.java:191)
	at org.apache.http.protocol.HttpRequestExecutor.doReceiveResponse(HttpRequestExecutor.java:300)
	at org.apache.http.protocol.HttpRequestExecutor.execute(HttpRequestExecutor.java:127)
	at org.apache.http.impl.client.DefaultRequestDirector.tryExecute(DefaultRequestDirector.java:715)
	at org.apache.http.impl.client.DefaultRequestDirector.execute(DefaultRequestDirector.java:520)
	at org.apache.http.impl.client.AbstractHttpClient.execute(AbstractHttpClient.java:906)
	at org.apache.http.impl.client.AbstractHttpClient.execute(AbstractHttpClient.java:805)
	at org.apache.maven.wagon.shared.http4.AbstractHttpClientWagon.execute(AbstractHttpClientWagon.java:746)
	at org.apache.maven.wagon.shared.http4.AbstractHttpClientWagon.put(AbstractHttpClientWagon.java:574)
	... 20 more
[INFO] Deployment failed after 1 min 7 sec
Build step 'Deploy artifacts to Maven repository' changed build result to FAILURE

Mime
View raw message