provisionr-dev mailing list archives

Site index · List index
Message view « Date » · « Thread »
Top « Date » · « Thread »
From Apache Jenkins Server <jenk...@builds.apache.org>
Subject Build failed in Jenkins: provisionr-master #60
Date Sat, 20 Jul 2013 00:53:09 GMT
See <https://builds.apache.org/job/provisionr-master/60/>

------------------------------------------
[...truncated 4021 lines...]
[INFO] Exclude: .idea/**
[INFO] Exclude: **/*.iml
[INFO] Exclude: **/*.project
[INFO] Exclude: **/*.classpath
[INFO] Exclude: **/*.prefs
[INFO] Exclude: **/id_rsa_test
[INFO] Exclude: **/id_rsa_test.pub
[INFO] Exclude: **/*.bpmn20.xml
[INFO] Exclude: **/*.activiti
[INFO] Exclude: **/*.csv
[INFO] Exclude: **/target/**

[INFO] --- apache-rat-plugin:0.9:check (default) @ provisionr-assembly-tests ---
[INFO] 2 resources included (use -debug for more details)
[INFO] Rat check: Summary of files. Unapproved: 0 unknown: 0 generated: 0 approved: 2 licence.
[INFO] [INFO] Installing <https://builds.apache.org/job/provisionr-master/ws/karaf/assembly-tests/target/provisionr-assembly-tests-0.5.0-incubating-SNAPSHOT.jar>
to /home/jenkins/jenkins-slave/maven-repositories/1/org/apache/provisionr/provisionr-assembly-tests/0.5.0-incubating-SNAPSHOT/provisionr-assembly-tests-0.5.0-incubating-SNAPSHOT.jar
[INFO] Installing <https://builds.apache.org/job/provisionr-master/ws/karaf/assembly-tests/pom.xml>
to /home/jenkins/jenkins-slave/maven-repositories/1/org/apache/provisionr/provisionr-assembly-tests/0.5.0-incubating-SNAPSHOT/provisionr-assembly-tests-0.5.0-incubating-SNAPSHOT.pom

[INFO] --- maven-install-plugin:2.3.1:install (default-install) @ provisionr-assembly-tests
---
[INFO] Installing <https://builds.apache.org/job/provisionr-master/ws/karaf/assembly-tests/target/provisionr-assembly-tests-0.5.0-incubating-SNAPSHOT-sources.jar>
to /home/jenkins/jenkins-slave/maven-repositories/1/org/apache/provisionr/provisionr-assembly-tests/0.5.0-incubating-SNAPSHOT/provisionr-assembly-tests-0.5.0-incubating-SNAPSHOT-sources.jar
[INFO]                                                                         
[INFO] ------------------------------------------------------------------------
[INFO] Building Apache Provisionr :: Aggregator 0.5.0-incubating-SNAPSHOT
[INFO] ------------------------------------------------------------------------
[INFO] 
[INFO] --- maven-clean-plugin:2.5:clean (default-clean) @ provisionr-aggregator ---
[INFO] 
[INFO] --- maven-remote-resources-plugin:1.4:process (default) @ provisionr-aggregator ---
[INFO] 
[INFO] --- maven-site-plugin:3.2:attach-descriptor (attach-descriptor) @ provisionr-aggregator
---
Jul 20, 2013 12:47:38 AM hudson.maven.ExecutedMojo <init>
WARNING: Failed to getClass for org.apache.maven.plugin.source.SourceJarMojo
[INFO] 
[INFO] --- maven-source-plugin:2.2.1:jar (default) @ provisionr-aggregator ---
[INFO] [INFO] 70 implicit excludes (use -debug for more details).
[INFO] Exclude: **/*.md
[INFO] Exclude: NOTICE
[INFO] Exclude: .git/**
[INFO] Exclude: .repository/**
[INFO] Exclude: .gitignore
[INFO] Exclude: .idea/**
[INFO] Exclude: **/*.iml
[INFO] Exclude: **/*.project
[INFO] Exclude: **/*.classpath
[INFO] Exclude: **/*.prefs
[INFO] Exclude: **/id_rsa_test
[INFO] Exclude: **/id_rsa_test.pub
[INFO] Exclude: **/*.bpmn20.xml
[INFO] Exclude: **/*.activiti
[INFO] Exclude: **/*.csv
[INFO] Exclude: **/target/**

[INFO] --- apache-rat-plugin:0.9:check (default) @ provisionr-aggregator ---
[INFO] 7 resources included (use -debug for more details)
[INFO] Rat check: Summary of files. Unapproved: 0 unknown: 0 generated: 0 approved: 5 licence.
[INFO] [INFO] Installing <https://builds.apache.org/job/provisionr-master/ws/pom.xml>
to /home/jenkins/jenkins-slave/maven-repositories/1/org/apache/provisionr/provisionr-aggregator/0.5.0-incubating-SNAPSHOT/provisionr-aggregator-0.5.0-incubating-SNAPSHOT.pom

[INFO] --- maven-install-plugin:2.3.1:install (default-install) @ provisionr-aggregator ---
[INFO] ------------------------------------------------------------------------
[INFO] Reactor Summary:
[INFO] 
[INFO] Apache Provisionr :: Parent ....................... SUCCESS [19.815s]
[INFO] Apache Provisionr :: API .......................... SUCCESS [18.004s]
[INFO] Apache Provisionr :: Activiti Database ............ SUCCESS [5.206s]
[INFO] Apache Provisionr :: Test Support ................. SUCCESS [21.844s]
[INFO] Apache Provisionr :: Core ......................... SUCCESS [12.770s]
[INFO] Apache Provisionr :: Examples ..................... SUCCESS [4.856s]
[INFO] Apache Provisionr :: Web Console & REST API ....... SUCCESS [11.000s]
[INFO] Apache Provisionr :: Amazon ....................... SUCCESS [15.288s]
[INFO] Apache Provisionr :: CloudStack ................... SUCCESS [9.266s]
[INFO] Apache Provisionr :: Rundeck ...................... SUCCESS [6.402s]
[INFO] Apache Provisionr :: Activiti Karaf :: Commands ... SUCCESS [13.800s]
[INFO] Apache Provisionr :: Activiti Karaf :: Explorer ... SUCCESS [15.695s]
[INFO] Apache Provisionr :: Karaf Commands ............... SUCCESS [6.108s]
[INFO] Apache Provisionr :: Karaf Branding ............... SUCCESS [3.162s]
[INFO] Apache Provisionr :: Karaf Features ............... SUCCESS [5.948s]
[INFO] Apache Provisionr :: Amazon Integration Tests ..... SUCCESS [4.176s]
[INFO] Apache Provisionr :: CloudStack Integration Tests . SUCCESS [2.687s]
[INFO] Apache Provisionr :: Custom Karaf Distribution .... SUCCESS [22.245s]
[INFO] Apache Provisionr :: Custom Karaf Distribution Tests  SUCCESS [31.828s]
[INFO] Apache Provisionr :: Aggregator ................... SUCCESS [1.612s]
[INFO] ------------------------------------------------------------------------
[INFO] BUILD SUCCESS
[INFO] ------------------------------------------------------------------------
[INFO] Total time: 3:57.960s
[INFO] Finished at: Sat Jul 20 00:47:39 UTC 2013
[INFO] Final Memory: 55M/283M
[INFO] ------------------------------------------------------------------------
[JENKINS] Archiving <https://builds.apache.org/job/provisionr-master/ws/integration/rundeck/pom.xml>
to /home/hudson/hudson/jobs/provisionr-master/modules/org.apache.provisionr$provisionr-rundeck/builds/2013-07-20_00-43-25/archive/org.apache.provisionr/provisionr-rundeck/0.5.0-incubating-SNAPSHOT/provisionr-rundeck-0.5.0-incubating-SNAPSHOT.pom
[JENKINS] Archiving <https://builds.apache.org/job/provisionr-master/ws/integration/rundeck/target/provisionr-rundeck-0.5.0-incubating-SNAPSHOT.jar>
to /home/hudson/hudson/jobs/provisionr-master/modules/org.apache.provisionr$provisionr-rundeck/builds/2013-07-20_00-43-25/archive/org.apache.provisionr/provisionr-rundeck/0.5.0-incubating-SNAPSHOT/provisionr-rundeck-0.5.0-incubating-SNAPSHOT.jar
[JENKINS] Archiving <https://builds.apache.org/job/provisionr-master/ws/integration/rundeck/target/provisionr-rundeck-0.5.0-incubating-SNAPSHOT-sources.jar>
to /home/hudson/hudson/jobs/provisionr-master/modules/org.apache.provisionr$provisionr-rundeck/builds/2013-07-20_00-43-25/archive/org.apache.provisionr/provisionr-rundeck/0.5.0-incubating-SNAPSHOT/provisionr-rundeck-0.5.0-incubating-SNAPSHOT-sources.jar
[JENKINS] Archiving <https://builds.apache.org/job/provisionr-master/ws/integration/rundeck/target/classes/features.xml>
to /home/hudson/hudson/jobs/provisionr-master/modules/org.apache.provisionr$provisionr-rundeck/builds/2013-07-20_00-43-25/archive/org.apache.provisionr/provisionr-rundeck/0.5.0-incubating-SNAPSHOT/provisionr-rundeck-0.5.0-incubating-SNAPSHOT-features.xml
[JENKINS] Archiving <https://builds.apache.org/job/provisionr-master/ws/providers/amazon-tests/pom.xml>
to /home/hudson/hudson/jobs/provisionr-master/modules/org.apache.provisionr$provisionr-amazon-tests/builds/2013-07-20_00-43-25/archive/org.apache.provisionr/provisionr-amazon-tests/0.5.0-incubating-SNAPSHOT/provisionr-amazon-tests-0.5.0-incubating-SNAPSHOT.pom
[JENKINS] Archiving <https://builds.apache.org/job/provisionr-master/ws/providers/amazon-tests/target/provisionr-amazon-tests-0.5.0-incubating-SNAPSHOT.jar>
to /home/hudson/hudson/jobs/provisionr-master/modules/org.apache.provisionr$provisionr-amazon-tests/builds/2013-07-20_00-43-25/archive/org.apache.provisionr/provisionr-amazon-tests/0.5.0-incubating-SNAPSHOT/provisionr-amazon-tests-0.5.0-incubating-SNAPSHOT.jar
[JENKINS] Archiving <https://builds.apache.org/job/provisionr-master/ws/providers/amazon-tests/target/provisionr-amazon-tests-0.5.0-incubating-SNAPSHOT-sources.jar>
to /home/hudson/hudson/jobs/provisionr-master/modules/org.apache.provisionr$provisionr-amazon-tests/builds/2013-07-20_00-43-25/archive/org.apache.provisionr/provisionr-amazon-tests/0.5.0-incubating-SNAPSHOT/provisionr-amazon-tests-0.5.0-incubating-SNAPSHOT-sources.jar
[JENKINS] Archiving <https://builds.apache.org/job/provisionr-master/ws/console/pom.xml>
to /home/hudson/hudson/jobs/provisionr-master/modules/org.apache.provisionr$provisionr-console/builds/2013-07-20_00-43-25/archive/org.apache.provisionr/provisionr-console/0.5.0-incubating-SNAPSHOT/provisionr-console-0.5.0-incubating-SNAPSHOT.pom
[JENKINS] Archiving <https://builds.apache.org/job/provisionr-master/ws/console/target/provisionr-console-0.5.0-incubating-SNAPSHOT.jar>
to /home/hudson/hudson/jobs/provisionr-master/modules/org.apache.provisionr$provisionr-console/builds/2013-07-20_00-43-25/archive/org.apache.provisionr/provisionr-console/0.5.0-incubating-SNAPSHOT/provisionr-console-0.5.0-incubating-SNAPSHOT.jar
[JENKINS] Archiving <https://builds.apache.org/job/provisionr-master/ws/console/target/provisionr-console-0.5.0-incubating-SNAPSHOT-sources.jar>
to /home/hudson/hudson/jobs/provisionr-master/modules/org.apache.provisionr$provisionr-console/builds/2013-07-20_00-43-25/archive/org.apache.provisionr/provisionr-console/0.5.0-incubating-SNAPSHOT/provisionr-console-0.5.0-incubating-SNAPSHOT-sources.jar
[JENKINS] Archiving <https://builds.apache.org/job/provisionr-master/ws/console/target/classes/features.xml>
to /home/hudson/hudson/jobs/provisionr-master/modules/org.apache.provisionr$provisionr-console/builds/2013-07-20_00-43-25/archive/org.apache.provisionr/provisionr-console/0.5.0-incubating-SNAPSHOT/provisionr-console-0.5.0-incubating-SNAPSHOT-features.xml
[JENKINS] Archiving <https://builds.apache.org/job/provisionr-master/ws/console/target/classes/org.apache.provisionr.console.cfg>
to /home/hudson/hudson/jobs/provisionr-master/modules/org.apache.provisionr$provisionr-console/builds/2013-07-20_00-43-25/archive/org.apache.provisionr/provisionr-console/0.5.0-incubating-SNAPSHOT/provisionr-console-0.5.0-incubating-SNAPSHOT-defaults.cfg
[JENKINS] Archiving <https://builds.apache.org/job/provisionr-master/ws/providers/cloudstack-tests/pom.xml>
to /home/hudson/hudson/jobs/provisionr-master/modules/org.apache.provisionr$provisionr-cloudstack-tests/builds/2013-07-20_00-43-25/archive/org.apache.provisionr/provisionr-cloudstack-tests/0.5.0-incubating-SNAPSHOT/provisionr-cloudstack-tests-0.5.0-incubating-SNAPSHOT.pom
[JENKINS] Archiving <https://builds.apache.org/job/provisionr-master/ws/providers/cloudstack-tests/target/provisionr-cloudstack-tests-0.5.0-incubating-SNAPSHOT.jar>
to /home/hudson/hudson/jobs/provisionr-master/modules/org.apache.provisionr$provisionr-cloudstack-tests/builds/2013-07-20_00-43-25/archive/org.apache.provisionr/provisionr-cloudstack-tests/0.5.0-incubating-SNAPSHOT/provisionr-cloudstack-tests-0.5.0-incubating-SNAPSHOT.jar
[JENKINS] Archiving <https://builds.apache.org/job/provisionr-master/ws/providers/cloudstack-tests/target/provisionr-cloudstack-tests-0.5.0-incubating-SNAPSHOT-sources.jar>
to /home/hudson/hudson/jobs/provisionr-master/modules/org.apache.provisionr$provisionr-cloudstack-tests/builds/2013-07-20_00-43-25/archive/org.apache.provisionr/provisionr-cloudstack-tests/0.5.0-incubating-SNAPSHOT/provisionr-cloudstack-tests-0.5.0-incubating-SNAPSHOT-sources.jar
[JENKINS] Archiving <https://builds.apache.org/job/provisionr-master/ws/karaf/assembly-tests/pom.xml>
to /home/hudson/hudson/jobs/provisionr-master/modules/org.apache.provisionr$provisionr-assembly-tests/builds/2013-07-20_00-43-25/archive/org.apache.provisionr/provisionr-assembly-tests/0.5.0-incubating-SNAPSHOT/provisionr-assembly-tests-0.5.0-incubating-SNAPSHOT.pom
[JENKINS] Archiving <https://builds.apache.org/job/provisionr-master/ws/karaf/assembly-tests/target/provisionr-assembly-tests-0.5.0-incubating-SNAPSHOT.jar>
to /home/hudson/hudson/jobs/provisionr-master/modules/org.apache.provisionr$provisionr-assembly-tests/builds/2013-07-20_00-43-25/archive/org.apache.provisionr/provisionr-assembly-tests/0.5.0-incubating-SNAPSHOT/provisionr-assembly-tests-0.5.0-incubating-SNAPSHOT.jar
[JENKINS] Archiving <https://builds.apache.org/job/provisionr-master/ws/karaf/assembly-tests/target/provisionr-assembly-tests-0.5.0-incubating-SNAPSHOT-sources.jar>
to /home/hudson/hudson/jobs/provisionr-master/modules/org.apache.provisionr$provisionr-assembly-tests/builds/2013-07-20_00-43-25/archive/org.apache.provisionr/provisionr-assembly-tests/0.5.0-incubating-SNAPSHOT/provisionr-assembly-tests-0.5.0-incubating-SNAPSHOT-sources.jar
[JENKINS] Archiving <https://builds.apache.org/job/provisionr-master/ws/karaf/branding/pom.xml>
to /home/hudson/hudson/jobs/provisionr-master/modules/org.apache.provisionr$provisionr-branding/builds/2013-07-20_00-43-25/archive/org.apache.provisionr/provisionr-branding/0.5.0-incubating-SNAPSHOT/provisionr-branding-0.5.0-incubating-SNAPSHOT.pom
[JENKINS] Archiving <https://builds.apache.org/job/provisionr-master/ws/karaf/branding/target/provisionr-branding-0.5.0-incubating-SNAPSHOT.jar>
to /home/hudson/hudson/jobs/provisionr-master/modules/org.apache.provisionr$provisionr-branding/builds/2013-07-20_00-43-25/archive/org.apache.provisionr/provisionr-branding/0.5.0-incubating-SNAPSHOT/provisionr-branding-0.5.0-incubating-SNAPSHOT.jar
[JENKINS] Archiving <https://builds.apache.org/job/provisionr-master/ws/karaf/branding/target/provisionr-branding-0.5.0-incubating-SNAPSHOT-sources.jar>
to /home/hudson/hudson/jobs/provisionr-master/modules/org.apache.provisionr$provisionr-branding/builds/2013-07-20_00-43-25/archive/org.apache.provisionr/provisionr-branding/0.5.0-incubating-SNAPSHOT/provisionr-branding-0.5.0-incubating-SNAPSHOT-sources.jar
[JENKINS] Archiving <https://builds.apache.org/job/provisionr-master/ws/core/pom.xml>
to /home/hudson/hudson/jobs/provisionr-master/modules/org.apache.provisionr$provisionr-core/builds/2013-07-20_00-43-25/archive/org.apache.provisionr/provisionr-core/0.5.0-incubating-SNAPSHOT/provisionr-core-0.5.0-incubating-SNAPSHOT.pom
[JENKINS] Archiving <https://builds.apache.org/job/provisionr-master/ws/core/target/provisionr-core-0.5.0-incubating-SNAPSHOT.jar>
to /home/hudson/hudson/jobs/provisionr-master/modules/org.apache.provisionr$provisionr-core/builds/2013-07-20_00-43-25/archive/org.apache.provisionr/provisionr-core/0.5.0-incubating-SNAPSHOT/provisionr-core-0.5.0-incubating-SNAPSHOT.jar
[JENKINS] Archiving <https://builds.apache.org/job/provisionr-master/ws/core/target/provisionr-core-0.5.0-incubating-SNAPSHOT-sources.jar>
to /home/hudson/hudson/jobs/provisionr-master/modules/org.apache.provisionr$provisionr-core/builds/2013-07-20_00-43-25/archive/org.apache.provisionr/provisionr-core/0.5.0-incubating-SNAPSHOT/provisionr-core-0.5.0-incubating-SNAPSHOT-sources.jar
[JENKINS] Archiving <https://builds.apache.org/job/provisionr-master/ws/core/target/classes/features.xml>
to /home/hudson/hudson/jobs/provisionr-master/modules/org.apache.provisionr$provisionr-core/builds/2013-07-20_00-43-25/archive/org.apache.provisionr/provisionr-core/0.5.0-incubating-SNAPSHOT/provisionr-core-0.5.0-incubating-SNAPSHOT-features.xml
[JENKINS] Archiving <https://builds.apache.org/job/provisionr-master/ws/core/target/classes/org.apache.provisionr.cfg>
to /home/hudson/hudson/jobs/provisionr-master/modules/org.apache.provisionr$provisionr-core/builds/2013-07-20_00-43-25/archive/org.apache.provisionr/provisionr-core/0.5.0-incubating-SNAPSHOT/provisionr-core-0.5.0-incubating-SNAPSHOT-defaults.cfg
[JENKINS] Archiving <https://builds.apache.org/job/provisionr-master/ws/core/target/classes/org.apache.felix.fileinstall-templates.cfg>
to /home/hudson/hudson/jobs/provisionr-master/modules/org.apache.provisionr$provisionr-core/builds/2013-07-20_00-43-25/archive/org.apache.provisionr/provisionr-core/0.5.0-incubating-SNAPSHOT/provisionr-core-0.5.0-incubating-SNAPSHOT-fileinstall.cfg
[JENKINS] Archiving <https://builds.apache.org/job/provisionr-master/ws/karaf/commands/pom.xml>
to /home/hudson/hudson/jobs/provisionr-master/modules/org.apache.provisionr$provisionr-commands/builds/2013-07-20_00-43-25/archive/org.apache.provisionr/provisionr-commands/0.5.0-incubating-SNAPSHOT/provisionr-commands-0.5.0-incubating-SNAPSHOT.pom
[JENKINS] Archiving <https://builds.apache.org/job/provisionr-master/ws/karaf/commands/target/provisionr-commands-0.5.0-incubating-SNAPSHOT.jar>
to /home/hudson/hudson/jobs/provisionr-master/modules/org.apache.provisionr$provisionr-commands/builds/2013-07-20_00-43-25/archive/org.apache.provisionr/provisionr-commands/0.5.0-incubating-SNAPSHOT/provisionr-commands-0.5.0-incubating-SNAPSHOT.jar
[JENKINS] Archiving <https://builds.apache.org/job/provisionr-master/ws/karaf/commands/target/provisionr-commands-0.5.0-incubating-SNAPSHOT-sources.jar>
to /home/hudson/hudson/jobs/provisionr-master/modules/org.apache.provisionr$provisionr-commands/builds/2013-07-20_00-43-25/archive/org.apache.provisionr/provisionr-commands/0.5.0-incubating-SNAPSHOT/provisionr-commands-0.5.0-incubating-SNAPSHOT-sources.jar
[JENKINS] Archiving <https://builds.apache.org/job/provisionr-master/ws/karaf/assembly/pom.xml>
to /home/hudson/hudson/jobs/provisionr-master/modules/org.apache.provisionr$provisionr-assembly/builds/2013-07-20_00-43-25/archive/org.apache.provisionr/provisionr-assembly/0.5.0-incubating-SNAPSHOT/provisionr-assembly-0.5.0-incubating-SNAPSHOT.pom
[JENKINS] Archiving <https://builds.apache.org/job/provisionr-master/ws/karaf/assembly/target/provisionr-assembly-0.5.0-incubating-SNAPSHOT.jar>
to /home/hudson/hudson/jobs/provisionr-master/modules/org.apache.provisionr$provisionr-assembly/builds/2013-07-20_00-43-25/archive/org.apache.provisionr/provisionr-assembly/0.5.0-incubating-SNAPSHOT/provisionr-assembly-0.5.0-incubating-SNAPSHOT.jar
[JENKINS] Archiving <https://builds.apache.org/job/provisionr-master/ws/karaf/assembly/target/provisionr-assembly-0.5.0-incubating-SNAPSHOT-sources.jar>
to /home/hudson/hudson/jobs/provisionr-master/modules/org.apache.provisionr$provisionr-assembly/builds/2013-07-20_00-43-25/archive/org.apache.provisionr/provisionr-assembly/0.5.0-incubating-SNAPSHOT/provisionr-assembly-0.5.0-incubating-SNAPSHOT-sources.jar
[JENKINS] Archiving <https://builds.apache.org/job/provisionr-master/ws/karaf/assembly/target/provisionr-0.5.0-incubating-SNAPSHOT.tar.gz>
to /home/hudson/hudson/jobs/provisionr-master/modules/org.apache.provisionr$provisionr-assembly/builds/2013-07-20_00-43-25/archive/org.apache.provisionr/provisionr-assembly/0.5.0-incubating-SNAPSHOT/provisionr-assembly-0.5.0-incubating-SNAPSHOT.tar.gz
[JENKINS] Archiving <https://builds.apache.org/job/provisionr-master/ws/activiti/commands/pom.xml>
to /home/hudson/hudson/jobs/provisionr-master/modules/org.apache.provisionr$activiti-karaf-commands/builds/2013-07-20_00-43-25/archive/org.apache.provisionr/activiti-karaf-commands/0.5.0-incubating-SNAPSHOT/activiti-karaf-commands-0.5.0-incubating-SNAPSHOT.pom
[JENKINS] Archiving <https://builds.apache.org/job/provisionr-master/ws/activiti/commands/target/activiti-karaf-commands-0.5.0-incubating-SNAPSHOT.jar>
to /home/hudson/hudson/jobs/provisionr-master/modules/org.apache.provisionr$activiti-karaf-commands/builds/2013-07-20_00-43-25/archive/org.apache.provisionr/activiti-karaf-commands/0.5.0-incubating-SNAPSHOT/activiti-karaf-commands-0.5.0-incubating-SNAPSHOT.jar
[JENKINS] Archiving <https://builds.apache.org/job/provisionr-master/ws/activiti/commands/target/activiti-karaf-commands-0.5.0-incubating-SNAPSHOT-sources.jar>
to /home/hudson/hudson/jobs/provisionr-master/modules/org.apache.provisionr$activiti-karaf-commands/builds/2013-07-20_00-43-25/archive/org.apache.provisionr/activiti-karaf-commands/0.5.0-incubating-SNAPSHOT/activiti-karaf-commands-0.5.0-incubating-SNAPSHOT-sources.jar
[JENKINS] Archiving <https://builds.apache.org/job/provisionr-master/ws/examples/pom.xml>
to /home/hudson/hudson/jobs/provisionr-master/modules/org.apache.provisionr$provisionr-examples/builds/2013-07-20_00-43-25/archive/org.apache.provisionr/provisionr-examples/0.5.0-incubating-SNAPSHOT/provisionr-examples-0.5.0-incubating-SNAPSHOT.pom
[JENKINS] Archiving <https://builds.apache.org/job/provisionr-master/ws/examples/target/provisionr-examples-0.5.0-incubating-SNAPSHOT.jar>
to /home/hudson/hudson/jobs/provisionr-master/modules/org.apache.provisionr$provisionr-examples/builds/2013-07-20_00-43-25/archive/org.apache.provisionr/provisionr-examples/0.5.0-incubating-SNAPSHOT/provisionr-examples-0.5.0-incubating-SNAPSHOT.jar
[JENKINS] Archiving <https://builds.apache.org/job/provisionr-master/ws/examples/target/provisionr-examples-0.5.0-incubating-SNAPSHOT-sources.jar>
to /home/hudson/hudson/jobs/provisionr-master/modules/org.apache.provisionr$provisionr-examples/builds/2013-07-20_00-43-25/archive/org.apache.provisionr/provisionr-examples/0.5.0-incubating-SNAPSHOT/provisionr-examples-0.5.0-incubating-SNAPSHOT-sources.jar
[JENKINS] Archiving <https://builds.apache.org/job/provisionr-master/ws/examples/target/classes/features.xml>
to /home/hudson/hudson/jobs/provisionr-master/modules/org.apache.provisionr$provisionr-examples/builds/2013-07-20_00-43-25/archive/org.apache.provisionr/provisionr-examples/0.5.0-incubating-SNAPSHOT/provisionr-examples-0.5.0-incubating-SNAPSHOT-features.xml
[JENKINS] Archiving <https://builds.apache.org/job/provisionr-master/ws/examples/target/classes/org/apache/provisionr/examples/templates/cdh3.xml>
to /home/hudson/hudson/jobs/provisionr-master/modules/org.apache.provisionr$provisionr-examples/builds/2013-07-20_00-43-25/archive/org.apache.provisionr/provisionr-examples/0.5.0-incubating-SNAPSHOT/provisionr-examples-0.5.0-incubating-SNAPSHOT-cdh3.template
[JENKINS] Archiving <https://builds.apache.org/job/provisionr-master/ws/examples/target/classes/org/apache/provisionr/examples/templates/cdh4.xml>
to /home/hudson/hudson/jobs/provisionr-master/modules/org.apache.provisionr$provisionr-examples/builds/2013-07-20_00-43-25/archive/org.apache.provisionr/provisionr-examples/0.5.0-incubating-SNAPSHOT/provisionr-examples-0.5.0-incubating-SNAPSHOT-cdh4.template
[JENKINS] Archiving <https://builds.apache.org/job/provisionr-master/ws/examples/target/classes/org/apache/provisionr/examples/templates/jenkins.xml>
to /home/hudson/hudson/jobs/provisionr-master/modules/org.apache.provisionr$provisionr-examples/builds/2013-07-20_00-43-25/archive/org.apache.provisionr/provisionr-examples/0.5.0-incubating-SNAPSHOT/provisionr-examples-0.5.0-incubating-SNAPSHOT-jenkins.template
[JENKINS] Archiving <https://builds.apache.org/job/provisionr-master/ws/activiti/explorer/pom.xml>
to /home/hudson/hudson/jobs/provisionr-master/modules/org.apache.provisionr$activiti-karaf-web-explorer/builds/2013-07-20_00-43-25/archive/org.apache.provisionr/activiti-karaf-web-explorer/0.5.0-incubating-SNAPSHOT/activiti-karaf-web-explorer-0.5.0-incubating-SNAPSHOT.pom
[JENKINS] Archiving <https://builds.apache.org/job/provisionr-master/ws/activiti/explorer/target/activiti-karaf-web-explorer-0.5.0-incubating-SNAPSHOT.war>
to /home/hudson/hudson/jobs/provisionr-master/modules/org.apache.provisionr$activiti-karaf-web-explorer/builds/2013-07-20_00-43-25/archive/org.apache.provisionr/activiti-karaf-web-explorer/0.5.0-incubating-SNAPSHOT/activiti-karaf-web-explorer-0.5.0-incubating-SNAPSHOT.war
[JENKINS] Archiving <https://builds.apache.org/job/provisionr-master/ws/activiti/explorer/target/activiti-karaf-web-explorer-0.5.0-incubating-SNAPSHOT-sources.jar>
to /home/hudson/hudson/jobs/provisionr-master/modules/org.apache.provisionr$activiti-karaf-web-explorer/builds/2013-07-20_00-43-25/archive/org.apache.provisionr/activiti-karaf-web-explorer/0.5.0-incubating-SNAPSHOT/activiti-karaf-web-explorer-0.5.0-incubating-SNAPSHOT-sources.jar
[JENKINS] Archiving <https://builds.apache.org/job/provisionr-master/ws/providers/cloudstack/pom.xml>
to /home/hudson/hudson/jobs/provisionr-master/modules/org.apache.provisionr$provisionr-cloudstack/builds/2013-07-20_00-43-25/archive/org.apache.provisionr/provisionr-cloudstack/0.5.0-incubating-SNAPSHOT/provisionr-cloudstack-0.5.0-incubating-SNAPSHOT.pom
[JENKINS] Archiving <https://builds.apache.org/job/provisionr-master/ws/providers/cloudstack/target/provisionr-cloudstack-0.5.0-incubating-SNAPSHOT.jar>
to /home/hudson/hudson/jobs/provisionr-master/modules/org.apache.provisionr$provisionr-cloudstack/builds/2013-07-20_00-43-25/archive/org.apache.provisionr/provisionr-cloudstack/0.5.0-incubating-SNAPSHOT/provisionr-cloudstack-0.5.0-incubating-SNAPSHOT.jar
[JENKINS] Archiving <https://builds.apache.org/job/provisionr-master/ws/providers/cloudstack/target/provisionr-cloudstack-0.5.0-incubating-SNAPSHOT-sources.jar>
to /home/hudson/hudson/jobs/provisionr-master/modules/org.apache.provisionr$provisionr-cloudstack/builds/2013-07-20_00-43-25/archive/org.apache.provisionr/provisionr-cloudstack/0.5.0-incubating-SNAPSHOT/provisionr-cloudstack-0.5.0-incubating-SNAPSHOT-sources.jar
[JENKINS] Archiving <https://builds.apache.org/job/provisionr-master/ws/providers/cloudstack/target/classes/features.xml>
to /home/hudson/hudson/jobs/provisionr-master/modules/org.apache.provisionr$provisionr-cloudstack/builds/2013-07-20_00-43-25/archive/org.apache.provisionr/provisionr-cloudstack/0.5.0-incubating-SNAPSHOT/provisionr-cloudstack-0.5.0-incubating-SNAPSHOT-features.xml
[JENKINS] Archiving <https://builds.apache.org/job/provisionr-master/ws/providers/cloudstack/target/classes/org.apache.provisionr.cloudstack.cfg>
to /home/hudson/hudson/jobs/provisionr-master/modules/org.apache.provisionr$provisionr-cloudstack/builds/2013-07-20_00-43-25/archive/org.apache.provisionr/provisionr-cloudstack/0.5.0-incubating-SNAPSHOT/provisionr-cloudstack-0.5.0-incubating-SNAPSHOT-defaults.cfg
[JENKINS] Archiving <https://builds.apache.org/job/provisionr-master/ws/api/pom.xml>
to /home/hudson/hudson/jobs/provisionr-master/modules/org.apache.provisionr$provisionr-api/builds/2013-07-20_00-43-25/archive/org.apache.provisionr/provisionr-api/0.5.0-incubating-SNAPSHOT/provisionr-api-0.5.0-incubating-SNAPSHOT.pom
[JENKINS] Archiving <https://builds.apache.org/job/provisionr-master/ws/api/target/provisionr-api-0.5.0-incubating-SNAPSHOT.jar>
to /home/hudson/hudson/jobs/provisionr-master/modules/org.apache.provisionr$provisionr-api/builds/2013-07-20_00-43-25/archive/org.apache.provisionr/provisionr-api/0.5.0-incubating-SNAPSHOT/provisionr-api-0.5.0-incubating-SNAPSHOT.jar
[JENKINS] Archiving <https://builds.apache.org/job/provisionr-master/ws/api/target/provisionr-api-0.5.0-incubating-SNAPSHOT-sources.jar>
to /home/hudson/hudson/jobs/provisionr-master/modules/org.apache.provisionr$provisionr-api/builds/2013-07-20_00-43-25/archive/org.apache.provisionr/provisionr-api/0.5.0-incubating-SNAPSHOT/provisionr-api-0.5.0-incubating-SNAPSHOT-sources.jar
[JENKINS] Archiving <https://builds.apache.org/job/provisionr-master/ws/activiti/database/pom.xml>
to /home/hudson/hudson/jobs/provisionr-master/modules/org.apache.provisionr$activiti-database/builds/2013-07-20_00-43-25/archive/org.apache.provisionr/activiti-database/0.5.0-incubating-SNAPSHOT/activiti-database-0.5.0-incubating-SNAPSHOT.pom
[JENKINS] Archiving <https://builds.apache.org/job/provisionr-master/ws/activiti/database/target/activiti-database-0.5.0-incubating-SNAPSHOT.jar>
to /home/hudson/hudson/jobs/provisionr-master/modules/org.apache.provisionr$activiti-database/builds/2013-07-20_00-43-25/archive/org.apache.provisionr/activiti-database/0.5.0-incubating-SNAPSHOT/activiti-database-0.5.0-incubating-SNAPSHOT.jar
[JENKINS] Archiving <https://builds.apache.org/job/provisionr-master/ws/activiti/database/target/activiti-database-0.5.0-incubating-SNAPSHOT-sources.jar>
to /home/hudson/hudson/jobs/provisionr-master/modules/org.apache.provisionr$activiti-database/builds/2013-07-20_00-43-25/archive/org.apache.provisionr/activiti-database/0.5.0-incubating-SNAPSHOT/activiti-database-0.5.0-incubating-SNAPSHOT-sources.jar
[JENKINS] Archiving <https://builds.apache.org/job/provisionr-master/ws/pom.xml> to
/home/hudson/hudson/jobs/provisionr-master/modules/org.apache.provisionr$provisionr-aggregator/builds/2013-07-20_00-43-25/archive/org.apache.provisionr/provisionr-aggregator/0.5.0-incubating-SNAPSHOT/provisionr-aggregator-0.5.0-incubating-SNAPSHOT.pom
[JENKINS] Archiving <https://builds.apache.org/job/provisionr-master/ws/providers/amazon/pom.xml>
to /home/hudson/hudson/jobs/provisionr-master/modules/org.apache.provisionr$provisionr-amazon/builds/2013-07-20_00-43-25/archive/org.apache.provisionr/provisionr-amazon/0.5.0-incubating-SNAPSHOT/provisionr-amazon-0.5.0-incubating-SNAPSHOT.pom
[JENKINS] Archiving <https://builds.apache.org/job/provisionr-master/ws/providers/amazon/target/provisionr-amazon-0.5.0-incubating-SNAPSHOT.jar>
to /home/hudson/hudson/jobs/provisionr-master/modules/org.apache.provisionr$provisionr-amazon/builds/2013-07-20_00-43-25/archive/org.apache.provisionr/provisionr-amazon/0.5.0-incubating-SNAPSHOT/provisionr-amazon-0.5.0-incubating-SNAPSHOT.jar
[JENKINS] Archiving <https://builds.apache.org/job/provisionr-master/ws/providers/amazon/target/provisionr-amazon-0.5.0-incubating-SNAPSHOT-sources.jar>
to /home/hudson/hudson/jobs/provisionr-master/modules/org.apache.provisionr$provisionr-amazon/builds/2013-07-20_00-43-25/archive/org.apache.provisionr/provisionr-amazon/0.5.0-incubating-SNAPSHOT/provisionr-amazon-0.5.0-incubating-SNAPSHOT-sources.jar
[JENKINS] Archiving <https://builds.apache.org/job/provisionr-master/ws/providers/amazon/target/classes/features.xml>
to /home/hudson/hudson/jobs/provisionr-master/modules/org.apache.provisionr$provisionr-amazon/builds/2013-07-20_00-43-25/archive/org.apache.provisionr/provisionr-amazon/0.5.0-incubating-SNAPSHOT/provisionr-amazon-0.5.0-incubating-SNAPSHOT-features.xml
[JENKINS] Archiving <https://builds.apache.org/job/provisionr-master/ws/providers/amazon/target/classes/org.apache.provisionr.amazon.cfg>
to /home/hudson/hudson/jobs/provisionr-master/modules/org.apache.provisionr$provisionr-amazon/builds/2013-07-20_00-43-25/archive/org.apache.provisionr/provisionr-amazon/0.5.0-incubating-SNAPSHOT/provisionr-amazon-0.5.0-incubating-SNAPSHOT-defaults.cfg
[JENKINS] Archiving <https://builds.apache.org/job/provisionr-master/ws/test-support/pom.xml>
to /home/hudson/hudson/jobs/provisionr-master/modules/org.apache.provisionr$provisionr-test-support/builds/2013-07-20_00-43-25/archive/org.apache.provisionr/provisionr-test-support/0.5.0-incubating-SNAPSHOT/provisionr-test-support-0.5.0-incubating-SNAPSHOT.pom
[JENKINS] Archiving <https://builds.apache.org/job/provisionr-master/ws/test-support/target/provisionr-test-support-0.5.0-incubating-SNAPSHOT.jar>
to /home/hudson/hudson/jobs/provisionr-master/modules/org.apache.provisionr$provisionr-test-support/builds/2013-07-20_00-43-25/archive/org.apache.provisionr/provisionr-test-support/0.5.0-incubating-SNAPSHOT/provisionr-test-support-0.5.0-incubating-SNAPSHOT.jar
[JENKINS] Archiving <https://builds.apache.org/job/provisionr-master/ws/test-support/target/provisionr-test-support-0.5.0-incubating-SNAPSHOT-sources.jar>
to /home/hudson/hudson/jobs/provisionr-master/modules/org.apache.provisionr$provisionr-test-support/builds/2013-07-20_00-43-25/archive/org.apache.provisionr/provisionr-test-support/0.5.0-incubating-SNAPSHOT/provisionr-test-support-0.5.0-incubating-SNAPSHOT-sources.jar
[JENKINS] Archiving <https://builds.apache.org/job/provisionr-master/ws/test-support/target/features.xml>
to /home/hudson/hudson/jobs/provisionr-master/modules/org.apache.provisionr$provisionr-test-support/builds/2013-07-20_00-43-25/archive/org.apache.provisionr/provisionr-test-support/0.5.0-incubating-SNAPSHOT/provisionr-test-support-0.5.0-incubating-SNAPSHOT-features.xml
[JENKINS] Archiving <https://builds.apache.org/job/provisionr-master/ws/karaf/features/pom.xml>
to /home/hudson/hudson/jobs/provisionr-master/modules/org.apache.provisionr$provisionr-features/builds/2013-07-20_00-43-25/archive/org.apache.provisionr/provisionr-features/0.5.0-incubating-SNAPSHOT/provisionr-features-0.5.0-incubating-SNAPSHOT.pom
[JENKINS] Archiving <https://builds.apache.org/job/provisionr-master/ws/karaf/features/target/provisionr-features-0.5.0-incubating-SNAPSHOT.jar>
to /home/hudson/hudson/jobs/provisionr-master/modules/org.apache.provisionr$provisionr-features/builds/2013-07-20_00-43-25/archive/org.apache.provisionr/provisionr-features/0.5.0-incubating-SNAPSHOT/provisionr-features-0.5.0-incubating-SNAPSHOT.jar
[JENKINS] Archiving <https://builds.apache.org/job/provisionr-master/ws/karaf/features/target/provisionr-features-0.5.0-incubating-SNAPSHOT-sources.jar>
to /home/hudson/hudson/jobs/provisionr-master/modules/org.apache.provisionr$provisionr-features/builds/2013-07-20_00-43-25/archive/org.apache.provisionr/provisionr-features/0.5.0-incubating-SNAPSHOT/provisionr-features-0.5.0-incubating-SNAPSHOT-sources.jar
[JENKINS] Archiving <https://builds.apache.org/job/provisionr-master/ws/karaf/features/target/features.xml>
to /home/hudson/hudson/jobs/provisionr-master/modules/org.apache.provisionr$provisionr-features/builds/2013-07-20_00-43-25/archive/org.apache.provisionr/provisionr-features/0.5.0-incubating-SNAPSHOT/provisionr-features-0.5.0-incubating-SNAPSHOT-features.xml
[JENKINS] Archiving <https://builds.apache.org/job/provisionr-master/ws/parent/pom.xml>
to /home/hudson/hudson/jobs/provisionr-master/modules/org.apache.provisionr$provisionr-parent/builds/2013-07-20_00-43-25/archive/org.apache.provisionr/provisionr-parent/0.5.0-incubating-SNAPSHOT/provisionr-parent-0.5.0-incubating-SNAPSHOT.pom
Waiting for Jenkins to finish collecting data
channel stopped
Archiving artifacts
Maven RedeployPublisher use remote ubuntu2 maven settings from : /home/jenkins/.m2/settings.xml
[INFO] Deployment in https://repository.apache.org/content/repositories/snapshots (id=apache.snapshots.https,uniqueVersion=true)
Deploying the main artifact activiti-database-0.5.0-incubating-SNAPSHOT.jar
Downloading: https://repository.apache.org/content/repositories/snapshots/org/apache/provisionr/activiti-database/0.5.0-incubating-SNAPSHOT/maven-metadata.xml
Downloaded: https://repository.apache.org/content/repositories/snapshots/org/apache/provisionr/activiti-database/0.5.0-incubating-SNAPSHOT/maven-metadata.xml
(2 KB at 1.3 KB/sec)
Uploading: https://repository.apache.org/content/repositories/snapshots/org/apache/provisionr/activiti-database/0.5.0-incubating-SNAPSHOT/activiti-database-0.5.0-incubating-20130720.005301-12.jar
Uploaded: https://repository.apache.org/content/repositories/snapshots/org/apache/provisionr/activiti-database/0.5.0-incubating-SNAPSHOT/activiti-database-0.5.0-incubating-20130720.005301-12.jar
(539 KB at 3169.7 KB/sec)
Uploading: https://repository.apache.org/content/repositories/snapshots/org/apache/provisionr/activiti-database/0.5.0-incubating-SNAPSHOT/activiti-database-0.5.0-incubating-20130720.005301-12.pom
Uploaded: https://repository.apache.org/content/repositories/snapshots/org/apache/provisionr/activiti-database/0.5.0-incubating-SNAPSHOT/activiti-database-0.5.0-incubating-20130720.005301-12.pom
(3 KB at 36.9 KB/sec)
Downloading: https://repository.apache.org/content/repositories/snapshots/org/apache/provisionr/activiti-database/maven-metadata.xml
Downloaded: https://repository.apache.org/content/repositories/snapshots/org/apache/provisionr/activiti-database/maven-metadata.xml
(309 B at 4.6 KB/sec)
Uploading: https://repository.apache.org/content/repositories/snapshots/org/apache/provisionr/activiti-database/0.5.0-incubating-SNAPSHOT/maven-metadata.xml
Uploaded: https://repository.apache.org/content/repositories/snapshots/org/apache/provisionr/activiti-database/0.5.0-incubating-SNAPSHOT/maven-metadata.xml
(2 KB at 12.8 KB/sec)
Uploading: https://repository.apache.org/content/repositories/snapshots/org/apache/provisionr/activiti-database/maven-metadata.xml
Uploaded: https://repository.apache.org/content/repositories/snapshots/org/apache/provisionr/activiti-database/maven-metadata.xml
(309 B at 2.6 KB/sec)
Deploying the main artifact activiti-database-0.5.0-incubating-SNAPSHOT-sources.jar
Uploading: https://repository.apache.org/content/repositories/snapshots/org/apache/provisionr/activiti-database/0.5.0-incubating-SNAPSHOT/activiti-database-0.5.0-incubating-20130720.005301-12-sources.jar
Uploaded: https://repository.apache.org/content/repositories/snapshots/org/apache/provisionr/activiti-database/0.5.0-incubating-SNAPSHOT/activiti-database-0.5.0-incubating-20130720.005301-12-sources.jar
(6 KB at 94.9 KB/sec)
Uploading: https://repository.apache.org/content/repositories/snapshots/org/apache/provisionr/activiti-database/0.5.0-incubating-SNAPSHOT/maven-metadata.xml
Uploaded: https://repository.apache.org/content/repositories/snapshots/org/apache/provisionr/activiti-database/0.5.0-incubating-SNAPSHOT/maven-metadata.xml
(2 KB at 19.7 KB/sec)
[INFO] Deployment in https://repository.apache.org/content/repositories/snapshots (id=apache.snapshots.https,uniqueVersion=true)
Deploying the main artifact activiti-karaf-commands-0.5.0-incubating-SNAPSHOT.jar
Downloading: https://repository.apache.org/content/repositories/snapshots/org/apache/provisionr/activiti-karaf-commands/0.5.0-incubating-SNAPSHOT/maven-metadata.xml
Downloaded: https://repository.apache.org/content/repositories/snapshots/org/apache/provisionr/activiti-karaf-commands/0.5.0-incubating-SNAPSHOT/maven-metadata.xml
(2 KB at 1.8 KB/sec)
Uploading: https://repository.apache.org/content/repositories/snapshots/org/apache/provisionr/activiti-karaf-commands/0.5.0-incubating-SNAPSHOT/activiti-karaf-commands-0.5.0-incubating-20130720.005302-12.jar
Uploaded: https://repository.apache.org/content/repositories/snapshots/org/apache/provisionr/activiti-karaf-commands/0.5.0-incubating-SNAPSHOT/activiti-karaf-commands-0.5.0-incubating-20130720.005302-12.jar
(48 KB at 666.2 KB/sec)
Uploading: https://repository.apache.org/content/repositories/snapshots/org/apache/provisionr/activiti-karaf-commands/0.5.0-incubating-SNAPSHOT/activiti-karaf-commands-0.5.0-incubating-20130720.005302-12.pom
Uploaded: https://repository.apache.org/content/repositories/snapshots/org/apache/provisionr/activiti-karaf-commands/0.5.0-incubating-SNAPSHOT/activiti-karaf-commands-0.5.0-incubating-20130720.005302-12.pom
(7 KB at 80.3 KB/sec)
Downloading: https://repository.apache.org/content/repositories/snapshots/org/apache/provisionr/activiti-karaf-commands/maven-metadata.xml
Downloaded: https://repository.apache.org/content/repositories/snapshots/org/apache/provisionr/activiti-karaf-commands/maven-metadata.xml
(315 B at 0.5 KB/sec)
Uploading: https://repository.apache.org/content/repositories/snapshots/org/apache/provisionr/activiti-karaf-commands/0.5.0-incubating-SNAPSHOT/maven-metadata.xml
Uploading: https://repository.apache.org/content/repositories/snapshots/org/apache/provisionr/activiti-karaf-commands/maven-metadata.xml
Uploaded: https://repository.apache.org/content/repositories/snapshots/org/apache/provisionr/activiti-karaf-commands/maven-metadata.xml
(315 B at 2.7 KB/sec)
ERROR: Failed to deploy metadata: Could not transfer metadata org.apache.provisionr:activiti-karaf-commands:0.5.0-incubating-SNAPSHOT/maven-metadata.xml
from/to apache.snapshots.https (https://repository.apache.org/content/repositories/snapshots):
The target server failed to respond
org.apache.maven.artifact.deployer.ArtifactDeploymentException: Failed to deploy metadata:
Could not transfer metadata org.apache.provisionr:activiti-karaf-commands:0.5.0-incubating-SNAPSHOT/maven-metadata.xml
from/to apache.snapshots.https (https://repository.apache.org/content/repositories/snapshots):
The target server failed to respond
	at org.apache.maven.artifact.deployer.DefaultArtifactDeployer.deploy(DefaultArtifactDeployer.java:141)
	at hudson.maven.reporters.MavenArtifactRecord.deploy(MavenArtifactRecord.java:190)
	at hudson.maven.RedeployPublisher.perform(RedeployPublisher.java:176)
	at hudson.tasks.BuildStepMonitor$1.perform(BuildStepMonitor.java:19)
	at hudson.model.AbstractBuild$AbstractBuildExecution.perform(AbstractBuild.java:810)
	at hudson.model.AbstractBuild$AbstractBuildExecution.performAllBuildSteps(AbstractBuild.java:785)
	at hudson.maven.MavenModuleSetBuild$MavenModuleSetBuildExecution.post2(MavenModuleSetBuild.java:946)
	at hudson.model.AbstractBuild$AbstractBuildExecution.post(AbstractBuild.java:732)
	at hudson.model.Run.execute(Run.java:1593)
	at hudson.maven.MavenModuleSetBuild.run(MavenModuleSetBuild.java:477)
	at hudson.model.ResourceController.execute(ResourceController.java:88)
	at hudson.model.Executor.run(Executor.java:236)
Caused by: org.sonatype.aether.deployment.DeploymentException: Failed to deploy metadata:
Could not transfer metadata org.apache.provisionr:activiti-karaf-commands:0.5.0-incubating-SNAPSHOT/maven-metadata.xml
from/to apache.snapshots.https (https://repository.apache.org/content/repositories/snapshots):
The target server failed to respond
	at org.sonatype.aether.impl.internal.DefaultDeployer.deploy(DefaultDeployer.java:311)
	at org.sonatype.aether.impl.internal.DefaultDeployer.deploy(DefaultDeployer.java:211)
	at org.sonatype.aether.impl.internal.DefaultRepositorySystem.deploy(DefaultRepositorySystem.java:443)
	at org.apache.maven.artifact.deployer.DefaultArtifactDeployer.deploy(DefaultArtifactDeployer.java:137)
	... 11 more
Caused by: org.sonatype.aether.transfer.MetadataTransferException: Could not transfer metadata
org.apache.provisionr:activiti-karaf-commands:0.5.0-incubating-SNAPSHOT/maven-metadata.xml
from/to apache.snapshots.https (https://repository.apache.org/content/repositories/snapshots):
The target server failed to respond
	at org.sonatype.aether.connector.wagon.WagonRepositoryConnector$3.wrap(WagonRepositoryConnector.java:930)
	at org.sonatype.aether.connector.wagon.WagonRepositoryConnector$3.wrap(WagonRepositoryConnector.java:920)
	at org.sonatype.aether.connector.wagon.WagonRepositoryConnector$PutTask.run(WagonRepositoryConnector.java:837)
	at org.sonatype.aether.connector.wagon.WagonRepositoryConnector.put(WagonRepositoryConnector.java:475)
	at org.sonatype.aether.impl.internal.DefaultDeployer.deploy(DefaultDeployer.java:305)
	... 14 more
Caused by: org.apache.maven.wagon.TransferFailedException: The target server failed to respond
	at org.apache.maven.wagon.shared.http4.AbstractHttpClientWagon.put(AbstractHttpClientWagon.java:567)
	at org.apache.maven.wagon.shared.http4.AbstractHttpClientWagon.put(AbstractHttpClientWagon.java:509)
	at org.apache.maven.wagon.shared.http4.AbstractHttpClientWagon.put(AbstractHttpClientWagon.java:490)
	at org.apache.maven.wagon.shared.http4.AbstractHttpClientWagon.put(AbstractHttpClientWagon.java:470)
	at org.sonatype.aether.connector.wagon.WagonRepositoryConnector$PutTask.run(WagonRepositoryConnector.java:811)
	... 16 more
Caused by: org.apache.maven.wagon.providers.http.httpclient.NoHttpResponseException: The target
server failed to respond
	at org.apache.maven.wagon.providers.http.httpclient.impl.conn.DefaultHttpResponseParser.parseHead(DefaultHttpResponseParser.java:95)
	at org.apache.maven.wagon.providers.http.httpclient.impl.conn.DefaultHttpResponseParser.parseHead(DefaultHttpResponseParser.java:62)
	at org.apache.maven.wagon.providers.http.httpclient.impl.io.AbstractMessageParser.parse(AbstractMessageParser.java:254)
	at org.apache.maven.wagon.providers.http.httpclient.impl.AbstractHttpClientConnection.receiveResponseHeader(AbstractHttpClientConnection.java:289)
	at org.apache.maven.wagon.providers.http.httpclient.impl.conn.DefaultClientConnection.receiveResponseHeader(DefaultClientConnection.java:252)
	at org.apache.maven.wagon.providers.http.httpclient.impl.conn.AbstractClientConnAdapter.receiveResponseHeader(AbstractClientConnAdapter.java:219)
	at org.apache.maven.wagon.providers.http.httpclient.protocol.HttpRequestExecutor.doReceiveResponse(HttpRequestExecutor.java:300)
	at org.apache.maven.wagon.providers.http.httpclient.protocol.HttpRequestExecutor.execute(HttpRequestExecutor.java:127)
	at org.apache.maven.wagon.providers.http.httpclient.impl.client.DefaultRequestDirector.tryExecute(DefaultRequestDirector.java:712)
	at org.apache.maven.wagon.providers.http.httpclient.impl.client.DefaultRequestDirector.execute(DefaultRequestDirector.java:517)
	at org.apache.maven.wagon.providers.http.httpclient.impl.client.AbstractHttpClient.execute(AbstractHttpClient.java:906)
	at org.apache.maven.wagon.providers.http.httpclient.impl.client.AbstractHttpClient.execute(AbstractHttpClient.java:805)
	at org.apache.maven.wagon.shared.http4.AbstractHttpClientWagon.execute(AbstractHttpClientWagon.java:733)
	at org.apache.maven.wagon.shared.http4.AbstractHttpClientWagon.put(AbstractHttpClientWagon.java:561)
	... 20 more
[INFO] Deployment failed after 8.6 sec
Build step 'Deploy artifacts to Maven repository' changed build result to FAILURE

Mime
View raw message