polygene-dev mailing list archives

Site index · List index
Message view « Date » · « Thread »
Top « Date » · « Thread »
From Apache Jenkins Server <jenk...@builds.apache.org>
Subject Build failed in Jenkins: Polygene-develop-java8-check #451
Date Sun, 06 May 2018 14:39:09 GMT
See <https://builds.apache.org/job/Polygene-develop-java8-check/451/display/redirect?page=changes>

Changes:

[niclas] POLYGENE-253 - The problem with the default method interception on Java

------------------------------------------
[...truncated 561.56 KB...]
| | |   +-- graceful-fs@4.1.11  deduped
| | |   +-- pify@2.3.0  deduped
| | |   +-- pinkie-promise@2.0.1  deduped
| | |   +-- strip-bom@2.0.0  deduped
| | |   +-- strip-bom-stream@2.0.0 
| | |   | +-- first-chunk-stream@2.0.0 
| | |   | | `-- readable-stream@2.3.6  deduped
| | |   | `-- strip-bom@2.0.0  deduped
| | |   `-- vinyl@1.2.0  deduped
| | +-- text-table@0.2.0  deduped
| | `-- untildify@2.1.0 
| |   `-- os-homedir@1.0.2  deduped
| +-- yeoman-generator@1.1.1  extraneous
| +-- yeoman-test@1.7.0 
| | +-- inquirer@3.3.0 
| | | +-- ansi-escapes@3.1.0 
| | | +-- chalk@2.4.1 
| | | | +-- ansi-styles@3.2.1 
| | | | | `-- color-convert@1.9.1 
| | | | |   `-- color-name@1.1.3 
| | | | +-- escape-string-regexp@1.0.5  deduped
| | | | `-- supports-color@5.4.0 
| | | |   `-- has-flag@3.0.0 
| | | +-- cli-cursor@2.1.0 
| | | | `-- restore-cursor@2.0.0 
| | | |   +-- onetime@2.0.1 
| | | |   | `-- mimic-fn@1.2.0 
| | | |   `-- signal-exit@3.0.2  deduped
| | | +-- cli-width@2.2.0  deduped
| | | +-- external-editor@2.2.0 
| | | | +-- chardet@0.4.2 
| | | | +-- iconv-lite@0.4.22 
| | | | | `-- safer-buffer@2.1.2 
| | | | `-- tmp@0.0.33 
| | | |   `-- os-tmpdir@1.0.2  deduped
| | | +-- figures@2.0.0 
| | | | `-- escape-string-regexp@1.0.5  deduped
| | | +-- lodash@4.17.10  deduped
| | | +-- mute-stream@0.0.7 
| | | +-- run-async@2.3.0  deduped
| | | +-- rx-lite@4.0.8 
| | | +-- rx-lite-aggregates@4.0.8 
| | | | `-- rx-lite@4.0.8  deduped
| | | +-- string-width@2.1.1 
| | | | +-- is-fullwidth-code-point@2.0.0 
| | | | `-- strip-ansi@4.0.0  deduped
| | | +-- strip-ansi@4.0.0 
| | | | `-- ansi-regex@3.0.0 
| | | `-- through@2.3.8  deduped
| | +-- lodash@4.17.10  deduped
| | +-- mkdirp@0.5.1  deduped
| | +-- pinkie-promise@2.0.1  deduped
| | +-- rimraf@2.6.2  deduped
| | +-- sinon@2.4.1 
| | | +-- diff@3.5.0 
| | | +-- formatio@1.2.0 
| | | | `-- samsam@1.3.0  deduped
| | | +-- lolex@1.6.0 
| | | +-- native-promise-only@0.8.1 
| | | +-- path-to-regexp@1.7.0 
| | | | `-- isarray@0.0.1 
| | | +-- samsam@1.3.0 
| | | +-- text-encoding@0.6.4 
| | | `-- type-detect@4.0.8 
| | `-- yeoman-environment@2.0.6 
| |   +-- chalk@2.4.1 
| |   | +-- ansi-styles@3.2.1  deduped
| |   | +-- escape-string-regexp@1.0.5  deduped
| |   | `-- supports-color@5.4.0  deduped
| |   +-- debug@3.1.0 
| |   | `-- ms@2.0.0  deduped
| |   +-- diff@3.5.0 
| |   +-- escape-string-regexp@1.0.5  deduped
| |   +-- globby@6.1.0 
| |   | +-- array-union@1.0.2  deduped
| |   | +-- glob@7.1.2  deduped
| |   | +-- object-assign@4.1.1 
| |   | +-- pify@2.3.0  deduped
| |   | `-- pinkie-promise@2.0.1  deduped
| |   +-- grouped-queue@0.3.3  deduped
| |   +-- inquirer@3.3.0  deduped
| |   +-- is-scoped@1.0.0 
| |   | `-- scoped-regex@1.0.0 
| |   +-- lodash@4.17.10  deduped
| |   +-- log-symbols@2.2.0 
| |   | `-- chalk@2.4.1 
| |   |   +-- ansi-styles@3.2.1  deduped
| |   |   +-- escape-string-regexp@1.0.5  deduped
| |   |   `-- supports-color@5.4.0  deduped
| |   +-- mem-fs@1.1.3  deduped
| |   +-- text-table@0.2.0  deduped
| |   `-- untildify@3.0.2 
| `-- yeoman-welcome@1.0.1 
|   `-- chalk@1.1.3  deduped
`-- yeoman-test@1.6.0 
  +-- inquirer@1.2.3 
  | +-- ansi-escapes@1.4.0 
  | +-- chalk@1.1.3  deduped
  | +-- cli-cursor@1.0.2 
  | | `-- restore-cursor@1.0.1 
  | |   +-- exit-hook@1.1.1 
  | |   `-- onetime@1.1.0 
  | +-- cli-width@2.2.0 
  | +-- external-editor@1.1.1 
  | | +-- extend@3.0.1 
  | | +-- spawn-sync@1.0.15 
  | | | +-- concat-stream@1.6.2 
  | | | | +-- buffer-from@1.0.0 
  | | | | +-- inherits@2.0.3  deduped
  | | | | +-- readable-stream@2.3.6  deduped
  | | | | `-- typedarray@0.0.6 
  | | | `-- os-shim@0.1.3 
  | | `-- tmp@0.0.29 
  | |   `-- os-tmpdir@1.0.2 
  | +-- figures@1.7.0 
  | | +-- escape-string-regexp@1.0.5  deduped
  | | `-- object-assign@4.1.1 
  | +-- lodash@4.17.10  deduped
  | +-- mute-stream@0.0.6 
  | +-- pinkie-promise@2.0.1  deduped
  | +-- run-async@2.3.0  deduped
  | +-- rx@4.1.0 
  | +-- string-width@1.0.2 
  | | +-- code-point-at@1.1.0 
  | | +-- is-fullwidth-code-point@1.0.0 
  | | | `-- number-is-nan@1.0.1  deduped
  | | `-- strip-ansi@3.0.1  deduped
  | +-- strip-ansi@3.0.1  deduped
  | `-- through@2.3.8 
  +-- lodash@4.17.10  deduped
  +-- mkdirp@0.5.1  deduped
  +-- pinkie-promise@2.0.1 
  | `-- pinkie@2.0.4 
  +-- rimraf@2.6.2  deduped
  +-- sinon@1.17.7 
  | +-- formatio@1.1.1 
  | | `-- samsam@1.1.2  deduped
  | +-- lolex@1.3.2 
  | +-- samsam@1.1.2 
  | `-- util@0.10.3  deduped
  +-- yeoman-environment@1.6.6  deduped
  `-- yeoman-generator@0.24.1  deduped

:tools:generator-polygene:prepareTemplateGradleWrapper
:tools:generator-polygene:setsCurrentVersionToPackageJson
:tools:model-detail:honkerCheck
:tools:model-detail:check
:tutorials:cargo:check
:tutorials:composites:check
:tutorials:hello:check
:tutorials:introduction:check UP-TO-DATE
:tutorials:services:check
:tutorials:introduction:tenminutes:check UP-TO-DATE
:tutorials:introduction:thirtyminutes:check UP-TO-DATE
:tutorials:introduction:twominutes:check UP-TO-DATE

FAILURE: Build completed with 8 failures.

1: Task failed with an exception.
-----------
* What went wrong:
Execution failed for task ':extensions:entitystore-sql:test'.
> There were failing tests. See the report at: file://<https://builds.apache.org/job/Polygene-develop-java8-check/ws/extensions/entitystore-sql/build/reports/tests/test/index.html>

* Try:
Run with --stacktrace option to get the stack trace. Run with --info or --debug option to
get more log output. Run with --scan to get full insights.
==============================================================================

2: Task failed with an exception.
-----------
* What went wrong:
Execution failed for task ':extensions:entitystore-sqlkv:test'.
> There were failing tests. See the report at: file://<https://builds.apache.org/job/Polygene-develop-java8-check/ws/extensions/entitystore-sqlkv/build/reports/tests/test/index.html>

* Try:
Run with --stacktrace option to get the stack trace. Run with --info or --debug option to
get more log output. Run with --scan to get full insights.
==============================================================================

3: Task failed with an exception.
-----------
* What went wrong:
Execution failed for task ':extensions:entitystore-zookeeper:test'.
> There were failing tests. See the report at: file://<https://builds.apache.org/job/Polygene-develop-java8-check/ws/extensions/entitystore-zookeeper/build/reports/tests/test/index.html>

* Try:
Run with --stacktrace option to get the stack trace. Run with --info or --debug option to
get more log output. Run with --scan to get full insights.
==============================================================================

4: Task failed with an exception.
-----------
* What went wrong:
Execution failed for task ':extensions:indexing-sql:test'.
> There were failing tests. See the report at: file://<https://builds.apache.org/job/Polygene-develop-java8-check/ws/extensions/indexing-sql/build/reports/tests/test/index.html>

* Try:
Run with --stacktrace option to get the stack trace. Run with --info or --debug option to
get more log output. Run with --scan to get full insights.
==============================================================================

5: Task failed with an exception.
-----------
* What went wrong:
Execution failed for task ':libraries:execution:test'.
> There were failing tests. See the report at: file://<https://builds.apache.org/job/Polygene-develop-java8-check/ws/libraries/execution/build/reports/tests/test/index.html>

* Try:
Run with --stacktrace option to get the stack trace. Run with --info or --debug option to
get more log output. Run with --scan to get full insights.
==============================================================================

6: Task failed with an exception.
-----------
* What went wrong:
Execution failed for task ':reports:javadocs'.
> Javadoc generation failed. Generated Javadoc options file (useful for troubleshooting):
'<https://builds.apache.org/job/Polygene-develop-java8-check/ws/reports/build/tmp/javadocs/javadoc.options'>

* Try:
Run with --stacktrace option to get the stack trace. Run with --info or --debug option to
get more log output. Run with --scan to get full insights.
==============================================================================

7: Task failed with an exception.
-----------
* What went wrong:
Execution failed for task ':extensions:entitystore-sql:javadoc'.
> Javadoc generation failed. Generated Javadoc options file (useful for troubleshooting):
'<https://builds.apache.org/job/Polygene-develop-java8-check/ws/extensions/entitystore-sql/build/tmp/javadoc/javadoc.options'>

* Try:
Run with --stacktrace option to get the stack trace. Run with --info or --debug option to
get more log output. Run with --scan to get full insights.
==============================================================================

8: Task failed with an exception.
-----------
* What went wrong:
Execution failed for task ':extensions:entitystore-zookeeper:javadoc'.
> Javadoc generation failed. Generated Javadoc options file (useful for troubleshooting):
'<https://builds.apache.org/job/Polygene-develop-java8-check/ws/extensions/entitystore-zookeeper/build/tmp/javadoc/javadoc.options'>

* Try:
Run with --stacktrace option to get the stack trace. Run with --info or --debug option to
get more log output. Run with --scan to get full insights.
==============================================================================

* Get more help at https://help.gradle.org

Deprecated Gradle features were used in this build, making it incompatible with Gradle 5.0.
See https://docs.gradle.org/4.6/userguide/command_line_interface.html#sec:command_line_warnings

BUILD FAILED in 44m 4s
1243 actionable tasks: 1159 executed, 84 up-to-date
Build step 'Invoke Gradle script' changed build result to FAILURE
Build step 'Invoke Gradle script' marked build as failure
Recording test results
Not sending mail to unregistered user tibor.mlynarik@adleritech.com

Mime
View raw message