polygene-dev mailing list archives

Site index · List index
Message view « Date » · « Thread »
Top « Date » · « Thread »
From Apache Jenkins Server <jenk...@builds.apache.org>
Subject Build failed in Jenkins: Polygene-develop-java9-check #245
Date Thu, 19 Apr 2018 04:58:20 GMT
See <https://builds.apache.org/job/Polygene-develop-java9-check/245/display/redirect?page=changes>

Changes:

[niclas] POLYGENE-121 : Validated that reporting is correct and the issue can be

[niclas] Must have messed up the Docker image generation somehow, and I have no

------------------------------------------
[...truncated 807.74 KB...]
:libraries:uid:testSourceJar
:libraries:uid:signArchives SKIPPED
:libraries:uid:uploadStageArchivesCould not find metadata org.apache.polygene.libraries:org.apache.polygene.library.uid:3.1.0-SNAPSHOT/maven-metadata.xml
in remote (file://<https://builds.apache.org/job/Polygene-develop-java9-check/ws/libraries/uid/build/stage/archives)>
Could not find metadata org.apache.polygene.libraries:org.apache.polygene.library.uid/maven-metadata.xml
in remote (file://<https://builds.apache.org/job/Polygene-develop-java9-check/ws/libraries/uid/build/stage/archives)>

:libraries:uowfile:osgiClasses
:libraries:uowfile:processVersionResources NO-SOURCE
:libraries:uowfile:versionClasses
:libraries:uowfile:jar
:libraries:uowfile:javadoc<https://builds.apache.org/job/Polygene-develop-java9-check/ws/libraries/uowfile/src/main/java/org/apache/polygene/library/uowfile/plural/HasUoWFiles.java>:38:
warning: no @param for key
    File attachedFile( T key );
         ^
<https://builds.apache.org/job/Polygene-develop-java9-check/ws/libraries/uowfile/src/main/java/org/apache/polygene/library/uowfile/plural/HasUoWFiles.java>:38:
warning: no @return
    File attachedFile( T key );
         ^
<https://builds.apache.org/job/Polygene-develop-java9-check/ws/libraries/uowfile/src/main/java/org/apache/polygene/library/uowfile/plural/HasUoWFiles.java>:43:
warning: no @return
    Iterable<File> attachedFiles();
                   ^

3 warnings
:libraries:uowfile:javadocJar
:libraries:uowfile:sourceJar
:libraries:uowfile:testSourceJar
:libraries:uowfile:signArchives SKIPPED
:libraries:uowfile:uploadStageArchivesCould not find metadata org.apache.polygene.libraries:org.apache.polygene.library.uowfile:3.1.0-SNAPSHOT/maven-metadata.xml
in remote (file://<https://builds.apache.org/job/Polygene-develop-java9-check/ws/libraries/uowfile/build/stage/archives)>
Could not find metadata org.apache.polygene.libraries:org.apache.polygene.library.uowfile/maven-metadata.xml
in remote (file://<https://builds.apache.org/job/Polygene-develop-java9-check/ws/libraries/uowfile/build/stage/archives)>

:tools:envisage:osgiClasses
:tools:envisage:processVersionResources NO-SOURCE
:tools:envisage:versionClasses
:tools:envisage:jar
:tools:envisage:javadoc
:tools:envisage:javadocJar
:tools:envisage:sourceJar
:tools:envisage:testSourceJar
:tools:envisage:signArchives SKIPPED
:tools:envisage:uploadStageArchivesCould not find metadata org.apache.polygene.tools:org.apache.polygene.tool.envisage:3.1.0-SNAPSHOT/maven-metadata.xml
in remote (file://<https://builds.apache.org/job/Polygene-develop-java9-check/ws/tools/envisage/build/stage/archives)>
Could not find metadata org.apache.polygene.tools:org.apache.polygene.tool.envisage/maven-metadata.xml
in remote (file://<https://builds.apache.org/job/Polygene-develop-java9-check/ws/tools/envisage/build/stage/archives)>

:tools:model-detail:javadoc
:tools:model-detail:javadocJar
:tools:model-detail:sourceJar
:tools:model-detail:testSourceJar
:tools:model-detail:signArchives SKIPPED
:tools:model-detail:uploadStageArchivesCould not find metadata org.apache.polygene.tools:org.apache.polygene.tool.model-detail:3.1.0-SNAPSHOT/maven-metadata.xml
in remote (file://<https://builds.apache.org/job/Polygene-develop-java9-check/ws/tools/model-detail/build/stage/archives)>
Could not find metadata org.apache.polygene.tools:org.apache.polygene.tool.model-detail/maven-metadata.xml
in remote (file://<https://builds.apache.org/job/Polygene-develop-java9-check/ws/tools/model-detail/build/stage/archives)>

:tools:generator-polygene:nodeSetup
Download https://nodejs.org/dist/v6.10.2/node-v6.10.2-linux-x64.tar.gz
:tools:generator-polygene:npmSetup
<https://builds.apache.org/job/Polygene-develop-java9-check/ws/tools/generator-polygene/.gradle/npm/npm-v4.4.4/bin/npm>
-> <https://builds.apache.org/job/Polygene-develop-java9-check/ws/tools/generator-polygene/.gradle/npm/npm-v4.4.4/lib/node_modules/npm/bin/npm-cli.js>
<https://builds.apache.org/job/Polygene-develop-java9-check/ws/tools/generator-polygene/.gradle/npm/npm-v4.4.4/lib>
`-- npm@4.4.4 

:tools:generator-polygene:npmInstall
generator-polygene@3.0.0 <https://builds.apache.org/job/Polygene-develop-java9-check/ws/tools/generator-polygene>
`-- yeoman-generator@0.24.1
  `-- yeoman-test@1.7.0
    `-- yeoman-generator@1.1.1 
      +-- chalk@1.1.3 
      | +-- ansi-styles@2.2.1 
      | +-- strip-ansi@3.0.1 
      | | `-- ansi-regex@2.1.1 
      | `-- supports-color@2.0.0 
      +-- cross-spawn@5.1.0 
      +-- dargs@5.1.0 
      +-- dateformat@2.2.0 
      +-- debug@2.6.9 
      +-- find-up@2.1.0 
      +-- github-username@3.0.0 
      +-- mem-fs-editor@3.0.2 
      +-- path-exists@3.0.0 
      +-- pretty-bytes@4.0.2 
      +-- read-chunk@2.1.0 
      | `-- pify@3.0.0 
      +-- read-pkg-up@2.0.0 
      | `-- find-up@2.1.0  deduped
      `-- yeoman-environment@1.6.6 
        +-- chalk@1.1.3  deduped
        +-- debug@2.6.9  deduped
        +-- diff@2.2.3 
        +-- globby@4.1.0 
        | +-- glob@6.0.4 
        | `-- pify@2.3.0 
        +-- inquirer@1.2.3 
        | +-- ansi-escapes@1.4.0 
        | +-- chalk@1.1.3  deduped
        | +-- cli-cursor@1.0.2 
        | | `-- restore-cursor@1.0.1 
        | |   `-- onetime@1.1.0 
        | +-- external-editor@1.1.1 
        | | `-- tmp@0.0.29 
        | +-- figures@1.7.0 
        | +-- mute-stream@0.0.6 
        | +-- string-width@1.0.2 
        | | +-- is-fullwidth-code-point@1.0.0 
        | | `-- strip-ansi@3.0.1  deduped
        | `-- strip-ansi@3.0.1  deduped
        +-- log-symbols@1.0.2 
        | `-- chalk@1.1.3  deduped
        `-- untildify@2.1.0 

:tools:generator-polygene:prepareTemplateGradleWrapper
:tools:generator-polygene:setsCurrentVersionToPackageJson
:tools:model-detail:honkerCheck
:tools:model-detail:check
:tutorials:cargo:check
:tutorials:composites:check
:tutorials:hello:check
:tutorials:introduction:check UP-TO-DATE
:tutorials:services:check
:tutorials:introduction:tenminutes:check UP-TO-DATE
:tutorials:introduction:thirtyminutes:check UP-TO-DATE
:tutorials:introduction:twominutes:check UP-TO-DATE

FAILURE: Build completed with 12 failures.

1: Task failed with an exception.
-----------
* What went wrong:
Execution failed for task ':core:bootstrap:test'.
> There were failing tests. See the report at: file://<https://builds.apache.org/job/Polygene-develop-java9-check/ws/core/bootstrap/build/reports/tests/test/index.html>

* Try:
Run with --stacktrace option to get the stack trace. Run with --info or --debug option to
get more log output. Run with --scan to get full insights.
==============================================================================

2: Task failed with an exception.
-----------
* What went wrong:
Execution failed for task ':core:runtime:test'.
> There were failing tests. See the report at: file://<https://builds.apache.org/job/Polygene-develop-java9-check/ws/core/runtime/build/reports/tests/test/index.html>

* Try:
Run with --stacktrace option to get the stack trace. Run with --info or --debug option to
get more log output. Run with --scan to get full insights.
==============================================================================

3: Task failed with an exception.
-----------
* What went wrong:
Execution failed for task ':extensions:entitystore-jclouds:test'.
> There were failing tests. See the report at: file://<https://builds.apache.org/job/Polygene-develop-java9-check/ws/extensions/entitystore-jclouds/build/reports/tests/test/index.html>

* Try:
Run with --stacktrace option to get the stack trace. Run with --info or --debug option to
get more log output. Run with --scan to get full insights.
==============================================================================

4: Task failed with an exception.
-----------
* What went wrong:
Execution failed for task ':extensions:entitystore-leveldb:test'.
> There were failing tests. See the report at: file://<https://builds.apache.org/job/Polygene-develop-java9-check/ws/extensions/entitystore-leveldb/build/reports/tests/test/index.html>

* Try:
Run with --stacktrace option to get the stack trace. Run with --info or --debug option to
get more log output. Run with --scan to get full insights.
==============================================================================

5: Task failed with an exception.
-----------
* What went wrong:
Execution failed for task ':extensions:entitystore-riak:test'.
> There were failing tests. See the report at: file://<https://builds.apache.org/job/Polygene-develop-java9-check/ws/extensions/entitystore-riak/build/reports/tests/test/index.html>

* Try:
Run with --stacktrace option to get the stack trace. Run with --info or --debug option to
get more log output. Run with --scan to get full insights.
==============================================================================

6: Task failed with an exception.
-----------
* What went wrong:
Execution failed for task ':extensions:entitystore-sql:test'.
> There were failing tests. See the report at: file://<https://builds.apache.org/job/Polygene-develop-java9-check/ws/extensions/entitystore-sql/build/reports/tests/test/index.html>

* Try:
Run with --stacktrace option to get the stack trace. Run with --info or --debug option to
get more log output. Run with --scan to get full insights.
==============================================================================

7: Task failed with an exception.
-----------
* What went wrong:
Execution failed for task ':extensions:entitystore-sqlkv:test'.
> There were failing tests. See the report at: file://<https://builds.apache.org/job/Polygene-develop-java9-check/ws/extensions/entitystore-sqlkv/build/reports/tests/test/index.html>

* Try:
Run with --stacktrace option to get the stack trace. Run with --info or --debug option to
get more log output. Run with --scan to get full insights.
==============================================================================

8: Task failed with an exception.
-----------
* What went wrong:
Execution failed for task ':extensions:indexing-sql:test'.
> There were failing tests. See the report at: file://<https://builds.apache.org/job/Polygene-develop-java9-check/ws/extensions/indexing-sql/build/reports/tests/test/index.html>

* Try:
Run with --stacktrace option to get the stack trace. Run with --info or --debug option to
get more log output. Run with --scan to get full insights.
==============================================================================

9: Task failed with an exception.
-----------
* What went wrong:
Execution failed for task ':extensions:serialization-javaxxml:compileJava'.
> Compilation failed; see the compiler error output for details.

* Try:
Run with --stacktrace option to get the stack trace. Run with --info or --debug option to
get more log output. Run with --scan to get full insights.
==============================================================================

10: Task failed with an exception.
-----------
* What went wrong:
Execution failed for task ':reports:javadocs'.
> Javadoc generation failed. Generated Javadoc options file (useful for troubleshooting):
'<https://builds.apache.org/job/Polygene-develop-java9-check/ws/reports/build/tmp/javadocs/javadoc.options'>

* Try:
Run with --stacktrace option to get the stack trace. Run with --info or --debug option to
get more log output. Run with --scan to get full insights.
==============================================================================

11: Task failed with an exception.
-----------
* What went wrong:
Execution failed for task ':core:runtime:javadoc'.
> Javadoc generation failed. Generated Javadoc options file (useful for troubleshooting):
'<https://builds.apache.org/job/Polygene-develop-java9-check/ws/core/runtime/build/tmp/javadoc/javadoc.options'>

* Try:
Run with --stacktrace option to get the stack trace. Run with --info or --debug option to
get more log output. Run with --scan to get full insights.
==============================================================================

12: Task failed with an exception.
-----------
* What went wrong:
Execution failed for task ':extensions:entitystore-sql:javadoc'.
> Javadoc generation failed. Generated Javadoc options file (useful for troubleshooting):
'<https://builds.apache.org/job/Polygene-develop-java9-check/ws/extensions/entitystore-sql/build/tmp/javadoc/javadoc.options'>

* Try:
Run with --stacktrace option to get the stack trace. Run with --info or --debug option to
get more log output. Run with --scan to get full insights.
==============================================================================

* Get more help at https://help.gradle.org

Deprecated Gradle features were used in this build, making it incompatible with Gradle 5.0.
See https://docs.gradle.org/4.6/userguide/command_line_interface.html#sec:command_line_warnings

BUILD FAILED in 43m 52s
1197 actionable tasks: 1194 executed, 3 up-to-date
Build step 'Invoke Gradle script' changed build result to FAILURE
Build step 'Invoke Gradle script' marked build as failure
Recording test results
Not sending mail to unregistered user github@alasdairhodge.co.uk
Not sending mail to unregistered user tibor.mlynarik@apache.org

Mime
View raw message