polygene-dev mailing list archives

Site index · List index
Message view « Date » · « Thread »
Top « Date » · « Thread »
From Apache Jenkins Server <jenk...@builds.apache.org>
Subject Build failed in Jenkins: Polygene-develop-java9-check #244
Date Thu, 19 Apr 2018 04:14:01 GMT
See <https://builds.apache.org/job/Polygene-develop-java9-check/244/display/redirect?page=changes>

Changes:

[niclas] POLYGENE-122 : Adding name to Null constraint on set() method on

------------------------------------------
[...truncated 903.31 KB...]
<https://builds.apache.org/job/Polygene-develop-java9-check/ws/libraries/sql-generator/src/main/java/org/apache/polygene/library/sql/generator/grammar/builders/query/QuerySpecificationBuilder.java>:93:
warning: no @param for builder
    QuerySpecificationBuilder setSelect( ColumnsBuilder builder );
                              ^
<https://builds.apache.org/job/Polygene-develop-java9-check/ws/libraries/sql-generator/src/main/java/org/apache/polygene/library/sql/generator/grammar/builders/query/QuerySpecificationBuilder.java>:100:
warning: no @param for builder
    QuerySpecificationBuilder setFrom( FromBuilder builder );
                              ^
<https://builds.apache.org/job/Polygene-develop-java9-check/ws/libraries/sql-generator/src/main/java/org/apache/polygene/library/sql/generator/grammar/builders/query/QuerySpecificationBuilder.java>:107:
warning: no @param for builder
    QuerySpecificationBuilder setWhere( BooleanBuilder builder );
                              ^
<https://builds.apache.org/job/Polygene-develop-java9-check/ws/libraries/sql-generator/src/main/java/org/apache/polygene/library/sql/generator/grammar/builders/query/QuerySpecificationBuilder.java>:114:
warning: no @param for builder
    QuerySpecificationBuilder setGroupBy( GroupByBuilder builder );
                              ^
<https://builds.apache.org/job/Polygene-develop-java9-check/ws/libraries/sql-generator/src/main/java/org/apache/polygene/library/sql/generator/grammar/builders/query/QuerySpecificationBuilder.java>:121:
warning: no @param for builder
    QuerySpecificationBuilder setHaving( BooleanBuilder builder );
                              ^
<https://builds.apache.org/job/Polygene-develop-java9-check/ws/libraries/sql-generator/src/main/java/org/apache/polygene/library/sql/generator/grammar/builders/query/QuerySpecificationBuilder.java>:128:
warning: no @param for builder
    QuerySpecificationBuilder setOrderBy( OrderByBuilder builder );
                              ^

9 warnings
:libraries:sql-generator:javadocJar
:libraries:sql-generator:sourceJar
:libraries:sql-generator:testSourceJar
:libraries:sql-generator:signArchives SKIPPED
:libraries:sql-generator:uploadStageArchivesCould not find metadata org.apache.polygene.libraries:org.apache.polygene.library.sql-generator:3.1.0-SNAPSHOT/maven-metadata.xml
in remote (file://<https://builds.apache.org/job/Polygene-develop-java9-check/ws/libraries/sql-generator/build/stage/archives)>
Could not find metadata org.apache.polygene.libraries:org.apache.polygene.library.sql-generator/maven-metadata.xml
in remote (file://<https://builds.apache.org/job/Polygene-develop-java9-check/ws/libraries/sql-generator/build/stage/archives)>

:libraries:sql-liquibase:javadoc
:libraries:sql-liquibase:javadocJar
:libraries:sql-liquibase:sourceJar
:libraries:sql-liquibase:testSourceJar
:libraries:sql-liquibase:signArchives SKIPPED
:libraries:sql-liquibase:uploadStageArchivesCould not find metadata org.apache.polygene.libraries:org.apache.polygene.library.sql-liquibase:3.1.0-SNAPSHOT/maven-metadata.xml
in remote (file://<https://builds.apache.org/job/Polygene-develop-java9-check/ws/libraries/sql-liquibase/build/stage/archives)>
Could not find metadata org.apache.polygene.libraries:org.apache.polygene.library.sql-liquibase/maven-metadata.xml
in remote (file://<https://builds.apache.org/job/Polygene-develop-java9-check/ws/libraries/sql-liquibase/build/stage/archives)>

:libraries:uid:osgiClasses
:libraries:uid:processVersionResources NO-SOURCE
:libraries:uid:versionClasses
:libraries:uid:jar
:libraries:uid:javadoc
:libraries:uid:javadocJar
:libraries:uid:sourceJar
:libraries:uid:testSourceJar
:libraries:uid:signArchives SKIPPED
:libraries:uid:uploadStageArchivesCould not find metadata org.apache.polygene.libraries:org.apache.polygene.library.uid:3.1.0-SNAPSHOT/maven-metadata.xml
in remote (file://<https://builds.apache.org/job/Polygene-develop-java9-check/ws/libraries/uid/build/stage/archives)>
Could not find metadata org.apache.polygene.libraries:org.apache.polygene.library.uid/maven-metadata.xml
in remote (file://<https://builds.apache.org/job/Polygene-develop-java9-check/ws/libraries/uid/build/stage/archives)>

:libraries:uowfile:osgiClasses
:libraries:uowfile:processVersionResources NO-SOURCE
:libraries:uowfile:versionClasses
:libraries:uowfile:jar
:libraries:uowfile:javadoc<https://builds.apache.org/job/Polygene-develop-java9-check/ws/libraries/uowfile/src/main/java/org/apache/polygene/library/uowfile/plural/HasUoWFiles.java>:38:
warning: no @param for key
    File attachedFile( T key );
         ^
<https://builds.apache.org/job/Polygene-develop-java9-check/ws/libraries/uowfile/src/main/java/org/apache/polygene/library/uowfile/plural/HasUoWFiles.java>:38:
warning: no @return
    File attachedFile( T key );
         ^
<https://builds.apache.org/job/Polygene-develop-java9-check/ws/libraries/uowfile/src/main/java/org/apache/polygene/library/uowfile/plural/HasUoWFiles.java>:43:
warning: no @return
    Iterable<File> attachedFiles();
                   ^

3 warnings
:libraries:uowfile:javadocJar
:libraries:uowfile:sourceJar
:libraries:uowfile:testSourceJar
:libraries:uowfile:signArchives SKIPPED
:libraries:uowfile:uploadStageArchivesCould not find metadata org.apache.polygene.libraries:org.apache.polygene.library.uowfile:3.1.0-SNAPSHOT/maven-metadata.xml
in remote (file://<https://builds.apache.org/job/Polygene-develop-java9-check/ws/libraries/uowfile/build/stage/archives)>
Could not find metadata org.apache.polygene.libraries:org.apache.polygene.library.uowfile/maven-metadata.xml
in remote (file://<https://builds.apache.org/job/Polygene-develop-java9-check/ws/libraries/uowfile/build/stage/archives)>

:tools:envisage:osgiClasses
:tools:envisage:processVersionResources NO-SOURCE
:tools:envisage:versionClasses
:tools:envisage:jar
:tools:envisage:javadoc
:tools:envisage:javadocJar
:tools:envisage:sourceJar
:tools:envisage:testSourceJar
:tools:envisage:signArchives SKIPPED
:tools:envisage:uploadStageArchivesCould not find metadata org.apache.polygene.tools:org.apache.polygene.tool.envisage:3.1.0-SNAPSHOT/maven-metadata.xml
in remote (file://<https://builds.apache.org/job/Polygene-develop-java9-check/ws/tools/envisage/build/stage/archives)>
Could not find metadata org.apache.polygene.tools:org.apache.polygene.tool.envisage/maven-metadata.xml
in remote (file://<https://builds.apache.org/job/Polygene-develop-java9-check/ws/tools/envisage/build/stage/archives)>

:tools:model-detail:javadoc
:tools:model-detail:javadocJar
:tools:model-detail:sourceJar
:tools:model-detail:testSourceJar
:tools:model-detail:signArchives SKIPPED
:tools:model-detail:uploadStageArchivesCould not find metadata org.apache.polygene.tools:org.apache.polygene.tool.model-detail:3.1.0-SNAPSHOT/maven-metadata.xml
in remote (file://<https://builds.apache.org/job/Polygene-develop-java9-check/ws/tools/model-detail/build/stage/archives)>
Could not find metadata org.apache.polygene.tools:org.apache.polygene.tool.model-detail/maven-metadata.xml
in remote (file://<https://builds.apache.org/job/Polygene-develop-java9-check/ws/tools/model-detail/build/stage/archives)>

:tools:generator-polygene:nodeSetup UP-TO-DATE
:tools:generator-polygene:npmSetup UP-TO-DATE
:tools:generator-polygene:npmInstall UP-TO-DATE
:tools:generator-polygene:prepareTemplateGradleWrapper UP-TO-DATE
:tools:generator-polygene:setsCurrentVersionToPackageJson
:tools:model-detail:honkerCheck
:tools:model-detail:check
:tutorials:cargo:check
:tutorials:composites:check
:tutorials:hello:check
:tutorials:introduction:check UP-TO-DATE
:tutorials:services:check
:tutorials:introduction:tenminutes:check UP-TO-DATE
:tutorials:introduction:thirtyminutes:check UP-TO-DATE
:tutorials:introduction:twominutes:check UP-TO-DATE

FAILURE: Build completed with 13 failures.

1: Task failed with an exception.
-----------
* What went wrong:
Execution failed for task ':core:bootstrap:test'.
> There were failing tests. See the report at: file://<https://builds.apache.org/job/Polygene-develop-java9-check/ws/core/bootstrap/build/reports/tests/test/index.html>

* Try:
Run with --stacktrace option to get the stack trace. Run with --info or --debug option to
get more log output. Run with --scan to get full insights.
==============================================================================

2: Task failed with an exception.
-----------
* What went wrong:
Execution failed for task ':core:runtime:test'.
> There were failing tests. See the report at: file://<https://builds.apache.org/job/Polygene-develop-java9-check/ws/core/runtime/build/reports/tests/test/index.html>

* Try:
Run with --stacktrace option to get the stack trace. Run with --info or --debug option to
get more log output. Run with --scan to get full insights.
==============================================================================

3: Task failed with an exception.
-----------
* What went wrong:
Execution failed for task ':extensions:entitystore-jclouds:test'.
> There were failing tests. See the report at: file://<https://builds.apache.org/job/Polygene-develop-java9-check/ws/extensions/entitystore-jclouds/build/reports/tests/test/index.html>

* Try:
Run with --stacktrace option to get the stack trace. Run with --info or --debug option to
get more log output. Run with --scan to get full insights.
==============================================================================

4: Task failed with an exception.
-----------
* What went wrong:
Execution failed for task ':extensions:entitystore-leveldb:test'.
> There were failing tests. See the report at: file://<https://builds.apache.org/job/Polygene-develop-java9-check/ws/extensions/entitystore-leveldb/build/reports/tests/test/index.html>

* Try:
Run with --stacktrace option to get the stack trace. Run with --info or --debug option to
get more log output. Run with --scan to get full insights.
==============================================================================

5: Task failed with an exception.
-----------
* What went wrong:
Execution failed for task ':extensions:entitystore-mongodb:test'.
> There were failing tests. See the report at: file://<https://builds.apache.org/job/Polygene-develop-java9-check/ws/extensions/entitystore-mongodb/build/reports/tests/test/index.html>

* Try:
Run with --stacktrace option to get the stack trace. Run with --info or --debug option to
get more log output. Run with --scan to get full insights.
==============================================================================

6: Task failed with an exception.
-----------
* What went wrong:
Execution failed for task ':extensions:entitystore-riak:test'.
> There were failing tests. See the report at: file://<https://builds.apache.org/job/Polygene-develop-java9-check/ws/extensions/entitystore-riak/build/reports/tests/test/index.html>

* Try:
Run with --stacktrace option to get the stack trace. Run with --info or --debug option to
get more log output. Run with --scan to get full insights.
==============================================================================

7: Task failed with an exception.
-----------
* What went wrong:
Execution failed for task ':extensions:entitystore-sql:test'.
> There were failing tests. See the report at: file://<https://builds.apache.org/job/Polygene-develop-java9-check/ws/extensions/entitystore-sql/build/reports/tests/test/index.html>

* Try:
Run with --stacktrace option to get the stack trace. Run with --info or --debug option to
get more log output. Run with --scan to get full insights.
==============================================================================

8: Task failed with an exception.
-----------
* What went wrong:
Execution failed for task ':extensions:entitystore-sqlkv:test'.
> There were failing tests. See the report at: file://<https://builds.apache.org/job/Polygene-develop-java9-check/ws/extensions/entitystore-sqlkv/build/reports/tests/test/index.html>

* Try:
Run with --stacktrace option to get the stack trace. Run with --info or --debug option to
get more log output. Run with --scan to get full insights.
==============================================================================

9: Task failed with an exception.
-----------
* What went wrong:
Execution failed for task ':extensions:indexing-sql:test'.
> There were failing tests. See the report at: file://<https://builds.apache.org/job/Polygene-develop-java9-check/ws/extensions/indexing-sql/build/reports/tests/test/index.html>

* Try:
Run with --stacktrace option to get the stack trace. Run with --info or --debug option to
get more log output. Run with --scan to get full insights.
==============================================================================

10: Task failed with an exception.
-----------
* What went wrong:
Execution failed for task ':extensions:serialization-javaxxml:compileJava'.
> Compilation failed; see the compiler error output for details.

* Try:
Run with --stacktrace option to get the stack trace. Run with --info or --debug option to
get more log output. Run with --scan to get full insights.
==============================================================================

11: Task failed with an exception.
-----------
* What went wrong:
Execution failed for task ':reports:javadocs'.
> Javadoc generation failed. Generated Javadoc options file (useful for troubleshooting):
'<https://builds.apache.org/job/Polygene-develop-java9-check/ws/reports/build/tmp/javadocs/javadoc.options'>

* Try:
Run with --stacktrace option to get the stack trace. Run with --info or --debug option to
get more log output. Run with --scan to get full insights.
==============================================================================

12: Task failed with an exception.
-----------
* What went wrong:
Execution failed for task ':core:runtime:javadoc'.
> Javadoc generation failed. Generated Javadoc options file (useful for troubleshooting):
'<https://builds.apache.org/job/Polygene-develop-java9-check/ws/core/runtime/build/tmp/javadoc/javadoc.options'>

* Try:
Run with --stacktrace option to get the stack trace. Run with --info or --debug option to
get more log output. Run with --scan to get full insights.
==============================================================================

13: Task failed with an exception.
-----------
* What went wrong:
Execution failed for task ':extensions:entitystore-sql:javadoc'.
> Javadoc generation failed. Generated Javadoc options file (useful for troubleshooting):
'<https://builds.apache.org/job/Polygene-develop-java9-check/ws/extensions/entitystore-sql/build/tmp/javadoc/javadoc.options'>

* Try:
Run with --stacktrace option to get the stack trace. Run with --info or --debug option to
get more log output. Run with --scan to get full insights.
==============================================================================

* Get more help at https://help.gradle.org

Deprecated Gradle features were used in this build, making it incompatible with Gradle 5.0.
See https://docs.gradle.org/4.6/userguide/command_line_interface.html#sec:command_line_warnings

BUILD FAILED in 34m 8s
1197 actionable tasks: 1190 executed, 7 up-to-date
Build step 'Invoke Gradle script' changed build result to FAILURE
Build step 'Invoke Gradle script' marked build as failure
Recording test results
Not sending mail to unregistered user github@alasdairhodge.co.uk
Not sending mail to unregistered user tibor.mlynarik@apache.org

Mime
View raw message