polygene-dev mailing list archives

Site index · List index
Message view « Date » · « Thread »
Top « Date » · « Thread »
From Apache Jenkins Server <jenk...@builds.apache.org>
Subject Build failed in Jenkins: Polygene-develop-java8-checkDists #275
Date Sat, 28 Oct 2017 16:10:20 GMT
See <https://builds.apache.org/job/Polygene-develop-java8-checkDists/275/display/redirect?page=changes>

Changes:

[niclas] Forgot license headers in assmbly files.

------------------------------------------
[...truncated 398.79 KB...]
Created image with ID 'd323542b78b3'.
:internals:testsupport-internal:buildMongoDockerfile
:internals:testsupport-internal:buildMongoDockerImage
Building image using context '<https://builds.apache.org/job/Polygene-develop-java8-checkDists/ws/internals/testsupport-internal/build/tmp/docker/mongo'.>
Using Dockerfile '<https://builds.apache.org/job/Polygene-develop-java8-checkDists/ws/internals/testsupport-internal/build/tmp/docker/mongo/Dockerfile'>
Using tag 'org.apache.polygene:org.apache.polygene.internal.docker-mongo' for image.
Step 1/1 : FROM mongo:3.5.10
---> 4a78858ab3fe
Successfully built 4a78858ab3fe
Successfully tagged org.apache.polygene:org.apache.polygene.internal.docker-mongo
Created image with ID '4a78858ab3fe'.
:internals:testsupport-internal:buildMysqlDockerfile
:internals:testsupport-internal:buildMysqlDockerImage
Building image using context '<https://builds.apache.org/job/Polygene-develop-java8-checkDists/ws/internals/testsupport-internal/build/tmp/docker/mysql'.>
Using Dockerfile '<https://builds.apache.org/job/Polygene-develop-java8-checkDists/ws/internals/testsupport-internal/build/tmp/docker/mysql/Dockerfile'>
Using tag 'org.apache.polygene:org.apache.polygene.internal.docker-mysql' for image.
Step 1/1 : FROM mariadb:10.1.21
---> 56741a13bbb9
Successfully built 56741a13bbb9
Successfully tagged org.apache.polygene:org.apache.polygene.internal.docker-mysql
Created image with ID '56741a13bbb9'.
:internals:testsupport-internal:buildPostgresDockerfile
:internals:testsupport-internal:buildPostgresDockerImage
Building image using context '<https://builds.apache.org/job/Polygene-develop-java8-checkDists/ws/internals/testsupport-internal/build/tmp/docker/postgres'.>
Using Dockerfile '<https://builds.apache.org/job/Polygene-develop-java8-checkDists/ws/internals/testsupport-internal/build/tmp/docker/postgres/Dockerfile'>
Using tag 'org.apache.polygene:org.apache.polygene.internal.docker-postgres' for image.
Step 1/2 : FROM postgres:9.6.3-alpine
---> f6a9a3968e52
Step 2/2 : COPY init-test-db.sh /docker-entrypoint-initdb.d/init-test-db.sh
---> Using cache
---> 395a0bf752fd
Successfully built 395a0bf752fd
Successfully tagged org.apache.polygene:org.apache.polygene.internal.docker-postgres
Created image with ID '395a0bf752fd'.
:internals:testsupport-internal:buildRedisDockerfile
:internals:testsupport-internal:buildRedisDockerImage
Building image using context '<https://builds.apache.org/job/Polygene-develop-java8-checkDists/ws/internals/testsupport-internal/build/tmp/docker/redis'.>
Using Dockerfile '<https://builds.apache.org/job/Polygene-develop-java8-checkDists/ws/internals/testsupport-internal/build/tmp/docker/redis/Dockerfile'>
Using tag 'org.apache.polygene:org.apache.polygene.internal.docker-redis' for image.
Step 1/1 : FROM redis:4.0.0-alpine
---> 8fedae67fbf4
Successfully built 8fedae67fbf4
Successfully tagged org.apache.polygene:org.apache.polygene.internal.docker-redis
Created image with ID '8fedae67fbf4'.
:internals:testsupport-internal:buildRiakDockerfile
:internals:testsupport-internal:buildRiakDockerImage
Building image using context '<https://builds.apache.org/job/Polygene-develop-java8-checkDists/ws/internals/testsupport-internal/build/tmp/docker/riak'.>
Using Dockerfile '<https://builds.apache.org/job/Polygene-develop-java8-checkDists/ws/internals/testsupport-internal/build/tmp/docker/riak/Dockerfile'>
Using tag 'org.apache.polygene:org.apache.polygene.internal.docker-riak' for image.
Step 1/1 : FROM basho/riak-kv:ubuntu-2.2.3
---> 069fcbe2a12f
Successfully built 069fcbe2a12f
Successfully tagged org.apache.polygene:org.apache.polygene.internal.docker-riak
Created image with ID '069fcbe2a12f'.
:internals:testsupport-internal:buildS3serverDockerfile
:internals:testsupport-internal:buildS3serverDockerImage
Building image using context '<https://builds.apache.org/job/Polygene-develop-java8-checkDists/ws/internals/testsupport-internal/build/tmp/docker/s3server'.>
Using Dockerfile '<https://builds.apache.org/job/Polygene-develop-java8-checkDists/ws/internals/testsupport-internal/build/tmp/docker/s3server/Dockerfile'>
Using tag 'org.apache.polygene:org.apache.polygene.internal.docker-s3server' for image.
Step 1/3 : FROM scality/s3server:mem-bb2a38c0
---> fadaeaafc7c8
Step 2/3 : ENV SCALITY_ACCESS_KEY_ID dummyIdentifier
---> Using cache
---> 9b8e97d75847
Step 3/3 : ENV SCALITY_SECRET_ACCESS_KEY dummyCredential
---> Using cache
---> 66fcee09f93e
Successfully built 66fcee09f93e
Successfully tagged org.apache.polygene:org.apache.polygene.internal.docker-s3server
Created image with ID '66fcee09f93e'.
:internals:testsupport-internal:compileJava
:internals:testsupport-internal:processResources NO-SOURCE
:internals:testsupport-internal:classes
:internals:testsupport-internal:osgiClasses
:internals:testsupport-internal:jar
:internals:testsupport-internal:assemble
:samples:dci:compileJavaNote: <https://builds.apache.org/job/Polygene-develop-java8-checkDists/ws/samples/dci/src/main/java/org/apache/polygene/dci/moneytransfer/context/Role.java>
uses unchecked or unsafe operations.
Note: Recompile with -Xlint:unchecked for details.

:samples:dci:processResources NO-SOURCE
:samples:dci:classes
:samples:dci:osgiClasses
:samples:dci:jar
:samples:dci:assemble
:samples:forum:compileJava
:samples:forum:processResources NO-SOURCE
:samples:forum:classes
:samples:forum:osgiClasses
:samples:forum:jar
:samples:forum:assemble
:samples:rental:compileJavaNote: <https://builds.apache.org/job/Polygene-develop-java8-checkDists/ws/samples/rental/src/main/java/org/apache/polygene/sample/rental/web/Page.java>
uses unchecked or unsafe operations.
Note: Recompile with -Xlint:unchecked for details.

:samples:rental:processResources
:samples:rental:classes
:samples:rental:war
:samples:rental:assemble
:samples:sql-support:compileJava
:samples:sql-support:processResources
:samples:sql-support:classes
:samples:sql-support:osgiClasses
:samples:sql-support:jar
:samples:sql-support:assemble
:samples:swing:compileJavaNote: Some input files use unchecked or unsafe operations.
Note: Recompile with -Xlint:unchecked for details.

:samples:swing:processResources NO-SOURCE
:samples:swing:classes
:samples:swing:osgiClasses
:samples:swing:jar
:samples:swing:assemble
:tests:performance:compileJava
:tests:performance:processResources NO-SOURCE
:tests:performance:classes
:tests:performance:osgiClasses
:tests:performance:jar
:tests:performance:assemble
:tests:regression:compileJava
:tests:regression:processResources NO-SOURCE
:tests:regression:classes
:tests:regression:osgiClasses
:tests:regression:jar
:tests:regression:assemble
:tools:generator-polygene:assemble UP-TO-DATE
:tutorials:cargo:compileJava
:tutorials:cargo:processResources NO-SOURCE
:tutorials:cargo:classes
:tutorials:cargo:osgiClasses
:tutorials:cargo:jar
:tutorials:cargo:assemble
:tutorials:composites:compileJava
:tutorials:composites:processResources NO-SOURCE
:tutorials:composites:classes
:tutorials:composites:osgiClasses
:tutorials:composites:jar
:tutorials:composites:assemble
:tutorials:hello:compileJava
:tutorials:hello:processResources NO-SOURCE
:tutorials:hello:classes
:tutorials:hello:osgiClasses
:tutorials:hello:jar
:tutorials:hello:assemble
:tutorials:introduction:compileJava
:tutorials:introduction:processResources NO-SOURCE
:tutorials:introduction:classes
:tutorials:introduction:osgiClasses
:tutorials:introduction:jar
:tutorials:introduction:assemble
:tutorials:services:compileJava
:tutorials:services:processResources
:tutorials:services:classes
:tutorials:services:osgiClasses
:tutorials:services:jar
:tutorials:services:assemble
:tutorials:introduction:tenminutes:compileJava
:tutorials:introduction:tenminutes:processResources NO-SOURCE
:tutorials:introduction:tenminutes:classes
:tutorials:introduction:tenminutes:osgiClasses
:tutorials:introduction:tenminutes:jar
:tutorials:introduction:tenminutes:assemble
:tutorials:introduction:thirtyminutes:compileJavaNote: <https://builds.apache.org/job/Polygene-develop-java8-checkDists/ws/tutorials/introduction/thirtyminutes/src/main/java/org/apache/polygene/demo/thirtyminutes/ThirtyMinutesDocs.java>
uses unchecked or unsafe operations.
Note: Recompile with -Xlint:unchecked for details.

:tutorials:introduction:thirtyminutes:processResources NO-SOURCE
:tutorials:introduction:thirtyminutes:classes
:tutorials:introduction:thirtyminutes:osgiClasses
:tutorials:introduction:thirtyminutes:jar
:tutorials:introduction:thirtyminutes:assemble
:tutorials:introduction:twominutes:compileJava
:tutorials:introduction:twominutes:processResources NO-SOURCE
:tutorials:introduction:twominutes:classes
:tutorials:introduction:twominutes:osgiClasses
:tutorials:introduction:twominutes:jar
:tutorials:introduction:twominutes:assemble
:distributions:stageBinaryDistribution
:distributions:ratBinaryDistribution
:distributions:checkBinaryDistribution
:distributions:stageSourceDistribution
:distributions:inspectSourceDistribution
:distributions:ratSourceDistribution FAILED
:distributions:buildSourceDistribution

FAILURE: Build failed with an exception.

* What went wrong:
Execution failed for task ':distributions:ratSourceDistribution'.
> Found 4 files with unapproved/unknown licenses. See <https://builds.apache.org/job/Polygene-develop-java8-checkDists/ws/distributions/build/reports/rat/index.html>

* Try:
Run with --info or --debug option to get more log output.

* Exception is:
org.gradle.api.tasks.TaskExecutionException: Execution failed for task ':distributions:ratSourceDistribution'.
	at org.gradle.api.internal.tasks.execution.ExecuteActionsTaskExecuter.executeActions(ExecuteActionsTaskExecuter.java:100)
	at org.gradle.api.internal.tasks.execution.ExecuteActionsTaskExecuter.execute(ExecuteActionsTaskExecuter.java:70)
	at org.gradle.api.internal.tasks.execution.SkipUpToDateTaskExecuter.execute(SkipUpToDateTaskExecuter.java:62)
	at org.gradle.api.internal.tasks.execution.ResolveTaskOutputCachingStateExecuter.execute(ResolveTaskOutputCachingStateExecuter.java:54)
	at org.gradle.api.internal.tasks.execution.ValidatingTaskExecuter.execute(ValidatingTaskExecuter.java:58)
	at org.gradle.api.internal.tasks.execution.SkipEmptySourceFilesTaskExecuter.execute(SkipEmptySourceFilesTaskExecuter.java:97)
	at org.gradle.api.internal.tasks.execution.CleanupStaleOutputsExecuter.execute(CleanupStaleOutputsExecuter.java:87)
	at org.gradle.api.internal.tasks.execution.ResolveTaskArtifactStateTaskExecuter.execute(ResolveTaskArtifactStateTaskExecuter.java:52)
	at org.gradle.api.internal.tasks.execution.SkipTaskWithNoActionsExecuter.execute(SkipTaskWithNoActionsExecuter.java:52)
	at org.gradle.api.internal.tasks.execution.SkipOnlyIfTaskExecuter.execute(SkipOnlyIfTaskExecuter.java:54)
	at org.gradle.api.internal.tasks.execution.ExecuteAtMostOnceTaskExecuter.execute(ExecuteAtMostOnceTaskExecuter.java:43)
	at org.gradle.api.internal.tasks.execution.CatchExceptionTaskExecuter.execute(CatchExceptionTaskExecuter.java:34)
	at org.gradle.execution.taskgraph.DefaultTaskGraphExecuter$EventFiringTaskWorker$1.run(DefaultTaskGraphExecuter.java:248)
	at org.gradle.internal.progress.DefaultBuildOperationExecutor$RunnableBuildOperationWorker.execute(DefaultBuildOperationExecutor.java:336)
	at org.gradle.internal.progress.DefaultBuildOperationExecutor$RunnableBuildOperationWorker.execute(DefaultBuildOperationExecutor.java:328)
	at org.gradle.internal.progress.DefaultBuildOperationExecutor.execute(DefaultBuildOperationExecutor.java:199)
	at org.gradle.internal.progress.DefaultBuildOperationExecutor.run(DefaultBuildOperationExecutor.java:110)
	at org.gradle.execution.taskgraph.DefaultTaskGraphExecuter$EventFiringTaskWorker.execute(DefaultTaskGraphExecuter.java:241)
	at org.gradle.execution.taskgraph.DefaultTaskGraphExecuter$EventFiringTaskWorker.execute(DefaultTaskGraphExecuter.java:230)
	at org.gradle.execution.taskgraph.DefaultTaskPlanExecutor$TaskExecutorWorker.processTask(DefaultTaskPlanExecutor.java:123)
	at org.gradle.execution.taskgraph.DefaultTaskPlanExecutor$TaskExecutorWorker.access$200(DefaultTaskPlanExecutor.java:79)
	at org.gradle.execution.taskgraph.DefaultTaskPlanExecutor$TaskExecutorWorker$1.execute(DefaultTaskPlanExecutor.java:104)
	at org.gradle.execution.taskgraph.DefaultTaskPlanExecutor$TaskExecutorWorker$1.execute(DefaultTaskPlanExecutor.java:98)
	at org.gradle.execution.taskgraph.DefaultTaskExecutionPlan.execute(DefaultTaskExecutionPlan.java:625)
	at org.gradle.execution.taskgraph.DefaultTaskExecutionPlan.executeWithTask(DefaultTaskExecutionPlan.java:580)
	at org.gradle.execution.taskgraph.DefaultTaskPlanExecutor$TaskExecutorWorker.run(DefaultTaskPlanExecutor.java:98)
	at org.gradle.internal.concurrent.ExecutorPolicy$CatchAndRecordFailures.onExecute(ExecutorPolicy.java:63)
	at org.gradle.internal.concurrent.ManagedExecutorImpl$1.run(ManagedExecutorImpl.java:46)
	at org.gradle.internal.concurrent.ThreadFactoryImpl$ManagedThreadRunnable.run(ThreadFactoryImpl.java:55)
Caused by: org.gradle.api.GradleException: Found 4 files with unapproved/unknown licenses.
See <https://builds.apache.org/job/Polygene-develop-java8-checkDists/ws/distributions/build/reports/rat/index.html>
	at org.apache.rat.gradle.RatTask.rat(RatTask.groovy:98)
	at org.gradle.internal.reflect.JavaMethod.invoke(JavaMethod.java:73)
	at org.gradle.api.internal.project.taskfactory.DefaultTaskClassInfoStore$StandardTaskAction.doExecute(DefaultTaskClassInfoStore.java:142)
	at org.gradle.api.internal.project.taskfactory.DefaultTaskClassInfoStore$StandardTaskAction.execute(DefaultTaskClassInfoStore.java:135)
	at org.gradle.api.internal.project.taskfactory.DefaultTaskClassInfoStore$StandardTaskAction.execute(DefaultTaskClassInfoStore.java:122)
	at org.gradle.api.internal.AbstractTask$TaskActionWrapper.execute(AbstractTask.java:762)
	at org.gradle.api.internal.AbstractTask$TaskActionWrapper.execute(AbstractTask.java:729)
	at org.gradle.api.internal.tasks.execution.ExecuteActionsTaskExecuter$1.run(ExecuteActionsTaskExecuter.java:121)
	at org.gradle.internal.progress.DefaultBuildOperationExecutor$RunnableBuildOperationWorker.execute(DefaultBuildOperationExecutor.java:336)
	at org.gradle.internal.progress.DefaultBuildOperationExecutor$RunnableBuildOperationWorker.execute(DefaultBuildOperationExecutor.java:328)
	at org.gradle.internal.progress.DefaultBuildOperationExecutor.execute(DefaultBuildOperationExecutor.java:199)
	at org.gradle.internal.progress.DefaultBuildOperationExecutor.run(DefaultBuildOperationExecutor.java:110)
	at org.gradle.api.internal.tasks.execution.ExecuteActionsTaskExecuter.executeAction(ExecuteActionsTaskExecuter.java:110)
	at org.gradle.api.internal.tasks.execution.ExecuteActionsTaskExecuter.executeActions(ExecuteActionsTaskExecuter.java:92)
	... 28 more


* Get more help at https://help.gradle.org

BUILD FAILED in 1h 8m 14s
1033 actionable tasks: 1031 executed, 2 up-to-date
Build step 'Invoke Gradle script' changed build result to FAILURE
Build step 'Invoke Gradle script' marked build as failure
Archiving artifacts
Recording test results
Publishing Javadoc

Mime
View raw message