polygene-dev mailing list archives

Site index · List index
Message view « Date » · « Thread »
Top « Date » · « Thread »
From Apache Jenkins Server <jenk...@builds.apache.org>
Subject Build failed in Jenkins: Polygene-develop-java8-windows-check #18
Date Mon, 30 Oct 2017 06:08:40 GMT
See <https://builds.apache.org/job/Polygene-develop-java8-windows-check/18/display/redirect?page=changes>

Changes:

[tibor.mlynarik] value builder ignores constraint violations if there is no UoW - fix

[niclas] Added Berkeley DB (Java Edition) Entity Store.

[niclas] Added Documentation for Berkeley DB (Java Edition) Entity Store. Changed

------------------------------------------
[...truncated 511.85 KB...]
F:\jenkins\jenkins-slave\workspace\Polygene-develop-java8-windows-check\libraries\sql-generator\src\main\java\org\apache\polygene\library\sql\generator\grammar\builders\query\QuerySpecificationBuilder.java:107:
warning: no @param for builder
    QuerySpecificationBuilder setWhere( BooleanBuilder builder );
                              ^
F:\jenkins\jenkins-slave\workspace\Polygene-develop-java8-windows-check\libraries\sql-generator\src\main\java\org\apache\polygene\library\sql\generator\grammar\builders\query\QuerySpecificationBuilder.java:114:
warning: no @param for builder
    QuerySpecificationBuilder setGroupBy( GroupByBuilder builder );
                              ^
F:\jenkins\jenkins-slave\workspace\Polygene-develop-java8-windows-check\libraries\sql-generator\src\main\java\org\apache\polygene\library\sql\generator\grammar\builders\query\QuerySpecificationBuilder.java:121:
warning: no @param for builder
    QuerySpecificationBuilder setHaving( BooleanBuilder builder );
                              ^
F:\jenkins\jenkins-slave\workspace\Polygene-develop-java8-windows-check\libraries\sql-generator\src\main\java\org\apache\polygene\library\sql\generator\grammar\builders\query\QuerySpecificationBuilder.java:128:
warning: no @param for builder
    QuerySpecificationBuilder setOrderBy( OrderByBuilder builder );
                              ^

9 warnings
:libraries:sql-generator:javadocJar
:libraries:sql-generator:sourceJar
:libraries:sql-generator:testSourceJar
:libraries:sql-generator:signArchives SKIPPED
:libraries:sql-generator:uploadStageArchivesCould not find metadata org.apache.polygene.libraries:org.apache.polygene.library.sql-generator:3.1.0-SNAPSHOT/maven-metadata.xml
in remote (file://F:\jenkins\jenkins-slave\workspace\Polygene-develop-java8-windows-check\libraries\sql-generator\build/stage/archives)
Could not find metadata org.apache.polygene.libraries:org.apache.polygene.library.sql-generator/maven-metadata.xml
in remote (file://F:\jenkins\jenkins-slave\workspace\Polygene-develop-java8-windows-check\libraries\sql-generator\build/stage/archives)

:libraries:sql-liquibase:javadoc
:libraries:sql-liquibase:javadocJar
:libraries:sql-liquibase:sourceJar
:libraries:sql-liquibase:testSourceJar
:libraries:sql-liquibase:signArchives SKIPPED
:libraries:sql-liquibase:uploadStageArchivesCould not find metadata org.apache.polygene.libraries:org.apache.polygene.library.sql-liquibase:3.1.0-SNAPSHOT/maven-metadata.xml
in remote (file://F:\jenkins\jenkins-slave\workspace\Polygene-develop-java8-windows-check\libraries\sql-liquibase\build/stage/archives)
Could not find metadata org.apache.polygene.libraries:org.apache.polygene.library.sql-liquibase/maven-metadata.xml
in remote (file://F:\jenkins\jenkins-slave\workspace\Polygene-develop-java8-windows-check\libraries\sql-liquibase\build/stage/archives)

:libraries:uid:osgiClasses
:libraries:uid:processVersionResources NO-SOURCE
:libraries:uid:versionClasses
:libraries:uid:jar
:libraries:uid:javadoc
:libraries:uid:javadocJar
:libraries:uid:sourceJar
:libraries:uid:testSourceJar
:libraries:uid:signArchives SKIPPED
:libraries:uid:uploadStageArchivesCould not find metadata org.apache.polygene.libraries:org.apache.polygene.library.uid:3.1.0-SNAPSHOT/maven-metadata.xml
in remote (file://F:\jenkins\jenkins-slave\workspace\Polygene-develop-java8-windows-check\libraries\uid\build/stage/archives)
Could not find metadata org.apache.polygene.libraries:org.apache.polygene.library.uid/maven-metadata.xml
in remote (file://F:\jenkins\jenkins-slave\workspace\Polygene-develop-java8-windows-check\libraries\uid\build/stage/archives)

:libraries:uowfile:osgiClasses
:libraries:uowfile:processVersionResources NO-SOURCE
:libraries:uowfile:versionClasses
:libraries:uowfile:jar
:libraries:uowfile:javadocF:\jenkins\jenkins-slave\workspace\Polygene-develop-java8-windows-check\libraries\uowfile\src\main\java\org\apache\polygene\library\uowfile\plural\HasUoWFiles.java:38:
warning: no @param for key
    File attachedFile( T key );
         ^
F:\jenkins\jenkins-slave\workspace\Polygene-develop-java8-windows-check\libraries\uowfile\src\main\java\org\apache\polygene\library\uowfile\plural\HasUoWFiles.java:38:
warning: no @return
    File attachedFile( T key );
         ^
F:\jenkins\jenkins-slave\workspace\Polygene-develop-java8-windows-check\libraries\uowfile\src\main\java\org\apache\polygene\library\uowfile\plural\HasUoWFiles.java:43:
warning: no @return
    Iterable<File> attachedFiles();
                   ^

3 warnings
:libraries:uowfile:javadocJar
:libraries:uowfile:sourceJar
:libraries:uowfile:testSourceJar
:libraries:uowfile:signArchives SKIPPED
:libraries:uowfile:uploadStageArchivesCould not find metadata org.apache.polygene.libraries:org.apache.polygene.library.uowfile:3.1.0-SNAPSHOT/maven-metadata.xml
in remote (file://F:\jenkins\jenkins-slave\workspace\Polygene-develop-java8-windows-check\libraries\uowfile\build/stage/archives)
Could not find metadata org.apache.polygene.libraries:org.apache.polygene.library.uowfile/maven-metadata.xml
in remote (file://F:\jenkins\jenkins-slave\workspace\Polygene-develop-java8-windows-check\libraries\uowfile\build/stage/archives)

:tools:envisage:osgiClasses
:tools:envisage:processVersionResources NO-SOURCE
:tools:envisage:versionClasses
:tools:envisage:jar
:tools:envisage:javadoc
:tools:envisage:javadocJar
:tools:envisage:sourceJar
:tools:envisage:testSourceJar
:tools:envisage:signArchives SKIPPED
:tools:envisage:uploadStageArchivesCould not find metadata org.apache.polygene.tools:org.apache.polygene.tool.envisage:3.1.0-SNAPSHOT/maven-metadata.xml
in remote (file://F:\jenkins\jenkins-slave\workspace\Polygene-develop-java8-windows-check\tools\envisage\build/stage/archives)
Could not find metadata org.apache.polygene.tools:org.apache.polygene.tool.envisage/maven-metadata.xml
in remote (file://F:\jenkins\jenkins-slave\workspace\Polygene-develop-java8-windows-check\tools\envisage\build/stage/archives)

:tools:model-detail:javadoc
:tools:model-detail:javadocJar
:tools:model-detail:sourceJar
:tools:model-detail:testSourceJar
:tools:model-detail:signArchives SKIPPED
:tools:model-detail:uploadStageArchivesCould not find metadata org.apache.polygene.tools:org.apache.polygene.tool.model-detail:3.1.0-SNAPSHOT/maven-metadata.xml
in remote (file://F:\jenkins\jenkins-slave\workspace\Polygene-develop-java8-windows-check\tools\model-detail\build/stage/archives)
Could not find metadata org.apache.polygene.tools:org.apache.polygene.tool.model-detail/maven-metadata.xml
in remote (file://F:\jenkins\jenkins-slave\workspace\Polygene-develop-java8-windows-check\tools\model-detail\build/stage/archives)

:tools:generator-polygene:nodeSetup UP-TO-DATE
:tools:generator-polygene:npmSetup UP-TO-DATE
:tools:generator-polygene:npmInstall UP-TO-DATE
:tools:generator-polygene:prepareTemplateGradleWrapper UP-TO-DATE
:tools:generator-polygene:setsCurrentVersionToPackageJson
:tools:model-detail:honkerCheck
:tools:model-detail:check
:tutorials:cargo:check
:tutorials:composites:check
:tutorials:hello:check
:tutorials:introduction:check UP-TO-DATE
:tutorials:services:check
:tutorials:introduction:tenminutes:check UP-TO-DATE
:tutorials:introduction:thirtyminutes:check UP-TO-DATE
:tutorials:introduction:twominutes:check UP-TO-DATE

FAILURE: Build completed with 2 failures.

1: Task failed with an exception.
-----------
* What went wrong:
Execution failed for task ':reports:javadocs'.
> Javadoc generation failed. Generated Javadoc options file (useful for troubleshooting):
'F:\jenkins\jenkins-slave\workspace\Polygene-develop-java8-windows-check\reports\build\tmp\javadocs\javadoc.options'

* Try:
Run with --info or --debug option to get more log output.

* Exception is:
org.gradle.api.tasks.TaskExecutionException: Execution failed for task ':reports:javadocs'.
	at org.gradle.api.internal.tasks.execution.ExecuteActionsTaskExecuter.executeActions(ExecuteActionsTaskExecuter.java:100)
	at org.gradle.api.internal.tasks.execution.ExecuteActionsTaskExecuter.execute(ExecuteActionsTaskExecuter.java:70)
	at org.gradle.api.internal.tasks.execution.SkipUpToDateTaskExecuter.execute(SkipUpToDateTaskExecuter.java:62)
	at org.gradle.api.internal.tasks.execution.ResolveTaskOutputCachingStateExecuter.execute(ResolveTaskOutputCachingStateExecuter.java:54)
	at org.gradle.api.internal.tasks.execution.ValidatingTaskExecuter.execute(ValidatingTaskExecuter.java:58)
	at org.gradle.api.internal.tasks.execution.SkipEmptySourceFilesTaskExecuter.execute(SkipEmptySourceFilesTaskExecuter.java:97)
	at org.gradle.api.internal.tasks.execution.CleanupStaleOutputsExecuter.execute(CleanupStaleOutputsExecuter.java:87)
	at org.gradle.api.internal.tasks.execution.ResolveTaskArtifactStateTaskExecuter.execute(ResolveTaskArtifactStateTaskExecuter.java:52)
	at org.gradle.api.internal.tasks.execution.SkipTaskWithNoActionsExecuter.execute(SkipTaskWithNoActionsExecuter.java:52)
	at org.gradle.api.internal.tasks.execution.SkipOnlyIfTaskExecuter.execute(SkipOnlyIfTaskExecuter.java:54)
	at org.gradle.api.internal.tasks.execution.ExecuteAtMostOnceTaskExecuter.execute(ExecuteAtMostOnceTaskExecuter.java:43)
	at org.gradle.api.internal.tasks.execution.CatchExceptionTaskExecuter.execute(CatchExceptionTaskExecuter.java:34)
	at org.gradle.execution.taskgraph.DefaultTaskGraphExecuter$EventFiringTaskWorker$1.run(DefaultTaskGraphExecuter.java:248)
	at org.gradle.internal.progress.DefaultBuildOperationExecutor$RunnableBuildOperationWorker.execute(DefaultBuildOperationExecutor.java:336)
	at org.gradle.internal.progress.DefaultBuildOperationExecutor$RunnableBuildOperationWorker.execute(DefaultBuildOperationExecutor.java:328)
	at org.gradle.internal.progress.DefaultBuildOperationExecutor.execute(DefaultBuildOperationExecutor.java:199)
	at org.gradle.internal.progress.DefaultBuildOperationExecutor.run(DefaultBuildOperationExecutor.java:110)
	at org.gradle.execution.taskgraph.DefaultTaskGraphExecuter$EventFiringTaskWorker.execute(DefaultTaskGraphExecuter.java:241)
	at org.gradle.execution.taskgraph.DefaultTaskGraphExecuter$EventFiringTaskWorker.execute(DefaultTaskGraphExecuter.java:230)
	at org.gradle.execution.taskgraph.DefaultTaskPlanExecutor$TaskExecutorWorker.processTask(DefaultTaskPlanExecutor.java:123)
	at org.gradle.execution.taskgraph.DefaultTaskPlanExecutor$TaskExecutorWorker.access$200(DefaultTaskPlanExecutor.java:79)
	at org.gradle.execution.taskgraph.DefaultTaskPlanExecutor$TaskExecutorWorker$1.execute(DefaultTaskPlanExecutor.java:104)
	at org.gradle.execution.taskgraph.DefaultTaskPlanExecutor$TaskExecutorWorker$1.execute(DefaultTaskPlanExecutor.java:98)
	at org.gradle.execution.taskgraph.DefaultTaskExecutionPlan.execute(DefaultTaskExecutionPlan.java:625)
	at org.gradle.execution.taskgraph.DefaultTaskExecutionPlan.executeWithTask(DefaultTaskExecutionPlan.java:580)
	at org.gradle.execution.taskgraph.DefaultTaskPlanExecutor$TaskExecutorWorker.run(DefaultTaskPlanExecutor.java:98)
	at org.gradle.internal.concurrent.ExecutorPolicy$CatchAndRecordFailures.onExecute(ExecutorPolicy.java:63)
	at org.gradle.internal.concurrent.ManagedExecutorImpl$1.run(ManagedExecutorImpl.java:46)
	at org.gradle.internal.concurrent.ThreadFactoryImpl$ManagedThreadRunnable.run(ThreadFactoryImpl.java:55)
Caused by: org.gradle.api.GradleException: Javadoc generation failed. Generated Javadoc options
file (useful for troubleshooting): 'F:\jenkins\jenkins-slave\workspace\Polygene-develop-java8-windows-check\reports\build\tmp\javadocs\javadoc.options'
	at org.gradle.api.tasks.javadoc.internal.JavadocGenerator.execute(JavadocGenerator.java:58)
	at org.gradle.api.tasks.javadoc.internal.JavadocGenerator.execute(JavadocGenerator.java:31)
	at org.gradle.api.tasks.javadoc.Javadoc.executeExternalJavadoc(Javadoc.java:156)
	at org.gradle.api.tasks.javadoc.Javadoc.generate(Javadoc.java:144)
	at org.gradle.internal.reflect.JavaMethod.invoke(JavaMethod.java:73)
	at org.gradle.api.internal.project.taskfactory.DefaultTaskClassInfoStore$StandardTaskAction.doExecute(DefaultTaskClassInfoStore.java:142)
	at org.gradle.api.internal.project.taskfactory.DefaultTaskClassInfoStore$StandardTaskAction.execute(DefaultTaskClassInfoStore.java:135)
	at org.gradle.api.internal.project.taskfactory.DefaultTaskClassInfoStore$StandardTaskAction.execute(DefaultTaskClassInfoStore.java:122)
	at org.gradle.api.internal.AbstractTask$TaskActionWrapper.execute(AbstractTask.java:762)
	at org.gradle.api.internal.AbstractTask$TaskActionWrapper.execute(AbstractTask.java:729)
	at org.gradle.api.internal.tasks.execution.ExecuteActionsTaskExecuter$1.run(ExecuteActionsTaskExecuter.java:121)
	at org.gradle.internal.progress.DefaultBuildOperationExecutor$RunnableBuildOperationWorker.execute(DefaultBuildOperationExecutor.java:336)
	at org.gradle.internal.progress.DefaultBuildOperationExecutor$RunnableBuildOperationWorker.execute(DefaultBuildOperationExecutor.java:328)
	at org.gradle.internal.progress.DefaultBuildOperationExecutor.execute(DefaultBuildOperationExecutor.java:199)
	at org.gradle.internal.progress.DefaultBuildOperationExecutor.run(DefaultBuildOperationExecutor.java:110)
	at org.gradle.api.internal.tasks.execution.ExecuteActionsTaskExecuter.executeAction(ExecuteActionsTaskExecuter.java:110)
	at org.gradle.api.internal.tasks.execution.ExecuteActionsTaskExecuter.executeActions(ExecuteActionsTaskExecuter.java:92)
	... 28 more
Caused by: org.gradle.process.internal.ExecException: Process 'command 'F:\jenkins\tools\java\latest1.8\bin\javadoc.exe''
finished with non-zero exit value 1
	at org.gradle.process.internal.DefaultExecHandle$ExecResultImpl.assertNormalExitValue(DefaultExecHandle.java:382)
	at org.gradle.process.internal.DefaultExecAction.execute(DefaultExecAction.java:31)
	at org.gradle.api.tasks.javadoc.internal.JavadocGenerator.execute(JavadocGenerator.java:53)
	... 44 more

==============================================================================

2: Task failed with an exception.
-----------
* What went wrong:
Execution failed for task ':extensions:entitystore-berkeleydb:javadoc'.
> Javadoc generation failed. Generated Javadoc options file (useful for troubleshooting):
'F:\jenkins\jenkins-slave\workspace\Polygene-develop-java8-windows-check\extensions\entitystore-berkeleydb\build\tmp\javadoc\javadoc.options'

* Try:
Run with --info or --debug option to get more log output.

* Exception is:
org.gradle.api.tasks.TaskExecutionException: Execution failed for task ':extensions:entitystore-berkeleydb:javadoc'.
	at org.gradle.api.internal.tasks.execution.ExecuteActionsTaskExecuter.executeActions(ExecuteActionsTaskExecuter.java:100)
	at org.gradle.api.internal.tasks.execution.ExecuteActionsTaskExecuter.execute(ExecuteActionsTaskExecuter.java:70)
	at org.gradle.api.internal.tasks.execution.SkipUpToDateTaskExecuter.execute(SkipUpToDateTaskExecuter.java:62)
	at org.gradle.api.internal.tasks.execution.ResolveTaskOutputCachingStateExecuter.execute(ResolveTaskOutputCachingStateExecuter.java:54)
	at org.gradle.api.internal.tasks.execution.ValidatingTaskExecuter.execute(ValidatingTaskExecuter.java:58)
	at org.gradle.api.internal.tasks.execution.SkipEmptySourceFilesTaskExecuter.execute(SkipEmptySourceFilesTaskExecuter.java:97)
	at org.gradle.api.internal.tasks.execution.CleanupStaleOutputsExecuter.execute(CleanupStaleOutputsExecuter.java:87)
	at org.gradle.api.internal.tasks.execution.ResolveTaskArtifactStateTaskExecuter.execute(ResolveTaskArtifactStateTaskExecuter.java:52)
	at org.gradle.api.internal.tasks.execution.SkipTaskWithNoActionsExecuter.execute(SkipTaskWithNoActionsExecuter.java:52)
	at org.gradle.api.internal.tasks.execution.SkipOnlyIfTaskExecuter.execute(SkipOnlyIfTaskExecuter.java:54)
	at org.gradle.api.internal.tasks.execution.ExecuteAtMostOnceTaskExecuter.execute(ExecuteAtMostOnceTaskExecuter.java:43)
	at org.gradle.api.internal.tasks.execution.CatchExceptionTaskExecuter.execute(CatchExceptionTaskExecuter.java:34)
	at org.gradle.execution.taskgraph.DefaultTaskGraphExecuter$EventFiringTaskWorker$1.run(DefaultTaskGraphExecuter.java:248)
	at org.gradle.internal.progress.DefaultBuildOperationExecutor$RunnableBuildOperationWorker.execute(DefaultBuildOperationExecutor.java:336)
	at org.gradle.internal.progress.DefaultBuildOperationExecutor$RunnableBuildOperationWorker.execute(DefaultBuildOperationExecutor.java:328)
	at org.gradle.internal.progress.DefaultBuildOperationExecutor.execute(DefaultBuildOperationExecutor.java:199)
	at org.gradle.internal.progress.DefaultBuildOperationExecutor.run(DefaultBuildOperationExecutor.java:110)
	at org.gradle.execution.taskgraph.DefaultTaskGraphExecuter$EventFiringTaskWorker.execute(DefaultTaskGraphExecuter.java:241)
	at org.gradle.execution.taskgraph.DefaultTaskGraphExecuter$EventFiringTaskWorker.execute(DefaultTaskGraphExecuter.java:230)
	at org.gradle.execution.taskgraph.DefaultTaskPlanExecutor$TaskExecutorWorker.processTask(DefaultTaskPlanExecutor.java:123)
	at org.gradle.execution.taskgraph.DefaultTaskPlanExecutor$TaskExecutorWorker.access$200(DefaultTaskPlanExecutor.java:79)
	at org.gradle.execution.taskgraph.DefaultTaskPlanExecutor$TaskExecutorWorker$1.execute(DefaultTaskPlanExecutor.java:104)
	at org.gradle.execution.taskgraph.DefaultTaskPlanExecutor$TaskExecutorWorker$1.execute(DefaultTaskPlanExecutor.java:98)
	at org.gradle.execution.taskgraph.DefaultTaskExecutionPlan.execute(DefaultTaskExecutionPlan.java:625)
	at org.gradle.execution.taskgraph.DefaultTaskExecutionPlan.executeWithTask(DefaultTaskExecutionPlan.java:580)
	at org.gradle.execution.taskgraph.DefaultTaskPlanExecutor$TaskExecutorWorker.run(DefaultTaskPlanExecutor.java:98)
	at org.gradle.internal.concurrent.ExecutorPolicy$CatchAndRecordFailures.onExecute(ExecutorPolicy.java:63)
	at org.gradle.internal.concurrent.ManagedExecutorImpl$1.run(ManagedExecutorImpl.java:46)
	at java.util.concurrent.ThreadPoolExecutor.runWorker(ThreadPoolExecutor.java:1142)
	at java.util.concurrent.ThreadPoolExecutor$Worker.run(ThreadPoolExecutor.java:617)
	at org.gradle.internal.concurrent.ThreadFactoryImpl$ManagedThreadRunnable.run(ThreadFactoryImpl.java:55)
	at java.lang.Thread.run(Thread.java:745)
Caused by: org.gradle.api.GradleException: Javadoc generation failed. Generated Javadoc options
file (useful for troubleshooting): 'F:\jenkins\jenkins-slave\workspace\Polygene-develop-java8-windows-check\extensions\entitystore-berkeleydb\build\tmp\javadoc\javadoc.options'
	at org.gradle.api.tasks.javadoc.internal.JavadocGenerator.execute(JavadocGenerator.java:58)
	at org.gradle.api.tasks.javadoc.internal.JavadocGenerator.execute(JavadocGenerator.java:31)
	at org.gradle.api.tasks.javadoc.Javadoc.executeExternalJavadoc(Javadoc.java:156)
	at org.gradle.api.tasks.javadoc.Javadoc.generate(Javadoc.java:144)
	at sun.reflect.NativeMethodAccessorImpl.invoke0(Native Method)
	at sun.reflect.NativeMethodAccessorImpl.invoke(NativeMethodAccessorImpl.java:62)
	at sun.reflect.DelegatingMethodAccessorImpl.invoke(DelegatingMethodAccessorImpl.java:43)
	at java.lang.reflect.Method.invoke(Method.java:498)
	at org.gradle.internal.reflect.JavaMethod.invoke(JavaMethod.java:73)
	at org.gradle.api.internal.project.taskfactory.DefaultTaskClassInfoStore$StandardTaskAction.doExecute(DefaultTaskClassInfoStore.java:142)
	at org.gradle.api.internal.project.taskfactory.DefaultTaskClassInfoStore$StandardTaskAction.execute(DefaultTaskClassInfoStore.java:135)
	at org.gradle.api.internal.project.taskfactory.DefaultTaskClassInfoStore$StandardTaskAction.execute(DefaultTaskClassInfoStore.java:122)
	at org.gradle.api.internal.AbstractTask$TaskActionWrapper.execute(AbstractTask.java:762)
	at org.gradle.api.internal.AbstractTask$TaskActionWrapper.execute(AbstractTask.java:729)
	at org.gradle.api.internal.tasks.execution.ExecuteActionsTaskExecuter$1.run(ExecuteActionsTaskExecuter.java:121)
	at org.gradle.internal.progress.DefaultBuildOperationExecutor$RunnableBuildOperationWorker.execute(DefaultBuildOperationExecutor.java:336)
	at org.gradle.internal.progress.DefaultBuildOperationExecutor$RunnableBuildOperationWorker.execute(DefaultBuildOperationExecutor.java:328)
	at org.gradle.internal.progress.DefaultBuildOperationExecutor.execute(DefaultBuildOperationExecutor.java:199)
	at org.gradle.internal.progress.DefaultBuildOperationExecutor.run(DefaultBuildOperationExecutor.java:110)
	at org.gradle.api.internal.tasks.execution.ExecuteActionsTaskExecuter.executeAction(ExecuteActionsTaskExecuter.java:110)
	at org.gradle.api.internal.tasks.execution.ExecuteActionsTaskExecuter.executeActions(ExecuteActionsTaskExecuter.java:92)
	... 31 more
Caused by: org.gradle.process.internal.ExecException: Process 'command 'F:\jenkins\tools\java\latest1.8\bin\javadoc.exe''
finished with non-zero exit value 1
	at org.gradle.process.internal.DefaultExecHandle$ExecResultImpl.assertNormalExitValue(DefaultExecHandle.java:382)
	at org.gradle.process.internal.DefaultExecAction.execute(DefaultExecAction.java:31)
	at org.gradle.api.tasks.javadoc.internal.JavadocGenerator.execute(JavadocGenerator.java:53)
	... 51 more

==============================================================================

* Get more help at https://help.gradle.org

BUILD FAILED in 20m 24s
1232 actionable tasks: 1226 executed, 6 up-to-date
Build step 'Invoke Gradle script' changed build result to FAILURE
Build step 'Invoke Gradle script' marked build as failure
Recording test results

Mime
View raw message