polygene-dev mailing list archives

Site index · List index
Message view « Date » · « Thread »
Top « Date » · « Thread »
From Apache Jenkins Server <jenk...@builds.apache.org>
Subject Build failed in Jenkins: Polygene(JavaEdition)-develop-java8-checkDists #261
Date Mon, 17 Jul 2017 08:29:01 GMT
See <https://builds.apache.org/job/Polygene(JavaEdition)-develop-java8-checkDists/261/display/redirect?page=changes>

Changes:

[paulmerlin] Upgrade Gradle to 4.0.1

[paulmerlin] Upgrade Gradle Rat Plugin to 0.3.1

[paulmerlin] Upgrade ElasticSearch dependency version to 5.5

[paulmerlin] Upgrade other dependencies

------------------------------------------
[...truncated 421.17 KB...]
:internals:testsupport-internal:buildRedisDockerImage
Building image using context '<https://builds.apache.org/job/Polygene(JavaEdition)-develop-java8-checkDists/ws/internals/testsupport-internal/build/tmp/docker/redis'.>
Using Dockerfile '<https://builds.apache.org/job/Polygene(JavaEdition)-develop-java8-checkDists/ws/internals/testsupport-internal/build/tmp/docker/redis/Dockerfile'>
Using tag 'org.apache.polygene:org.apache.polygene.internal.docker-redis' for image.
Step 1/1 : FROM redis:4.0.0-alpine
---> 8fedae67fbf4
Successfully built 8fedae67fbf4
Successfully tagged org.apache.polygene:org.apache.polygene.internal.docker-redis
Created image with ID '8fedae67fbf4'.
:internals:testsupport-internal:buildRiakDockerfile
:internals:testsupport-internal:buildRiakDockerImage
Building image using context '<https://builds.apache.org/job/Polygene(JavaEdition)-develop-java8-checkDists/ws/internals/testsupport-internal/build/tmp/docker/riak'.>
Using Dockerfile '<https://builds.apache.org/job/Polygene(JavaEdition)-develop-java8-checkDists/ws/internals/testsupport-internal/build/tmp/docker/riak/Dockerfile'>
Using tag 'org.apache.polygene:org.apache.polygene.internal.docker-riak' for image.
Step 1/1 : FROM basho/riak-kv:ubuntu-2.2.3
---> 069fcbe2a12f
Successfully built 069fcbe2a12f
Successfully tagged org.apache.polygene:org.apache.polygene.internal.docker-riak
Created image with ID '069fcbe2a12f'.
:internals:testsupport-internal:buildS3serverDockerfile
:internals:testsupport-internal:buildS3serverDockerImage
Building image using context '<https://builds.apache.org/job/Polygene(JavaEdition)-develop-java8-checkDists/ws/internals/testsupport-internal/build/tmp/docker/s3server'.>
Using Dockerfile '<https://builds.apache.org/job/Polygene(JavaEdition)-develop-java8-checkDists/ws/internals/testsupport-internal/build/tmp/docker/s3server/Dockerfile'>
Using tag 'org.apache.polygene:org.apache.polygene.internal.docker-s3server' for image.
Step 1/3 : FROM scality/s3server:mem-bb2a38c0
---> fadaeaafc7c8
Step 2/3 : ENV SCALITY_ACCESS_KEY_ID dummyIdentifier
---> Running in 83a74613a13c
---> fbaeb56b1fa2
Removing intermediate container 83a74613a13c
Step 3/3 : ENV SCALITY_SECRET_ACCESS_KEY dummyCredential
---> Running in b11209b1b1ee
---> 32f7eeb1be46
Removing intermediate container b11209b1b1ee
Successfully built 32f7eeb1be46
Successfully tagged org.apache.polygene:org.apache.polygene.internal.docker-s3server
Created image with ID '32f7eeb1be46'.
:internals:testsupport-internal:compileJava
Download https://repo1.maven.org/maven2/com/fasterxml/jackson/datatype/jackson-datatype-guava/2.8.9/jackson-datatype-guava-2.8.9.jar
:internals:testsupport-internal:processResources NO-SOURCE
:internals:testsupport-internal:classes
:internals:testsupport-internal:osgiClasses
:internals:testsupport-internal:jar
:internals:testsupport-internal:assemble
:samples:dci:compileJavaNote: <https://builds.apache.org/job/Polygene(JavaEdition)-develop-java8-checkDists/ws/samples/dci/src/main/java/org/apache/polygene/dci/moneytransfer/context/Role.java>
uses unchecked or unsafe operations.
Note: Recompile with -Xlint:unchecked for details.

:samples:dci:processResources NO-SOURCE
:samples:dci:classes
:samples:dci:osgiClasses
:samples:dci:jar
:samples:dci:assemble
:samples:forum:compileJava
:samples:forum:processResources NO-SOURCE
:samples:forum:classes
:samples:forum:osgiClasses
:samples:forum:jar
:samples:forum:assemble
:samples:rental:compileJavaNote: <https://builds.apache.org/job/Polygene(JavaEdition)-develop-java8-checkDists/ws/samples/rental/src/main/java/org/apache/polygene/sample/rental/web/Page.java>
uses unchecked or unsafe operations.
Note: Recompile with -Xlint:unchecked for details.

:samples:rental:processResources
:samples:rental:classes
:samples:rental:war
Download https://repo1.maven.org/maven2/org/apache/johnzon/johnzon-core/1.1.1/johnzon-core-1.1.1.jar
:samples:rental:assemble
:samples:sql-support:compileJava
:samples:sql-support:processResources
:samples:sql-support:classes
:samples:sql-support:osgiClasses
:samples:sql-support:jar
:samples:sql-support:assemble
:samples:swing:compileJavaNote: Some input files use unchecked or unsafe operations.
Note: Recompile with -Xlint:unchecked for details.

:samples:swing:processResources NO-SOURCE
:samples:swing:classes
:samples:swing:osgiClasses
:samples:swing:jar
:samples:swing:assemble
:tests:performance:compileJava
:tests:performance:processResources NO-SOURCE
:tests:performance:classes
:tests:performance:osgiClasses
:tests:performance:jar
:tests:performance:assemble
:tests:regression:compileJava
:tests:regression:processResources NO-SOURCE
:tests:regression:classes
:tests:regression:osgiClasses
:tests:regression:jar
:tests:regression:assemble
:tools:generator-polygene:assemble UP-TO-DATE
:tutorials:cargo:compileJava
:tutorials:cargo:processResources NO-SOURCE
:tutorials:cargo:classes
:tutorials:cargo:osgiClasses
:tutorials:cargo:jar
:tutorials:cargo:assemble
:tutorials:composites:compileJava
:tutorials:composites:processResources NO-SOURCE
:tutorials:composites:classes
:tutorials:composites:osgiClasses
:tutorials:composites:jar
:tutorials:composites:assemble
:tutorials:hello:compileJava
:tutorials:hello:processResources NO-SOURCE
:tutorials:hello:classes
:tutorials:hello:osgiClasses
:tutorials:hello:jar
:tutorials:hello:assemble
:tutorials:introduction:compileJava
:tutorials:introduction:processResources NO-SOURCE
:tutorials:introduction:classes
:tutorials:introduction:osgiClasses
:tutorials:introduction:jar
:tutorials:introduction:assemble
:tutorials:services:compileJava
:tutorials:services:processResources
:tutorials:services:classes
:tutorials:services:osgiClasses
:tutorials:services:jar
:tutorials:services:assemble
:tutorials:introduction:tenminutes:compileJava
:tutorials:introduction:tenminutes:processResources NO-SOURCE
:tutorials:introduction:tenminutes:classes
:tutorials:introduction:tenminutes:osgiClasses
:tutorials:introduction:tenminutes:jar
:tutorials:introduction:tenminutes:assemble
:tutorials:introduction:thirtyminutes:compileJavaNote: <https://builds.apache.org/job/Polygene(JavaEdition)-develop-java8-checkDists/ws/tutorials/introduction/thirtyminutes/src/main/java/org/apache/polygene/demo/thirtyminutes/ThirtyMinutesDocs.java>
uses unchecked or unsafe operations.
Note: Recompile with -Xlint:unchecked for details.

:tutorials:introduction:thirtyminutes:processResources NO-SOURCE
:tutorials:introduction:thirtyminutes:classes
:tutorials:introduction:thirtyminutes:osgiClasses
:tutorials:introduction:thirtyminutes:jar
:tutorials:introduction:thirtyminutes:assemble
:tutorials:introduction:twominutes:compileJava
:tutorials:introduction:twominutes:processResources NO-SOURCE
:tutorials:introduction:twominutes:classes
:tutorials:introduction:twominutes:osgiClasses
:tutorials:introduction:twominutes:jar
:tutorials:introduction:twominutes:assemble
:distributions:stageBinaryDistribution
:distributions:ratBinaryDistribution
:distributions:checkBinaryDistribution
:distributions:stageSourceDistribution
:distributions:inspectSourceDistribution
:distributions:ratSourceDistribution FAILED
:distributions:buildSourceDistribution

FAILURE: Build failed with an exception.

* What went wrong:
Execution failed for task ':distributions:ratSourceDistribution'.
> javax.xml.transform.TransformerException: javax.xml.transform.TransformerException: com.sun.org.apache.xml.internal.utils.WrappedRuntimeException:
Invalid byte 1 of 1-byte UTF-8 sequence.

* Try:
Run with --info or --debug option to get more log output.

* Exception is:
org.gradle.api.tasks.TaskExecutionException: Execution failed for task ':distributions:ratSourceDistribution'.
	at org.gradle.api.internal.tasks.execution.ExecuteActionsTaskExecuter.executeActions(ExecuteActionsTaskExecuter.java:100)
	at org.gradle.api.internal.tasks.execution.ExecuteActionsTaskExecuter.execute(ExecuteActionsTaskExecuter.java:70)
	at org.gradle.api.internal.tasks.execution.SkipUpToDateTaskExecuter.execute(SkipUpToDateTaskExecuter.java:64)
	at org.gradle.api.internal.tasks.execution.ResolveTaskOutputCachingStateExecuter.execute(ResolveTaskOutputCachingStateExecuter.java:54)
	at org.gradle.api.internal.tasks.execution.ValidatingTaskExecuter.execute(ValidatingTaskExecuter.java:58)
	at org.gradle.api.internal.tasks.execution.SkipEmptySourceFilesTaskExecuter.execute(SkipEmptySourceFilesTaskExecuter.java:88)
	at org.gradle.api.internal.tasks.execution.ResolveTaskArtifactStateTaskExecuter.execute(ResolveTaskArtifactStateTaskExecuter.java:52)
	at org.gradle.api.internal.tasks.execution.SkipTaskWithNoActionsExecuter.execute(SkipTaskWithNoActionsExecuter.java:52)
	at org.gradle.api.internal.tasks.execution.SkipOnlyIfTaskExecuter.execute(SkipOnlyIfTaskExecuter.java:54)
	at org.gradle.api.internal.tasks.execution.ExecuteAtMostOnceTaskExecuter.execute(ExecuteAtMostOnceTaskExecuter.java:43)
	at org.gradle.api.internal.tasks.execution.CatchExceptionTaskExecuter.execute(CatchExceptionTaskExecuter.java:34)
	at org.gradle.execution.taskgraph.DefaultTaskGraphExecuter$EventFiringTaskWorker$1.run(DefaultTaskGraphExecuter.java:242)
	at org.gradle.internal.progress.DefaultBuildOperationExecutor$RunnableBuildOperationWorker.execute(DefaultBuildOperationExecutor.java:317)
	at org.gradle.internal.progress.DefaultBuildOperationExecutor$RunnableBuildOperationWorker.execute(DefaultBuildOperationExecutor.java:309)
	at org.gradle.internal.progress.DefaultBuildOperationExecutor.execute(DefaultBuildOperationExecutor.java:185)
	at org.gradle.internal.progress.DefaultBuildOperationExecutor.run(DefaultBuildOperationExecutor.java:95)
	at org.gradle.execution.taskgraph.DefaultTaskGraphExecuter$EventFiringTaskWorker.execute(DefaultTaskGraphExecuter.java:235)
	at org.gradle.execution.taskgraph.DefaultTaskGraphExecuter$EventFiringTaskWorker.execute(DefaultTaskGraphExecuter.java:224)
	at org.gradle.execution.taskgraph.DefaultTaskPlanExecutor$TaskExecutorWorker.processTask(DefaultTaskPlanExecutor.java:121)
	at org.gradle.execution.taskgraph.DefaultTaskPlanExecutor$TaskExecutorWorker.access$200(DefaultTaskPlanExecutor.java:77)
	at org.gradle.execution.taskgraph.DefaultTaskPlanExecutor$TaskExecutorWorker$1.execute(DefaultTaskPlanExecutor.java:102)
	at org.gradle.execution.taskgraph.DefaultTaskPlanExecutor$TaskExecutorWorker$1.execute(DefaultTaskPlanExecutor.java:96)
	at org.gradle.execution.taskgraph.DefaultTaskExecutionPlan.execute(DefaultTaskExecutionPlan.java:612)
	at org.gradle.execution.taskgraph.DefaultTaskExecutionPlan.executeWithTask(DefaultTaskExecutionPlan.java:567)
	at org.gradle.execution.taskgraph.DefaultTaskPlanExecutor$TaskExecutorWorker.run(DefaultTaskPlanExecutor.java:96)
	at org.gradle.internal.concurrent.ExecutorPolicy$CatchAndRecordFailures.onExecute(ExecutorPolicy.java:63)
	at org.gradle.internal.concurrent.StoppableExecutorImpl$1.run(StoppableExecutorImpl.java:46)
	at org.gradle.internal.concurrent.ThreadFactoryImpl$ManagedThreadRunnable.run(ThreadFactoryImpl.java:55)
Caused by: : javax.xml.transform.TransformerException: javax.xml.transform.TransformerException:
com.sun.org.apache.xml.internal.utils.WrappedRuntimeException: Invalid byte 1 of 1-byte UTF-8
sequence.
	at org.apache.tools.ant.taskdefs.XSLTProcess.handleTransformationError(XSLTProcess.java:1446)
	at org.apache.tools.ant.taskdefs.XSLTProcess.process(XSLTProcess.java:888)
	at org.apache.tools.ant.taskdefs.XSLTProcess.execute(XSLTProcess.java:416)
	at org.apache.tools.ant.UnknownElement.execute(UnknownElement.java:293)
	at org.apache.tools.ant.dispatch.DispatchUtils.execute(DispatchUtils.java:106)
	at org.gradle.api.internal.project.ant.BasicAntBuilder.nodeCompleted(BasicAntBuilder.java:78)
	at org.gradle.internal.metaobject.BeanDynamicObject$MetaClassAdapter.invokeMethod(BeanDynamicObject.java:479)
	at org.gradle.internal.metaobject.BeanDynamicObject.tryInvokeMethod(BeanDynamicObject.java:191)
	at org.gradle.internal.metaobject.AbstractDynamicObject.invokeMethod(AbstractDynamicObject.java:160)
	at org.gradle.api.internal.project.antbuilder.AntBuilderDelegate.nodeCompleted(AntBuilderDelegate.java:118)
	at org.apache.rat.gradle.RatTask$_generateHtmlReport_closure5.doCall(RatTask.groovy:188)
	at org.gradle.api.internal.ClosureBackedAction.execute(ClosureBackedAction.java:71)
	at org.gradle.api.internal.ClosureBackedAction.execute(ClosureBackedAction.java:53)
	at org.gradle.api.internal.project.antbuilder.DefaultIsolatedAntBuilder$2.execute(DefaultIsolatedAntBuilder.java:151)
	at org.gradle.api.internal.project.antbuilder.DefaultIsolatedAntBuilder$2.execute(DefaultIsolatedAntBuilder.java:133)
	at org.gradle.api.internal.project.antbuilder.ClassPathToClassLoaderCache.withCachedClassLoader(ClassPathToClassLoaderCache.java:134)
	at org.gradle.api.internal.project.antbuilder.DefaultIsolatedAntBuilder.execute(DefaultIsolatedAntBuilder.java:127)
	at org.gradle.api.internal.project.IsolatedAntBuilder$execute$0.call(Unknown Source)
	at org.apache.rat.gradle.RatTask.generateHtmlReport(RatTask.groovy:187)
	at org.apache.rat.gradle.RatTask.rat(RatTask.groovy:89)
	at org.gradle.internal.reflect.JavaMethod.invoke(JavaMethod.java:73)
	at org.gradle.api.internal.project.taskfactory.DefaultTaskClassInfoStore$StandardTaskAction.doExecute(DefaultTaskClassInfoStore.java:141)
	at org.gradle.api.internal.project.taskfactory.DefaultTaskClassInfoStore$StandardTaskAction.execute(DefaultTaskClassInfoStore.java:134)
	at org.gradle.api.internal.project.taskfactory.DefaultTaskClassInfoStore$StandardTaskAction.execute(DefaultTaskClassInfoStore.java:121)
	at org.gradle.api.internal.AbstractTask$TaskActionWrapper.execute(AbstractTask.java:711)
	at org.gradle.api.internal.AbstractTask$TaskActionWrapper.execute(AbstractTask.java:694)
	at org.gradle.api.internal.tasks.execution.ExecuteActionsTaskExecuter$1.run(ExecuteActionsTaskExecuter.java:122)
	at org.gradle.internal.progress.DefaultBuildOperationExecutor$RunnableBuildOperationWorker.execute(DefaultBuildOperationExecutor.java:317)
	at org.gradle.internal.progress.DefaultBuildOperationExecutor$RunnableBuildOperationWorker.execute(DefaultBuildOperationExecutor.java:309)
	at org.gradle.internal.progress.DefaultBuildOperationExecutor.execute(DefaultBuildOperationExecutor.java:185)
	at org.gradle.internal.progress.DefaultBuildOperationExecutor.run(DefaultBuildOperationExecutor.java:95)
	at org.gradle.api.internal.tasks.execution.ExecuteActionsTaskExecuter.executeAction(ExecuteActionsTaskExecuter.java:111)
	at org.gradle.api.internal.tasks.execution.ExecuteActionsTaskExecuter.executeActions(ExecuteActionsTaskExecuter.java:92)
	... 27 more
Caused by: javax.xml.transform.TransformerException: javax.xml.transform.TransformerException:
com.sun.org.apache.xml.internal.utils.WrappedRuntimeException: Invalid byte 1 of 1-byte UTF-8
sequence.
	at com.sun.org.apache.xalan.internal.xsltc.trax.TransformerImpl.transform(TransformerImpl.java:749)
	at com.sun.org.apache.xalan.internal.xsltc.trax.TransformerImpl.transform(TransformerImpl.java:351)
	at org.apache.tools.ant.taskdefs.optional.TraXLiaison.transform(TraXLiaison.java:197)
	at org.apache.tools.ant.taskdefs.XSLTProcess.process(XSLTProcess.java:878)
	... 58 more
Caused by: javax.xml.transform.TransformerException: com.sun.org.apache.xml.internal.utils.WrappedRuntimeException:
Invalid byte 1 of 1-byte UTF-8 sequence.
	at com.sun.org.apache.xalan.internal.xsltc.trax.TransformerImpl.getDOM(TransformerImpl.java:578)
	at com.sun.org.apache.xalan.internal.xsltc.trax.TransformerImpl.transform(TransformerImpl.java:739)
	... 61 more
Caused by: com.sun.org.apache.xml.internal.utils.WrappedRuntimeException: Invalid byte 1 of
1-byte UTF-8 sequence.
	at com.sun.org.apache.xalan.internal.xsltc.dom.XSLTCDTMManager.getDTM(XSLTCDTMManager.java:427)
	at com.sun.org.apache.xalan.internal.xsltc.dom.XSLTCDTMManager.getDTM(XSLTCDTMManager.java:215)
	at com.sun.org.apache.xalan.internal.xsltc.trax.TransformerImpl.getDOM(TransformerImpl.java:556)
	... 62 more


BUILD FAILED in 33m 13s
1018 actionable tasks: 1016 executed, 2 up-to-date
Build step 'Invoke Gradle script' changed build result to FAILURE
Build step 'Invoke Gradle script' marked build as failure
Archiving artifacts
Recording test results
Publishing Javadoc

Mime
View raw message