polygene-dev mailing list archives

Site index · List index
Message view « Date » · « Thread »
Top « Date » · « Thread »
From Apache Jenkins Server <jenk...@builds.apache.org>
Subject Build failed in Jenkins: Polygene(JavaEdition)-develop-java9-check #208
Date Thu, 13 Jul 2017 15:35:35 GMT
See <https://builds.apache.org/job/Polygene(JavaEdition)-develop-java9-check/208/display/redirect?page=changes>

Changes:

[paulmerlin] Forgot to assemble Shiro module

[paulmerlin] Get rid of warnings, and some reformatting of a messy class.

[paulmerlin] Added IndexingException, since no organized exception hierarchy exists

[paulmerlin] SqlIndexingException

[paulmerlin] Move IndexingException to API

[paulmerlin] Making ElasticSearchIndexingException extend from IndexingException

[paulmerlin] Better explanation in exceptions of RDF query execution.

[paulmerlin] Fix Exceptions in RDF Indexing

[paulmerlin] Fixed that Assmeblers tries to warn if assemble() method is forgotten.

[paulmerlin] Fix bugs in generator.

------------------------------------------
[...truncated 782.47 KB...]
│ │ │ ├─┬ glob@6.0.4 
│ │ │ │ ├── inflight@1.0.6  deduped
│ │ │ │ ├── inherits@2.0.3  deduped
│ │ │ │ ├── minimatch@3.0.4  deduped
│ │ │ │ ├── once@1.4.0  deduped
│ │ │ │ └── path-is-absolute@1.0.1  deduped
│ │ │ ├── object-assign@4.1.1 
│ │ │ ├── pify@2.3.0 
│ │ │ └── pinkie-promise@2.0.1  deduped
│ │ ├── mkdirp@0.5.1  deduped
│ │ ├─┬ multimatch@2.1.0 
│ │ │ ├── array-differ@1.0.0 
│ │ │ ├── array-union@1.0.2  deduped
│ │ │ ├── arrify@1.0.1  deduped
│ │ │ └── minimatch@3.0.4  deduped
│ │ ├── rimraf@2.6.1  deduped
│ │ ├── through2@2.0.3  deduped
│ │ └─┬ vinyl@1.2.0 
│ │   ├── clone@1.0.2 
│ │   ├── clone-stats@0.0.1 
│ │   └── replace-ext@0.0.1 
│ ├── mkdirp@0.5.1  deduped
│ ├─┬ nopt@3.0.6 
│ │ └── abbrev@1.1.0 
│ ├─┬ path-exists@2.1.0 
│ │ └── pinkie-promise@2.0.1  deduped
│ ├── path-is-absolute@1.0.1 
│ ├─┬ pretty-bytes@3.0.1 
│ │ └── number-is-nan@1.0.1  deduped
│ ├── read-chunk@1.0.1 
│ ├─┬ read-pkg-up@1.0.1 
│ │ ├── find-up@1.1.2  deduped
│ │ └─┬ read-pkg@1.1.0 
│ │   ├─┬ load-json-file@1.1.0 
│ │   │ ├── graceful-fs@4.1.11 
│ │   │ ├── parse-json@2.2.0  deduped
│ │   │ ├── pify@2.3.0  deduped
│ │   │ ├── pinkie-promise@2.0.1  deduped
│ │   │ └─┬ strip-bom@2.0.0 
│ │   │   └── is-utf8@0.2.1 
│ │   ├── normalize-package-data@2.4.0  deduped
│ │   └─┬ path-type@1.1.0 
│ │     ├── graceful-fs@4.1.11  deduped
│ │     ├── pify@2.3.0  deduped
│ │     └── pinkie-promise@2.0.1  deduped
│ ├─┬ rimraf@2.6.1 
│ │ └── glob@7.1.2  deduped
│ ├─┬ run-async@2.3.0 
│ │ └── is-promise@2.1.0 
│ ├─┬ shelljs@0.7.8 
│ │ ├── glob@7.1.2  deduped
│ │ ├── interpret@1.0.3  deduped
│ │ └── rechoir@0.6.2  deduped
│ ├── text-table@0.2.0 
│ ├─┬ through2@2.0.3 
│ │ ├─┬ readable-stream@2.3.3 
│ │ │ ├── core-util-is@1.0.2 
│ │ │ ├── inherits@2.0.3  deduped
│ │ │ ├── isarray@1.0.0 
│ │ │ ├── process-nextick-args@1.0.7 
│ │ │ ├── safe-buffer@5.1.1 
│ │ │ ├─┬ string_decoder@1.0.3 
│ │ │ │ └── safe-buffer@5.1.1  deduped
│ │ │ └── util-deprecate@1.0.2  deduped
│ │ └── xtend@4.0.1  deduped
│ ├─┬ underscore.string@3.3.4 
│ │ ├── sprintf-js@1.1.1 
│ │ └── util-deprecate@1.0.2 
│ ├─┬ user-home@2.0.0 
│ │ └── os-homedir@1.0.2 
│ ├── yeoman-assert@2.2.3 
│ ├─┬ yeoman-environment@1.6.6 
│ │ ├── chalk@1.1.3  deduped
│ │ ├── debug@2.6.8  deduped
│ │ ├── diff@2.2.3 
│ │ ├── escape-string-regexp@1.0.5  deduped
│ │ ├── globby@4.1.0  deduped
│ │ ├─┬ grouped-queue@0.3.3 
│ │ │ └── lodash@4.17.4  deduped
│ │ ├── inquirer@1.2.3  deduped
│ │ ├── lodash@4.17.4  deduped
│ │ ├─┬ log-symbols@1.0.2 
│ │ │ └── chalk@1.1.3  deduped
│ │ ├─┬ mem-fs@1.1.3 
│ │ │ ├── through2@2.0.3  deduped
│ │ │ ├── vinyl@1.2.0  deduped
│ │ │ └─┬ vinyl-file@2.0.0 
│ │ │   ├── graceful-fs@4.1.11  deduped
│ │ │   ├── pify@2.3.0  deduped
│ │ │   ├── pinkie-promise@2.0.1  deduped
│ │ │   ├── strip-bom@2.0.0  deduped
│ │ │   ├─┬ strip-bom-stream@2.0.0 
│ │ │   │ ├─┬ first-chunk-stream@2.0.0 
│ │ │   │ │ └── readable-stream@2.3.3  deduped
│ │ │   │ └── strip-bom@2.0.0  deduped
│ │ │   └── vinyl@1.2.0  deduped
│ │ ├── text-table@0.2.0  deduped
│ │ └─┬ untildify@2.1.0 
│ │   └── os-homedir@1.0.2  deduped
│ ├── yeoman-generator@1.1.1  extraneous
│ ├─┬ yeoman-test@1.7.0 
│ │ ├─┬ inquirer@3.2.0 
│ │ │ ├── ansi-escapes@2.0.0 
│ │ │ ├─┬ chalk@2.0.1 
│ │ │ │ ├─┬ ansi-styles@3.1.0 
│ │ │ │ │ └─┬ color-convert@1.9.0 
│ │ │ │ │   └── color-name@1.1.2 
│ │ │ │ ├── escape-string-regexp@1.0.5  deduped
│ │ │ │ └─┬ supports-color@4.2.0 
│ │ │ │   └── has-flag@2.0.0 
│ │ │ ├─┬ cli-cursor@2.1.0 
│ │ │ │ └─┬ restore-cursor@2.0.0 
│ │ │ │   ├─┬ onetime@2.0.1 
│ │ │ │   │ └── mimic-fn@1.1.0 
│ │ │ │   └── signal-exit@3.0.2  deduped
│ │ │ ├── cli-width@2.1.0  deduped
│ │ │ ├─┬ external-editor@2.0.4 
│ │ │ │ ├── iconv-lite@0.4.18 
│ │ │ │ ├── jschardet@1.4.2 
│ │ │ │ └─┬ tmp@0.0.31 
│ │ │ │   └── os-tmpdir@1.0.2  deduped
│ │ │ ├─┬ figures@2.0.0 
│ │ │ │ └── escape-string-regexp@1.0.5  deduped
│ │ │ ├── lodash@4.17.4  deduped
│ │ │ ├── mute-stream@0.0.7 
│ │ │ ├── run-async@2.3.0  deduped
│ │ │ ├── rx-lite@4.0.8 
│ │ │ ├─┬ rx-lite-aggregates@4.0.8 
│ │ │ │ └── rx-lite@4.0.8  deduped
│ │ │ ├─┬ string-width@2.1.0 
│ │ │ │ ├── is-fullwidth-code-point@2.0.0 
│ │ │ │ └── strip-ansi@4.0.0  deduped
│ │ │ ├─┬ strip-ansi@4.0.0 
│ │ │ │ └── ansi-regex@3.0.0 
│ │ │ └── through@2.3.8  deduped
│ │ ├── lodash@4.17.4  deduped
│ │ ├── mkdirp@0.5.1  deduped
│ │ ├── pinkie-promise@2.0.1  deduped
│ │ ├── rimraf@2.6.1  deduped
│ │ ├─┬ sinon@2.3.8 
│ │ │ ├── diff@3.3.0 
│ │ │ ├─┬ formatio@1.2.0 
│ │ │ │ └── samsam@1.2.1  deduped
│ │ │ ├── lolex@1.6.0 
│ │ │ ├── native-promise-only@0.8.1 
│ │ │ ├─┬ path-to-regexp@1.7.0 
│ │ │ │ └── isarray@0.0.1 
│ │ │ ├── samsam@1.2.1 
│ │ │ ├── text-encoding@0.6.4 
│ │ │ └── type-detect@4.0.3 
│ │ └─┬ yeoman-environment@2.0.0 
│ │   ├── chalk@1.1.3  deduped
│ │   ├── debug@2.6.8  deduped
│ │   ├── diff@3.3.0 
│ │   ├── escape-string-regexp@1.0.5  deduped
│ │   ├─┬ globby@6.1.0 
│ │   │ ├── array-union@1.0.2  deduped
│ │   │ ├── glob@7.1.2  deduped
│ │   │ ├── object-assign@4.1.1 
│ │   │ ├── pify@2.3.0  deduped
│ │   │ └── pinkie-promise@2.0.1  deduped
│ │   ├── grouped-queue@0.3.3  deduped
│ │   ├── inquirer@3.2.0  deduped
│ │   ├─┬ is-scoped@1.0.0 
│ │   │ └── scoped-regex@1.0.0 
│ │   ├── lodash@4.17.4  deduped
│ │   ├── log-symbols@1.0.2  deduped
│ │   ├── mem-fs@1.1.3  deduped
│ │   ├── text-table@0.2.0  deduped
│ │   └── untildify@3.0.2 
│ └─┬ yeoman-welcome@1.0.1 
│   └── chalk@1.1.3  deduped
└─┬ yeoman-test@1.6.0 
  ├─┬ inquirer@1.2.3 
  │ ├── ansi-escapes@1.4.0 
  │ ├── chalk@1.1.3  deduped
  │ ├─┬ cli-cursor@1.0.2 
  │ │ └─┬ restore-cursor@1.0.1 
  │ │   ├── exit-hook@1.1.1 
  │ │   └── onetime@1.1.0 
  │ ├── cli-width@2.1.0 
  │ ├─┬ external-editor@1.1.1 
  │ │ ├── extend@3.0.1 
  │ │ ├─┬ spawn-sync@1.0.15 
  │ │ │ ├─┬ concat-stream@1.6.0 
  │ │ │ │ ├── inherits@2.0.3  deduped
  │ │ │ │ ├── readable-stream@2.3.3  deduped
  │ │ │ │ └── typedarray@0.0.6 
  │ │ │ └── os-shim@0.1.3 
  │ │ └─┬ tmp@0.0.29 
  │ │   └── os-tmpdir@1.0.2 
  │ ├─┬ figures@1.7.0 
  │ │ ├── escape-string-regexp@1.0.5  deduped
  │ │ └── object-assign@4.1.1 
  │ ├── lodash@4.17.4  deduped
  │ ├── mute-stream@0.0.6 
  │ ├── pinkie-promise@2.0.1  deduped
  │ ├── run-async@2.3.0  deduped
  │ ├── rx@4.1.0 
  │ ├─┬ string-width@1.0.2 
  │ │ ├── code-point-at@1.1.0 
  │ │ ├─┬ is-fullwidth-code-point@1.0.0 
  │ │ │ └── number-is-nan@1.0.1  deduped
  │ │ └── strip-ansi@3.0.1  deduped
  │ ├── strip-ansi@3.0.1  deduped
  │ └── through@2.3.8 
  ├── lodash@4.17.4  deduped
  ├── mkdirp@0.5.1  deduped
  ├─┬ pinkie-promise@2.0.1 
  │ └── pinkie@2.0.4 
  ├── rimraf@2.6.1  deduped
  ├─┬ sinon@1.17.7 
  │ ├─┬ formatio@1.1.1 
  │ │ └── samsam@1.1.2  deduped
  │ ├── lolex@1.3.2 
  │ ├── samsam@1.1.2 
  │ └── util@0.10.3  deduped
  ├── yeoman-environment@1.6.6  deduped
  └── yeoman-generator@0.24.1  deduped

:tools:generator-polygene:prepareTemplateGradleWrapper
:tools:generator-polygene:setsCurrentVersionToPackageJson
:tools:generator-polygene:npmTest SKIPPED
:tools:generator-polygene:check UP-TO-DATE
:tools:model-detail:honkerCheck
:tools:model-detail:check
:tutorials:cargo:check
:tutorials:composites:check
:tutorials:hello:check
:tutorials:introduction:check UP-TO-DATE
:tutorials:services:check
:tutorials:introduction:tenminutes:check UP-TO-DATE
:tutorials:introduction:thirtyminutes:check UP-TO-DATE
:tutorials:introduction:twominutes:check UP-TO-DATE

FAILURE: Build failed with an exception.

* What went wrong:
Execution failed for task ':core:runtime:test'.
> There were failing tests. See the report at: file://<https://builds.apache.org/job/Polygene(JavaEdition)-develop-java9-check/ws/core/runtime/build/reports/tests/test/index.html>

* Try:
Run with --stacktrace option to get the stack trace. Run with --info or --debug option to
get more log output.

BUILD FAILED in 18m 48s
1194 actionable tasks: 1113 executed, 81 up-to-date
Build step 'Invoke Gradle script' changed build result to FAILURE
Build step 'Invoke Gradle script' marked build as failure
Recording test results

Mime
View raw message