polygene-dev mailing list archives

Site index · List index
Message view « Date » · « Thread »
Top « Date » · « Thread »
From Niclas Hedhman <nic...@hedhman.org>
Subject Re: Build failed in Jenkins: Polygene(JavaEdition)-develop-java8-check #402
Date Sat, 24 Jun 2017 05:04:01 GMT
This is an interesting failure... It can't happen... yet it did!


if( modelVisitor.visitEnter( this ) )
{
    constraints.accept( modelVisitor );
    concerns.accept( modelVisitor );
    sideEffects.accept( modelVisitor );  // This line is NullPointException
}
return modelVisitor.visitLeave( this );


So, sideEffects is null. There is no stack trace clean up in the assembly
code, which is being executed here.


Why do I say that it can't happen. Because sideeffects can't be null...

private final SideEffectsModel sideEffects;

public CompositeMethodModel( Method method,
                             ConstraintsModel constraintsModel,
                             ConcernsModel concernsModel,
                             SideEffectsModel sideEffectsModel,
                             MixinsModel mixinsModel
)
{
    this.method = method;
    mixins = mixinsModel;
    concerns = concernsModel;
    sideEffects = sideEffectsModel;


there is no way that there is an execution path that can get hold of "this"
object and call the first snippet. So, sideEffects must have been assigned
in the constructor.

The constructor is called from CompositeAssemblyImpl.java:291 and it gets
its sideEffectsModel argument from sideEffectsFor in
CompositeAssemblyImpl.java:703, and that method CAN NOT return null.


But it has happened! So can anyone provide anything better than
"malfunction in JVM or CPU". And I doubt that we can trigger this again.

Any takers for ideas?

Niclas

On Sat, Jun 24, 2017 at 11:27 AM, Apache Jenkins Server <
jenkins@builds.apache.org> wrote:

> See <https://builds.apache.org/job/Polygene(JavaEdition)-
> develop-java8-check/402/display/redirect?page=changes>
>
> Changes:
>
> [niclas] Reverting the check that Composites are not allowed in @Uses. My
>
> [niclas] Optimized Imports
>
> ------------------------------------------
> [...truncated 462.39 KB...]
> <https://builds.apache.org/job/Polygene(JavaEdition)-
> develop-java8-check/ws/libraries/restlet/src/main/
> java/org/apache/polygene/library/restlet/serialization/
> PolygeneConverter.java>:79: warning: no @param for <T>
>     protected <T> Representation create( Representation source, Class<T>
> objectClass )
>                                  ^
>
> 4 warnings
> :libraries:restlet:javadocJar
> :libraries:restlet:sourceJar
> :libraries:restlet:testSourceJar
> :libraries:restlet:signArchives SKIPPED
> :libraries:restlet:uploadStageArchivesCould not find metadata
> org.apache.polygene.libraries:org.apache.polygene.library.
> restlet:3.0-SNAPSHOT/maven-metadata.xml in remote (file://<https://builds.
> apache.org/job/Polygene(JavaEdition)-develop-java8-
> check/ws/libraries/restlet/build/stage/archives)>
> Could not find metadata org.apache.polygene.libraries:
> org.apache.polygene.library.restlet/maven-metadata.xml in remote (file://<
> https://builds.apache.org/job/Polygene(JavaEdition)-develop-java8-
> check/ws/libraries/restlet/build/stage/archives)>
>
> :libraries:scripting:osgiClasses
> :libraries:scripting:compileVersionGroovy NO-SOURCE
> :libraries:scripting:processVersionResources NO-SOURCE
> :libraries:scripting:versionClasses
> :libraries:scripting:jar
> :libraries:scripting:javadoc
> :libraries:scripting:javadocJar
> :libraries:scripting:sourceJar
> :libraries:scripting:testSourceJar
> :libraries:scripting:signArchives SKIPPED
> :libraries:scripting:uploadStageArchivesCould not find metadata
> org.apache.polygene.libraries:org.apache.polygene.library.
> scripting:3.0-SNAPSHOT/maven-metadata.xml in remote (file://<
> https://builds.apache.org/job/Polygene(JavaEdition)-develop-java8-
> check/ws/libraries/scripting/build/stage/archives)>
> Could not find metadata org.apache.polygene.libraries:
> org.apache.polygene.library.scripting/maven-metadata.xml in remote
> (file://<https://builds.apache.org/job/Polygene(
> JavaEdition)-develop-java8-check/ws/libraries/scripting/
> build/stage/archives)>
>
> :libraries:servlet:javadoc
> :libraries:servlet:javadocJar
> :libraries:servlet:sourceJar
> :libraries:servlet:testSourceJar
> :libraries:servlet:signArchives SKIPPED
> :libraries:servlet:uploadStageArchivesCould not find metadata
> org.apache.polygene.libraries:org.apache.polygene.library.
> servlet:3.0-SNAPSHOT/maven-metadata.xml in remote (file://<https://builds.
> apache.org/job/Polygene(JavaEdition)-develop-java8-
> check/ws/libraries/servlet/build/stage/archives)>
> Could not find metadata org.apache.polygene.libraries:
> org.apache.polygene.library.servlet/maven-metadata.xml in remote (file://<
> https://builds.apache.org/job/Polygene(JavaEdition)-develop-java8-
> check/ws/libraries/servlet/build/stage/archives)>
>
> :libraries:shiro-core:javadoc<https://builds.apache.org/job/
> Polygene(JavaEdition)-develop-java8-check/ws/libraries/
> shiro-core/src/main/java/org/apache/polygene/library/shiro/
> ini/ShiroIniConfiguration.java>:34: warning: no @return
>     Property<String> iniResourcePath();
>                      ^
> <https://builds.apache.org/job/Polygene(JavaEdition)-
> develop-java8-check/ws/libraries/shiro-core/src/main/
> java/org/apache/polygene/library/shiro/concerns/RequiresPermissions.java>:40:
> warning: no @return
>     String value();
>            ^
> <https://builds.apache.org/job/Polygene(JavaEdition)-
> develop-java8-check/ws/libraries/shiro-core/src/main/
> java/org/apache/polygene/library/shiro/concerns/RequiresRoles.java>:40:
> warning: no @return
>     String value();
>            ^
> <https://builds.apache.org/job/Polygene(JavaEdition)-
> develop-java8-check/ws/libraries/shiro-core/src/main/
> java/org/apache/polygene/library/shiro/domain/passwords/
> PasswordRealmConfiguration.java>:32: warning: no @return
>     Property<String> hashAlgorithmName();
>                      ^
> <https://builds.apache.org/job/Polygene(JavaEdition)-
> develop-java8-check/ws/libraries/shiro-core/src/main/
> java/org/apache/polygene/library/shiro/domain/passwords/
> PasswordRealmConfiguration.java>:38: warning: no @return
>     Property<Integer> hashIterationsCount();
>                       ^
>
> 5 warnings
> :libraries:shiro-core:javadocJar
> :libraries:shiro-core:sourceJar
> :libraries:shiro-core:testSourceJar
> :libraries:shiro-core:signArchives SKIPPED
> :libraries:shiro-core:uploadStageArchivesCould not find metadata
> org.apache.polygene.libraries:org.apache.polygene.library.
> shiro-core:3.0-SNAPSHOT/maven-metadata.xml in remote (file://<
> https://builds.apache.org/job/Polygene(JavaEdition)-develop-java8-
> check/ws/libraries/shiro-core/build/stage/archives)>
> Could not find metadata org.apache.polygene.libraries:
> org.apache.polygene.library.shiro-core/maven-metadata.xml in remote
> (file://<https://builds.apache.org/job/Polygene(
> JavaEdition)-develop-java8-check/ws/libraries/shiro-core/
> build/stage/archives)>
>
> :libraries:shiro-web:javadoc
> :libraries:shiro-web:javadocJar
> :libraries:shiro-web:sourceJar
> :libraries:shiro-web:testSourceJar
> :libraries:shiro-web:signArchives SKIPPED
> :libraries:shiro-web:uploadStageArchivesCould not find metadata
> org.apache.polygene.libraries:org.apache.polygene.library.
> shiro-web:3.0-SNAPSHOT/maven-metadata.xml in remote (file://<
> https://builds.apache.org/job/Polygene(JavaEdition)-develop-java8-
> check/ws/libraries/shiro-web/build/stage/archives)>
> Could not find metadata org.apache.polygene.libraries:
> org.apache.polygene.library.shiro-web/maven-metadata.xml in remote
> (file://<https://builds.apache.org/job/Polygene(
> JavaEdition)-develop-java8-check/ws/libraries/shiro-web/
> build/stage/archives)>
>
> :libraries:spring:osgiClasses
> :libraries:spring:processVersionResources NO-SOURCE
> :libraries:spring:versionClasses
> :libraries:spring:jar
> :libraries:spring:javadoc
> :libraries:spring:javadocJar
> :libraries:spring:sourceJar
> :libraries:spring:testSourceJar
> :libraries:spring:signArchives SKIPPED
> :libraries:spring:uploadStageArchivesCould not find metadata
> org.apache.polygene.libraries:org.apache.polygene.library.
> spring:3.0-SNAPSHOT/maven-metadata.xml in remote (file://<https://builds.
> apache.org/job/Polygene(JavaEdition)-develop-java8-
> check/ws/libraries/spring/build/stage/archives)>
> Could not find metadata org.apache.polygene.libraries:
> org.apache.polygene.library.spring/maven-metadata.xml in remote (file://<
> https://builds.apache.org/job/Polygene(JavaEdition)-develop-java8-
> check/ws/libraries/spring/build/stage/archives)>
>
> :libraries:sql:javadoc<https://builds.apache.org/job/
> Polygene(JavaEdition)-develop-java8-check/ws/libraries/sql/
> src/main/java/org/apache/polygene/library/sql/common/SQLConfiguration.java>:35:
> warning: no @return
>     Property<String> schemaName();
>                      ^
>
> 1 warning
> :libraries:sql:javadocJar
> :libraries:sql:sourceJar
> :libraries:sql:testSourceJar
> :libraries:sql:signArchives SKIPPED
> :libraries:sql:uploadStageArchivesCould not find metadata
> org.apache.polygene.libraries:org.apache.polygene.library.
> sql:3.0-SNAPSHOT/maven-metadata.xml in remote (file://<https://builds.
> apache.org/job/Polygene(JavaEdition)-develop-java8-
> check/ws/libraries/sql/build/stage/archives)>
> Could not find metadata org.apache.polygene.libraries:
> org.apache.polygene.library.sql/maven-metadata.xml in remote (file://<
> https://builds.apache.org/job/Polygene(JavaEdition)-develop-java8-
> check/ws/libraries/sql/build/stage/archives)>
>
> :libraries:sql-bonecp:javadoc
> :libraries:sql-bonecp:javadocJar
> :libraries:sql-bonecp:sourceJar
> :libraries:sql-bonecp:testSourceJar
> :libraries:sql-bonecp:signArchives SKIPPED
> :libraries:sql-bonecp:uploadStageArchivesCould not find metadata
> org.apache.polygene.libraries:org.apache.polygene.library.
> sql-bonecp:3.0-SNAPSHOT/maven-metadata.xml in remote (file://<
> https://builds.apache.org/job/Polygene(JavaEdition)-develop-java8-
> check/ws/libraries/sql-bonecp/build/stage/archives)>
> Could not find metadata org.apache.polygene.libraries:
> org.apache.polygene.library.sql-bonecp/maven-metadata.xml in remote
> (file://<https://builds.apache.org/job/Polygene(
> JavaEdition)-develop-java8-check/ws/libraries/sql-bonecp/
> build/stage/archives)>
>
> :libraries:sql-dbcp:javadoc
> :libraries:sql-dbcp:javadocJar
> :libraries:sql-dbcp:sourceJar
> :libraries:sql-dbcp:testSourceJar
> :libraries:sql-dbcp:signArchives SKIPPED
> :libraries:sql-dbcp:uploadStageArchivesCould not find metadata
> org.apache.polygene.libraries:org.apache.polygene.library.
> sql-dbcp:3.0-SNAPSHOT/maven-metadata.xml in remote (file://<
> https://builds.apache.org/job/Polygene(JavaEdition)-develop-java8-
> check/ws/libraries/sql-dbcp/build/stage/archives)>
> Could not find metadata org.apache.polygene.libraries:
> org.apache.polygene.library.sql-dbcp/maven-metadata.xml in remote
> (file://<https://builds.apache.org/job/Polygene(
> JavaEdition)-develop-java8-check/ws/libraries/sql-dbcp/
> build/stage/archives)>
>
> :libraries:sql-generator:javadoc<https://builds.apache.
> org/job/Polygene(JavaEdition)-develop-java8-check/ws/
> libraries/sql-generator/src/main/java/org/apache/polygene/
> library/sql/generator/grammar/common/datatypes/SQLTime.java>:41: warning:
> no @return
>     Boolean isWithTimeZone();
>             ^
> <https://builds.apache.org/job/Polygene(JavaEdition)-
> develop-java8-check/ws/libraries/sql-generator/src/
> main/java/org/apache/polygene/library/sql/generator/grammar/
> common/datatypes/SQLTimeStamp.java>:39: warning: no @return
>     Boolean isWithTimeZone();
>             ^
> <https://builds.apache.org/job/Polygene(JavaEdition)-
> develop-java8-check/ws/libraries/sql-generator/src/
> main/java/org/apache/polygene/library/sql/generator/grammar/
> builders/query/ColumnsBuilder.java>:54: warning: no @return
>     ColumnsBuilder addNamedColumns( ColumnReferenceInfo... namedColumns );
>                    ^
> <https://builds.apache.org/job/Polygene(JavaEdition)-
> develop-java8-check/ws/libraries/sql-generator/src/
> main/java/org/apache/polygene/library/sql/generator/grammar/
> builders/query/QueryBuilder.java>:169: warning: no @param for
> setQuantifier
>     QueryBuilder except( SetQuantifier setQuantifier, CorrespondingSpec
> correspondingSpec,
>                  ^
> <https://builds.apache.org/job/Polygene(JavaEdition)-
> develop-java8-check/ws/libraries/sql-generator/src/
> main/java/org/apache/polygene/library/sql/generator/grammar/
> builders/query/QueryBuilder.java>:169: warning: no @param for
> correspondingSpec
>     QueryBuilder except( SetQuantifier setQuantifier, CorrespondingSpec
> correspondingSpec,
>                  ^
> <https://builds.apache.org/job/Polygene(JavaEdition)-
> develop-java8-check/ws/libraries/sql-generator/src/
> main/java/org/apache/polygene/library/sql/generator/grammar/
> builders/query/QuerySpecificationBuilder.java>:94: warning: no @param for
> builder
>     QuerySpecificationBuilder setSelect( ColumnsBuilder builder );
>                               ^
> <https://builds.apache.org/job/Polygene(JavaEdition)-
> develop-java8-check/ws/libraries/sql-generator/src/
> main/java/org/apache/polygene/library/sql/generator/grammar/
> builders/query/QuerySpecificationBuilder.java>:101: warning: no @param
> for builder
>     QuerySpecificationBuilder setFrom( FromBuilder builder );
>                               ^
> <https://builds.apache.org/job/Polygene(JavaEdition)-
> develop-java8-check/ws/libraries/sql-generator/src/
> main/java/org/apache/polygene/library/sql/generator/grammar/
> builders/query/QuerySpecificationBuilder.java>:108: warning: no @param
> for builder
>     QuerySpecificationBuilder setWhere( BooleanBuilder builder );
>                               ^
> <https://builds.apache.org/job/Polygene(JavaEdition)-
> develop-java8-check/ws/libraries/sql-generator/src/
> main/java/org/apache/polygene/library/sql/generator/grammar/
> builders/query/QuerySpecificationBuilder.java>:115: warning: no @param
> for builder
>     QuerySpecificationBuilder setGroupBy( GroupByBuilder builder );
>                               ^
> <https://builds.apache.org/job/Polygene(JavaEdition)-
> develop-java8-check/ws/libraries/sql-generator/src/
> main/java/org/apache/polygene/library/sql/generator/grammar/
> builders/query/QuerySpecificationBuilder.java>:122: warning: no @param
> for builder
>     QuerySpecificationBuilder setHaving( BooleanBuilder builder );
>                               ^
> <https://builds.apache.org/job/Polygene(JavaEdition)-
> develop-java8-check/ws/libraries/sql-generator/src/
> main/java/org/apache/polygene/library/sql/generator/grammar/
> builders/query/QuerySpecificationBuilder.java>:129: warning: no @param
> for builder
>     QuerySpecificationBuilder setOrderBy( OrderByBuilder builder );
>                               ^
> <https://builds.apache.org/job/Polygene(JavaEdition)-
> develop-java8-check/ws/libraries/sql-generator/src/
> main/java/org/apache/polygene/library/sql/generator/Typeable.java>:36:
> warning: empty <p> tag
>  * <p>
>    ^
> <https://builds.apache.org/job/Polygene(JavaEdition)-
> develop-java8-check/ws/libraries/sql-generator/src/
> main/java/org/apache/polygene/library/sql/generator/grammar/
> modification/pgsql/PgSQLInsertStatement.java>:29: warning: empty <p> tag
>  * <p>
>    ^
>
> 13 warnings
> :libraries:sql-generator:javadocJar
> :libraries:sql-generator:sourceJar
> :libraries:sql-generator:testSourceJar
> :libraries:sql-generator:signArchives SKIPPED
> :libraries:sql-generator:uploadStageArchivesCould not find metadata
> org.apache.polygene.libraries:org.apache.polygene.library.
> sql-generator:3.0-SNAPSHOT/maven-metadata.xml in remote (file://<
> https://builds.apache.org/job/Polygene(JavaEdition)-develop-java8-
> check/ws/libraries/sql-generator/build/stage/archives)>
> Could not find metadata org.apache.polygene.libraries:
> org.apache.polygene.library.sql-generator/maven-metadata.xml in remote
> (file://<https://builds.apache.org/job/Polygene(
> JavaEdition)-develop-java8-check/ws/libraries/sql-
> generator/build/stage/archives)>
>
> :libraries:sql-liquibase:javadoc
> :libraries:sql-liquibase:javadocJar
> :libraries:sql-liquibase:sourceJar
> :libraries:sql-liquibase:testSourceJar
> :libraries:sql-liquibase:signArchives SKIPPED
> :libraries:sql-liquibase:uploadStageArchivesCould not find metadata
> org.apache.polygene.libraries:org.apache.polygene.library.
> sql-liquibase:3.0-SNAPSHOT/maven-metadata.xml in remote (file://<
> https://builds.apache.org/job/Polygene(JavaEdition)-develop-java8-
> check/ws/libraries/sql-liquibase/build/stage/archives)>
> Could not find metadata org.apache.polygene.libraries:
> org.apache.polygene.library.sql-liquibase/maven-metadata.xml in remote
> (file://<https://builds.apache.org/job/Polygene(
> JavaEdition)-develop-java8-check/ws/libraries/sql-
> liquibase/build/stage/archives)>
>
> :libraries:uid:osgiClasses
> :libraries:uid:processVersionResources NO-SOURCE
> :libraries:uid:versionClasses
> :libraries:uid:jar
> :libraries:uid:javadoc
> :libraries:uid:javadocJar
> :libraries:uid:sourceJar
> :libraries:uid:testSourceJar
> :libraries:uid:signArchives SKIPPED
> :libraries:uid:uploadStageArchivesCould not find metadata
> org.apache.polygene.libraries:org.apache.polygene.library.
> uid:3.0-SNAPSHOT/maven-metadata.xml in remote (file://<https://builds.
> apache.org/job/Polygene(JavaEdition)-develop-java8-
> check/ws/libraries/uid/build/stage/archives)>
> Could not find metadata org.apache.polygene.libraries:
> org.apache.polygene.library.uid/maven-metadata.xml in remote (file://<
> https://builds.apache.org/job/Polygene(JavaEdition)-develop-java8-
> check/ws/libraries/uid/build/stage/archives)>
>
> :libraries:uowfile:osgiClasses
> :libraries:uowfile:processVersionResources NO-SOURCE
> :libraries:uowfile:versionClasses
> :libraries:uowfile:jar
> :libraries:uowfile:javadoc<https://builds.apache.org/job/
> Polygene(JavaEdition)-develop-java8-check/ws/libraries/
> uowfile/src/main/java/org/apache/polygene/library/
> uowfile/plural/HasUoWFiles.java>:38: warning: no @param for key
>     File attachedFile( T key );
>          ^
> <https://builds.apache.org/job/Polygene(JavaEdition)-
> develop-java8-check/ws/libraries/uowfile/src/main/
> java/org/apache/polygene/library/uowfile/plural/HasUoWFiles.java>:38:
> warning: no @return
>     File attachedFile( T key );
>          ^
> <https://builds.apache.org/job/Polygene(JavaEdition)-
> develop-java8-check/ws/libraries/uowfile/src/main/
> java/org/apache/polygene/library/uowfile/plural/HasUoWFiles.java>:43:
> warning: no @return
>     Iterable<File> attachedFiles();
>                    ^
>
> 3 warnings
> :libraries:uowfile:javadocJar
> :libraries:uowfile:sourceJar
> :libraries:uowfile:testSourceJar
> :libraries:uowfile:signArchives SKIPPED
> :libraries:uowfile:uploadStageArchivesCould not find metadata
> org.apache.polygene.libraries:org.apache.polygene.library.
> uowfile:3.0-SNAPSHOT/maven-metadata.xml in remote (file://<https://builds.
> apache.org/job/Polygene(JavaEdition)-develop-java8-
> check/ws/libraries/uowfile/build/stage/archives)>
> Could not find metadata org.apache.polygene.libraries:
> org.apache.polygene.library.uowfile/maven-metadata.xml in remote (file://<
> https://builds.apache.org/job/Polygene(JavaEdition)-develop-java8-
> check/ws/libraries/uowfile/build/stage/archives)>
>
> :tools:envisage:osgiClasses
> :tools:envisage:processVersionResources NO-SOURCE
> :tools:envisage:versionClasses
> :tools:envisage:jar
> :tools:envisage:javadoc
> :tools:envisage:javadocJar
> :tools:envisage:sourceJar
> :tools:envisage:testSourceJar
> :tools:envisage:signArchives SKIPPED
> :tools:envisage:uploadStageArchivesCould not find metadata
> org.apache.polygene.tools:org.apache.polygene.tool.envisage:
> 3.0-SNAPSHOT/maven-metadata.xml in remote (file://<https://builds.
> apache.org/job/Polygene(JavaEdition)-develop-java8-
> check/ws/tools/envisage/build/stage/archives)>
> Could not find metadata org.apache.polygene.tools:org.
> apache.polygene.tool.envisage/maven-metadata.xml in remote (file://<
> https://builds.apache.org/job/Polygene(JavaEdition)-develop-java8-
> check/ws/tools/envisage/build/stage/archives)>
>
> :tools:model-detail:javadoc
> :tools:model-detail:javadocJar
> :tools:model-detail:sourceJar
> :tools:model-detail:testSourceJar
> :tools:model-detail:signArchives SKIPPED
> :tools:model-detail:uploadStageArchivesCould not find metadata
> org.apache.polygene.tools:org.apache.polygene.tool.model-
> detail:3.0-SNAPSHOT/maven-metadata.xml in remote (file://<https://builds.
> apache.org/job/Polygene(JavaEdition)-develop-java8-
> check/ws/tools/model-detail/build/stage/archives)>
> Could not find metadata org.apache.polygene.tools:org.
> apache.polygene.tool.model-detail/maven-metadata.xml in remote (file://<
> https://builds.apache.org/job/Polygene(JavaEdition)-develop-java8-
> check/ws/tools/model-detail/build/stage/archives)>
>
> :distributions:stageBinariesMavenRepository
> :tools:generator-polygene:generateStageMavenRepositoryInitScript
> :tools:generator-polygene:nodeSetup UP-TO-DATE
> :tools:generator-polygene:npmSetup UP-TO-DATE
> :tools:generator-polygene:npmInstall UP-TO-DATE
> :tools:generator-polygene:prepareTemplateGradleWrapper UP-TO-DATE
> :tools:generator-polygene:setsCurrentVersionToPackageJson
> :tools:generator-polygene:npmTest SKIPPED
> :tools:generator-polygene:check UP-TO-DATE
> :tools:model-detail:honkerCheck
> :tools:model-detail:check
> :tutorials:cargo:check
> :tutorials:composites:check
> :tutorials:hello:check
> :tutorials:introduction:check UP-TO-DATE
> :tutorials:services:check
> :tutorials:introduction:tenminutes:check UP-TO-DATE
> :tutorials:introduction:thirtyminutes:check UP-TO-DATE
> :tutorials:introduction:twominutes:check UP-TO-DATE
>
> FAILURE: Build failed with an exception.
>
> * What went wrong:
> Execution failed for task ':core:api:test'.
> > There were failing tests. See the report at: file://<
> https://builds.apache.org/job/Polygene(JavaEdition)-
> develop-java8-check/ws/core/api/build/reports/tests/test/index.html>
>
> * Try:
> Run with --stacktrace option to get the stack trace. Run with --info or
> --debug option to get more log output.
>
> BUILD FAILED in 14m 51s
> 1197 actionable tasks: 1192 executed, 5 up-to-date
> Build step 'Invoke Gradle script' changed build result to FAILURE
> Build step 'Invoke Gradle script' marked build as failure
> Recording test results
>



-- 
Niclas Hedhman, Software Developer
http://polygene.apache.org - New Energy for Java

Mime
  • Unnamed multipart/alternative (inline, None, 0 bytes)
View raw message