polygene-dev mailing list archives

Site index · List index
Message view « Date » · « Thread »
Top « Date » · « Thread »
From Apache Jenkins Server <jenk...@builds.apache.org>
Subject Build failed in Jenkins: Polygene(JavaEdition)-develop-java9-check #155
Date Mon, 15 May 2017 11:49:50 GMT
See <https://builds.apache.org/job/Polygene(JavaEdition)-develop-java9-check/155/display/redirect?page=changes>

Changes:

[niclas] POLYGENE-251 - Fixed Concerns/SideEffects being invoke on default

------------------------------------------
[...truncated 687.59 KB...]
                     ^
<https://builds.apache.org/job/Polygene(JavaEdition)-develop-java9-check/ws/libraries/shiro-core/src/main/java/org/apache/polygene/library/shiro/domain/passwords/PasswordRealmConfiguration.java>:38:
warning: no @return
    Property<Integer> hashIterationsCount();
                      ^
<https://builds.apache.org/job/Polygene(JavaEdition)-develop-java9-check/ws/libraries/uowfile/src/main/java/org/apache/polygene/library/uowfile/plural/HasUoWFiles.java>:38:
warning: no @param for key
    File attachedFile( T key );
         ^
<https://builds.apache.org/job/Polygene(JavaEdition)-develop-java9-check/ws/libraries/uowfile/src/main/java/org/apache/polygene/library/uowfile/plural/HasUoWFiles.java>:38:
warning: no @return
    File attachedFile( T key );
         ^
<https://builds.apache.org/job/Polygene(JavaEdition)-develop-java9-check/ws/libraries/uowfile/src/main/java/org/apache/polygene/library/uowfile/plural/HasUoWFiles.java>:43:
warning: no @return
    Iterable<File> attachedFiles();
                   ^
<https://builds.apache.org/job/Polygene(JavaEdition)-develop-java9-check/ws/libraries/sql-generator/src/main/java/org/apache/polygene/library/sql/generator/grammar/builders/query/ColumnsBuilder.java>:54:
warning: no @return
    ColumnsBuilder addNamedColumns( ColumnReferenceInfo... namedColumns );
                   ^
<https://builds.apache.org/job/Polygene(JavaEdition)-develop-java9-check/ws/libraries/sql-generator/src/main/java/org/apache/polygene/library/sql/generator/grammar/builders/query/QueryBuilder.java>:169:
warning: no @param for setQuantifier
    QueryBuilder except( SetQuantifier setQuantifier, CorrespondingSpec correspondingSpec,
                 ^
<https://builds.apache.org/job/Polygene(JavaEdition)-develop-java9-check/ws/libraries/sql-generator/src/main/java/org/apache/polygene/library/sql/generator/grammar/builders/query/QueryBuilder.java>:169:
warning: no @param for correspondingSpec
    QueryBuilder except( SetQuantifier setQuantifier, CorrespondingSpec correspondingSpec,
                 ^
<https://builds.apache.org/job/Polygene(JavaEdition)-develop-java9-check/ws/libraries/sql-generator/src/main/java/org/apache/polygene/library/sql/generator/grammar/builders/query/QuerySpecificationBuilder.java>:94:
warning: no @param for builder
    QuerySpecificationBuilder setSelect( ColumnsBuilder builder );
                              ^
<https://builds.apache.org/job/Polygene(JavaEdition)-develop-java9-check/ws/libraries/sql-generator/src/main/java/org/apache/polygene/library/sql/generator/grammar/builders/query/QuerySpecificationBuilder.java>:101:
warning: no @param for builder
    QuerySpecificationBuilder setFrom( FromBuilder builder );
                              ^
<https://builds.apache.org/job/Polygene(JavaEdition)-develop-java9-check/ws/libraries/sql-generator/src/main/java/org/apache/polygene/library/sql/generator/grammar/builders/query/QuerySpecificationBuilder.java>:108:
warning: no @param for builder
    QuerySpecificationBuilder setWhere( BooleanBuilder builder );
                              ^
<https://builds.apache.org/job/Polygene(JavaEdition)-develop-java9-check/ws/libraries/sql-generator/src/main/java/org/apache/polygene/library/sql/generator/grammar/builders/query/QuerySpecificationBuilder.java>:115:
warning: no @param for builder
    QuerySpecificationBuilder setGroupBy( GroupByBuilder builder );
                              ^
<https://builds.apache.org/job/Polygene(JavaEdition)-develop-java9-check/ws/libraries/sql-generator/src/main/java/org/apache/polygene/library/sql/generator/grammar/builders/query/QuerySpecificationBuilder.java>:122:
warning: no @param for builder
    QuerySpecificationBuilder setHaving( BooleanBuilder builder );
                              ^
<https://builds.apache.org/job/Polygene(JavaEdition)-develop-java9-check/ws/libraries/sql-generator/src/main/java/org/apache/polygene/library/sql/generator/grammar/builders/query/QuerySpecificationBuilder.java>:129:
warning: no @param for builder
    QuerySpecificationBuilder setOrderBy( OrderByBuilder builder );
                              ^
<https://builds.apache.org/job/Polygene(JavaEdition)-develop-java9-check/ws/extensions/entitystore-redis/src/main/java/org/apache/polygene/entitystore/redis/RedisEntityStoreConfiguration.java>:38:
warning: no @return
    Property<String> host();
                     ^
<https://builds.apache.org/job/Polygene(JavaEdition)-develop-java9-check/ws/extensions/entitystore-redis/src/main/java/org/apache/polygene/entitystore/redis/RedisEntityStoreConfiguration.java>:46:
warning: no @return
    Property<Integer> port();
                      ^
<https://builds.apache.org/job/Polygene(JavaEdition)-develop-java9-check/ws/extensions/entitystore-redis/src/main/java/org/apache/polygene/entitystore/redis/RedisEntityStoreConfiguration.java>:54:
warning: no @return
    Property<Integer> timeout();
                      ^
<https://builds.apache.org/job/Polygene(JavaEdition)-develop-java9-check/ws/extensions/entitystore-redis/src/main/java/org/apache/polygene/entitystore/redis/RedisEntityStoreConfiguration.java>:60:
warning: no @return
    Property<String> password();
                     ^
<https://builds.apache.org/job/Polygene(JavaEdition)-develop-java9-check/ws/extensions/entitystore-redis/src/main/java/org/apache/polygene/entitystore/redis/RedisEntityStoreConfiguration.java>:68:
warning: no @return
    Property<Integer> database();
                      ^
<https://builds.apache.org/job/Polygene(JavaEdition)-develop-java9-check/ws/libraries/restlet/src/main/java/org/apache/polygene/library/restlet/serialization/FormRepresentation.java>:99:
warning: no description for @throws
     * @throws IOException
       ^
<https://builds.apache.org/job/Polygene(JavaEdition)-develop-java9-check/ws/libraries/restlet/src/main/java/org/apache/polygene/library/restlet/serialization/JsonRepresentation.java>:87:
warning: no description for @throws
     * @throws IOException
       ^
<https://builds.apache.org/job/Polygene(JavaEdition)-develop-java9-check/ws/libraries/restlet/src/main/java/org/apache/polygene/library/restlet/serialization/PolygeneConverter.java>:65:
warning: no @param for <T>
    protected <T> Representation create( MediaType mediaType, T source )
                                 ^
<https://builds.apache.org/job/Polygene(JavaEdition)-develop-java9-check/ws/libraries/restlet/src/main/java/org/apache/polygene/library/restlet/serialization/PolygeneConverter.java>:79:
warning: no @param for <T>
    protected <T> Representation create( Representation source, Class<T> objectClass
)
                                 ^
<https://builds.apache.org/job/Polygene(JavaEdition)-develop-java9-check/ws/core/testsupport/src/main/java/org/apache/polygene/test/serialization/AbstractValueCompositeSerializationTest.java>:312:
warning: no @param for module
    protected static Some buildSomeValue( Module module, UnitOfWork uow, String identity )
                          ^
<https://builds.apache.org/job/Polygene(JavaEdition)-develop-java9-check/ws/core/testsupport/src/main/java/org/apache/polygene/test/serialization/AbstractValueCompositeSerializationTest.java>:312:
warning: no @param for uow
    protected static Some buildSomeValue( Module module, UnitOfWork uow, String identity )
                          ^
<https://builds.apache.org/job/Polygene(JavaEdition)-develop-java9-check/ws/core/testsupport/src/main/java/org/apache/polygene/test/serialization/AbstractValueCompositeSerializationTest.java>:312:
warning: no @param for identity
    protected static Some buildSomeValue( Module module, UnitOfWork uow, String identity )
                          ^
<https://builds.apache.org/job/Polygene(JavaEdition)-develop-java9-check/ws/core/testsupport/src/main/java/org/apache/polygene/test/serialization/AbstractValueCompositeSerializationTest.java>:337:
warning: no @param for module
    protected static Some buildSomeEntity( Module module, UnitOfWork uow, Identity identity
)
                          ^
<https://builds.apache.org/job/Polygene(JavaEdition)-develop-java9-check/ws/core/testsupport/src/main/java/org/apache/polygene/test/serialization/AbstractValueCompositeSerializationTest.java>:337:
warning: no @param for uow
    protected static Some buildSomeEntity( Module module, UnitOfWork uow, Identity identity
)
                          ^
<https://builds.apache.org/job/Polygene(JavaEdition)-develop-java9-check/ws/core/testsupport/src/main/java/org/apache/polygene/test/serialization/AbstractValueCompositeSerializationTest.java>:337:
warning: no @param for identity
    protected static Some buildSomeEntity( Module module, UnitOfWork uow, Identity identity
)
                          ^
<https://builds.apache.org/job/Polygene(JavaEdition)-develop-java9-check/ws/extensions/entitystore-sql/src/main/java/org/apache/polygene/entitystore/sql/SQLMapEntityStoreConfiguration.java>:39:
warning: no @return
    Property<String> entityTableName();
                     ^
<https://builds.apache.org/job/Polygene(JavaEdition)-develop-java9-check/ws/extensions/entitystore-sql/src/main/java/org/apache/polygene/entitystore/sql/SQLMapEntityStoreConfiguration.java>:45:
warning: no @return
    Property<Boolean> createIfMissing();
                      ^

63 warnings
:core:api:honkerCheck
:core:api:check
:core:bootstrap:honkerCheck
:core:bootstrap:check
:core:runtime:honkerCheck
:core:spi:honkerCheck
:core:spi:check
:core:testsupport:honkerCheck
:core:testsupport:check
:extensions:cache-ehcache:honkerCheck
:extensions:cache-ehcache:check
:extensions:cache-memcache:honkerCheck
:extensions:cache-memcache:check
:extensions:entitystore-cassandra:honkerCheck
:extensions:entitystore-cassandra:check
:extensions:entitystore-file:honkerCheck
:extensions:entitystore-file:check
:extensions:entitystore-geode:honkerCheck
:extensions:entitystore-geode:check
:extensions:entitystore-hazelcast:honkerCheck
:extensions:entitystore-hazelcast:check
:extensions:entitystore-jclouds:honkerCheck
:extensions:entitystore-jclouds:check
:extensions:entitystore-jdbm:honkerCheck
:extensions:entitystore-jdbm:check
:extensions:entitystore-leveldb:honkerCheck
:extensions:entitystore-leveldb:check
:extensions:entitystore-memory:honkerCheck
:extensions:entitystore-memory:check
:extensions:entitystore-mongodb:honkerCheck
:extensions:entitystore-mongodb:check
:extensions:entitystore-preferences:honkerCheck
:extensions:entitystore-preferences:check
:extensions:entitystore-redis:honkerCheck
:extensions:entitystore-redis:check
:extensions:entitystore-riak:honkerCheck
:extensions:entitystore-riak:check
:extensions:entitystore-sql:honkerCheck
:extensions:entitystore-sql:check
:extensions:indexing-elasticsearch:honkerCheck
:extensions:indexing-elasticsearch:check
:extensions:indexing-rdf:honkerCheck
:extensions:indexing-rdf:check
:extensions:indexing-solr:honkerCheck
:extensions:indexing-solr:check
:extensions:indexing-sql:honkerCheck
:extensions:indexing-sql:check
:extensions:metrics-codahale:honkerCheck
:extensions:metrics-codahale:check
:extensions:migration:honkerCheck
:extensions:migration:check
:extensions:reindexer:honkerCheck
:extensions:reindexer:check
:extensions:serialization-javaxjson:honkerCheck
:extensions:serialization-javaxjson:check
:extensions:serialization-javaxxml:honkerCheck
:extensions:serialization-javaxxml:check
:extensions:serialization-messagepack:honkerCheck
:extensions:serialization-messagepack:check
:internals:testsupport-internal:check UP-TO-DATE
:libraries:alarm:honkerCheck
:libraries:alarm:check
:libraries:circuitbreaker:honkerCheck
:libraries:circuitbreaker:check
:libraries:constraints:honkerCheck
:libraries:constraints:check
:libraries:fileconfig:honkerCheck
:libraries:fileconfig:check
:libraries:http:honkerCheck
:libraries:http:check
:libraries:invocation-cache:honkerCheck
:libraries:invocation-cache:check
:libraries:jmx:honkerCheck
:libraries:jmx:check
:libraries:locking:honkerCheck
:libraries:locking:check
:libraries:logging:honkerCheck
:libraries:logging:check
:libraries:osgi:honkerCheck
:libraries:osgi:check
:libraries:rdf:honkerCheck
:libraries:rdf:check
:libraries:rest:honkerCheck
:libraries:rest:check
:libraries:rest-client:honkerCheck
:libraries:rest-client:check
:libraries:rest-common:honkerCheck
:libraries:rest-common:check
:libraries:rest-server:honkerCheck
:libraries:rest-server:check
:libraries:restlet:honkerCheck
:libraries:restlet:check
:libraries:scripting:honkerCheck
:libraries:scripting:check
:libraries:servlet:honkerCheck
:libraries:servlet:check
:libraries:shiro-core:honkerCheck
:libraries:shiro-core:check
:libraries:shiro-web:honkerCheck
:libraries:shiro-web:check
:libraries:spring:honkerCheck
:libraries:spring:check
:libraries:sql:honkerCheck
:libraries:sql:check
:libraries:sql-bonecp:honkerCheck
:libraries:sql-bonecp:check
:libraries:sql-dbcp:honkerCheck
:libraries:sql-dbcp:check
:libraries:sql-generator:honkerCheck
:libraries:sql-generator:check
:libraries:sql-liquibase:honkerCheck
:libraries:sql-liquibase:check
:libraries:uid:honkerCheck
:libraries:uid:check
:libraries:uowfile:honkerCheck
:libraries:uowfile:check
:samples:dci:check
:samples:forum:check
:samples:rental:check UP-TO-DATE
:samples:sql-support:check UP-TO-DATE
:samples:swing:check UP-TO-DATE
:tests:performance:compilePerfJava
:tests:performance:compilePerfJava - is not incremental (e.g. outputs have changed, no previous
execution, etc.).
warning: [options] bootstrap class path not set in conjunction with -source 1.8
1 warning
:tests:performance:check
:tests:regression:check UP-TO-DATE
:tools:envisage:honkerCheck
:tools:envisage:check
:tools:generator-polygene:check UP-TO-DATE
:tools:model-detail:honkerCheck
:tools:model-detail:check
:tutorials:cargo:check
:tutorials:composites:check
:tutorials:hello:check
:tutorials:introduction:check UP-TO-DATE
:tutorials:services:check
:tutorials:introduction:tenminutes:check UP-TO-DATE
:tutorials:introduction:thirtyminutes:check UP-TO-DATE
:tutorials:introduction:twominutes:check UP-TO-DATE

FAILURE: Build failed with an exception.

* What went wrong:
Execution failed for task ':core:runtime:test'.
> There were failing tests. See the report at: file://<https://builds.apache.org/job/Polygene(JavaEdition)-develop-java9-check/ws/core/runtime/build/reports/tests/test/index.html>

* Try:
Run with --stacktrace option to get the stack trace. Run with --info or --debug option to
get more log output.

BUILD FAILED

Total time: 12 mins 47.746 secs
Build step 'Invoke Gradle script' changed build result to FAILURE
Build step 'Invoke Gradle script' marked build as failure
Recording test results

Mime
View raw message