polygene-dev mailing list archives

Site index · List index
Message view « Date » · « Thread »
Top « Date » · « Thread »
From Apache Jenkins Server <jenk...@builds.apache.org>
Subject Build failed in Jenkins: Polygene(JavaEdition)-develop-java9-check #158
Date Mon, 15 May 2017 13:15:22 GMT
See <https://builds.apache.org/job/Polygene(JavaEdition)-develop-java9-check/158/display/redirect?page=changes>

Changes:

[niclas] POLYGENE-251 - Testcase for Generic Concerns and Generic SideEffects.

------------------------------------------
[...truncated 886.42 KB...]
| | | |   `-- prepend-http@1.0.4 
| | | +-- object-assign@4.1.1 
| | | `-- pinkie-promise@2.0.1  deduped
| | `-- meow@3.7.0  deduped
| +-- glob@7.1.1  deduped
| +-- gruntfile-editor@1.2.1 
| | +-- ast-query@2.0.0 
| | | +-- acorn-jsx@3.0.1 
| | | | `-- acorn@3.3.0 
| | | +-- class-extend@0.1.2  deduped
| | | +-- escodegen-wallaby@1.6.11 
| | | | +-- esprima@2.7.3 
| | | | +-- estraverse@1.9.3 
| | | | +-- esutils@2.0.2 
| | | | +-- optionator@0.8.2 
| | | | | +-- deep-is@0.1.3 
| | | | | +-- fast-levenshtein@2.0.6 
| | | | | +-- levn@0.3.0 
| | | | | | +-- prelude-ls@1.1.2  deduped
| | | | | | `-- type-check@0.3.2  deduped
| | | | | +-- prelude-ls@1.1.2 
| | | | | +-- type-check@0.3.2 
| | | | | | `-- prelude-ls@1.1.2  deduped
| | | | | `-- wordwrap@1.0.0 
| | | | `-- source-map@0.2.0 
| | | |   `-- amdefine@1.0.1 
| | | +-- lodash@4.17.4  deduped
| | | `-- traverse@0.6.6 
| | `-- lodash@4.17.4  deduped
| +-- html-wiring@1.2.0 
| | +-- cheerio@0.19.0 
| | | +-- css-select@1.0.0 
| | | | +-- boolbase@1.0.0 
| | | | +-- css-what@1.0.0 
| | | | +-- domutils@1.4.3 
| | | | | `-- domelementtype@1.3.0  deduped
| | | | `-- nth-check@1.0.1 
| | | |   `-- boolbase@1.0.0  deduped
| | | +-- dom-serializer@0.1.0 
| | | | +-- domelementtype@1.1.3 
| | | | `-- entities@1.1.1  deduped
| | | +-- entities@1.1.1 
| | | +-- htmlparser2@3.8.3 
| | | | +-- domelementtype@1.3.0 
| | | | +-- domhandler@2.3.0 
| | | | | `-- domelementtype@1.3.0  deduped
| | | | +-- domutils@1.5.1 
| | | | | +-- dom-serializer@0.1.0  deduped
| | | | | `-- domelementtype@1.3.0  deduped
| | | | +-- entities@1.0.0 
| | | | `-- readable-stream@1.1.14 
| | | |   +-- core-util-is@1.0.2  deduped
| | | |   +-- inherits@2.0.3  deduped
| | | |   +-- isarray@0.0.1 
| | | |   `-- string_decoder@0.10.31 
| | | `-- lodash@3.10.1 
| | `-- detect-newline@1.0.3 
| |   +-- get-stdin@4.0.1  deduped
| |   `-- minimist@1.2.0  deduped
| +-- istextorbinary@2.1.0 
| | +-- binaryextensions@2.0.0 
| | +-- editions@1.3.3 
| | `-- textextensions@2.1.0 
| +-- lodash@4.17.4 
| +-- mem-fs-editor@2.3.0 
| | +-- commondir@1.0.1 
| | +-- deep-extend@0.4.2 
| | +-- ejs@2.5.6 
| | +-- glob@7.1.1  deduped
| | +-- globby@4.1.0 
| | | +-- array-union@1.0.2 
| | | | `-- array-uniq@1.0.3 
| | | +-- arrify@1.0.1 
| | | +-- glob@6.0.4 
| | | | +-- inflight@1.0.6  deduped
| | | | +-- inherits@2.0.3  deduped
| | | | +-- minimatch@3.0.4  deduped
| | | | +-- once@1.4.0  deduped
| | | | `-- path-is-absolute@1.0.1  deduped
| | | +-- object-assign@4.1.1 
| | | +-- pify@2.3.0 
| | | `-- pinkie-promise@2.0.1  deduped
| | +-- mkdirp@0.5.1  deduped
| | +-- multimatch@2.1.0 
| | | +-- array-differ@1.0.0 
| | | +-- array-union@1.0.2  deduped
| | | +-- arrify@1.0.1  deduped
| | | `-- minimatch@3.0.4  deduped
| | +-- rimraf@2.6.1  deduped
| | +-- through2@2.0.3  deduped
| | `-- vinyl@1.2.0 
| |   +-- clone@1.0.2 
| |   +-- clone-stats@0.0.1 
| |   `-- replace-ext@0.0.1 
| +-- mkdirp@0.5.1  deduped
| +-- nopt@3.0.6 
| | `-- abbrev@1.1.0 
| +-- path-exists@2.1.0 
| | `-- pinkie-promise@2.0.1  deduped
| +-- path-is-absolute@1.0.1 
| +-- pretty-bytes@3.0.1 
| | `-- number-is-nan@1.0.1  deduped
| +-- read-chunk@1.0.1 
| +-- read-pkg-up@1.0.1 
| | +-- find-up@1.1.2  deduped
| | `-- read-pkg@1.1.0 
| |   +-- load-json-file@1.1.0 
| |   | +-- graceful-fs@4.1.11 
| |   | +-- parse-json@2.2.0  deduped
| |   | +-- pify@2.3.0  deduped
| |   | +-- pinkie-promise@2.0.1  deduped
| |   | `-- strip-bom@2.0.0 
| |   |   `-- is-utf8@0.2.1 
| |   +-- normalize-package-data@2.3.8  deduped
| |   `-- path-type@1.1.0 
| |     +-- graceful-fs@4.1.11  deduped
| |     +-- pify@2.3.0  deduped
| |     `-- pinkie-promise@2.0.1  deduped
| +-- rimraf@2.6.1 
| | `-- glob@7.1.1  deduped
| +-- run-async@2.3.0 
| | `-- is-promise@2.1.0 
| +-- shelljs@0.7.7  deduped
| +-- text-table@0.2.0 
| +-- through2@2.0.3 
| | +-- readable-stream@2.2.9 
| | | +-- buffer-shims@1.0.0 
| | | +-- core-util-is@1.0.2 
| | | +-- inherits@2.0.3  deduped
| | | +-- isarray@1.0.0 
| | | +-- process-nextick-args@1.0.7 
| | | +-- string_decoder@1.0.0 
| | | | `-- buffer-shims@1.0.0  deduped
| | | `-- util-deprecate@1.0.2  deduped
| | `-- xtend@4.0.1  deduped
| +-- underscore.string@3.3.4 
| | +-- sprintf-js@1.1.0 
| | `-- util-deprecate@1.0.2 
| +-- user-home@2.0.0 
| | `-- os-homedir@1.0.2 
| +-- yeoman-assert@2.2.3 
| +-- yeoman-environment@1.6.6 
| | +-- chalk@1.1.3  deduped
| | +-- debug@2.6.6  deduped
| | +-- diff@2.2.3 
| | +-- escape-string-regexp@1.0.5  deduped
| | +-- globby@4.1.0  deduped
| | +-- grouped-queue@0.3.3 
| | | `-- lodash@4.17.4  deduped
| | +-- inquirer@1.2.3  deduped
| | +-- lodash@4.17.4  deduped
| | +-- log-symbols@1.0.2 
| | | `-- chalk@1.1.3  deduped
| | +-- mem-fs@1.1.3 
| | | +-- through2@2.0.3  deduped
| | | +-- vinyl@1.2.0  deduped
| | | `-- vinyl-file@2.0.0 
| | |   +-- graceful-fs@4.1.11  deduped
| | |   +-- pify@2.3.0  deduped
| | |   +-- pinkie-promise@2.0.1  deduped
| | |   +-- strip-bom@2.0.0  deduped
| | |   +-- strip-bom-stream@2.0.0 
| | |   | +-- first-chunk-stream@2.0.0 
| | |   | | `-- readable-stream@2.2.9  deduped
| | |   | `-- strip-bom@2.0.0  deduped
| | |   `-- vinyl@1.2.0  deduped
| | +-- text-table@0.2.0  deduped
| | `-- untildify@2.1.0 
| |   `-- os-homedir@1.0.2  deduped
| +-- yeoman-test@1.6.0  deduped
| `-- yeoman-welcome@1.0.1 
|   `-- chalk@1.1.3  deduped
`-- yeoman-test@1.6.0 
  +-- inquirer@1.2.3 
  | +-- ansi-escapes@1.4.0 
  | +-- chalk@1.1.3  deduped
  | +-- cli-cursor@1.0.2 
  | | `-- restore-cursor@1.0.1 
  | |   +-- exit-hook@1.1.1 
  | |   `-- onetime@1.1.0 
  | +-- cli-width@2.1.0 
  | +-- external-editor@1.1.1 
  | | +-- extend@3.0.1 
  | | +-- spawn-sync@1.0.15 
  | | | +-- concat-stream@1.6.0 
  | | | | +-- inherits@2.0.3  deduped
  | | | | +-- readable-stream@2.2.9  deduped
  | | | | `-- typedarray@0.0.6 
  | | | `-- os-shim@0.1.3 
  | | `-- tmp@0.0.29 
  | |   `-- os-tmpdir@1.0.2 
  | +-- figures@1.7.0 
  | | +-- escape-string-regexp@1.0.5  deduped
  | | `-- object-assign@4.1.1 
  | +-- lodash@4.17.4  deduped
  | +-- mute-stream@0.0.6 
  | +-- pinkie-promise@2.0.1  deduped
  | +-- run-async@2.3.0  deduped
  | +-- rx@4.1.0 
  | +-- string-width@1.0.2 
  | | +-- code-point-at@1.1.0 
  | | +-- is-fullwidth-code-point@1.0.0 
  | | | `-- number-is-nan@1.0.1  deduped
  | | `-- strip-ansi@3.0.1  deduped
  | +-- strip-ansi@3.0.1  deduped
  | `-- through@2.3.8 
  +-- lodash@4.17.4  deduped
  +-- mkdirp@0.5.1  deduped
  +-- pinkie-promise@2.0.1 
  | `-- pinkie@2.0.4 
  +-- rimraf@2.6.1  deduped
  +-- sinon@1.17.7 
  | +-- formatio@1.1.1 
  | | `-- samsam@1.1.2  deduped
  | +-- lolex@1.3.2 
  | +-- samsam@1.1.2 
  | `-- util@0.10.3  deduped
  +-- yeoman-environment@1.6.6  deduped
  `-- yeoman-generator@0.24.1  deduped

:tools:generator-polygene:setsCurrentVersionToPackageJson
:tools:generator-polygene:npmTest SKIPPED
:tools:generator-polygene:check UP-TO-DATE
:tools:model-detail:honkerCheck
:tools:model-detail:check
:tutorials:cargo:check
:tutorials:composites:check
:tutorials:hello:check
:tutorials:introduction:check UP-TO-DATE
:tutorials:services:check
:tutorials:introduction:tenminutes:check UP-TO-DATE
:tutorials:introduction:thirtyminutes:check UP-TO-DATE
:tutorials:introduction:twominutes:check UP-TO-DATE

FAILURE: Build failed with an exception.

* What went wrong:
Execution failed for task ':core:runtime:test'.
> There were failing tests. See the report at: file://<https://builds.apache.org/job/Polygene(JavaEdition)-develop-java9-check/ws/core/runtime/build/reports/tests/test/index.html>

* Try:
Run with --stacktrace option to get the stack trace. Run with --info or --debug option to
get more log output.

BUILD FAILED

Total time: 15 mins 3.125 secs
Build step 'Invoke Gradle script' changed build result to FAILURE
Build step 'Invoke Gradle script' marked build as failure
Recording test results

Mime
View raw message