polygene-dev mailing list archives

Site index · List index
Message view « Date » · « Thread »
Top « Date » · « Thread »
From Apache Jenkins Server <jenk...@builds.apache.org>
Subject Build failed in Jenkins: Polygene(JavaEdition)-develop-java8-check #338
Date Sun, 23 Apr 2017 15:57:05 GMT
See <https://builds.apache.org/job/Polygene(JavaEdition)-develop-java8-check/338/display/redirect?page=changes>

Changes:

[paulmerlin] build: integrate tools/generator-polygene into the build system

------------------------------------------
[...truncated 578.78 KB...]
│ │ ├── commondir@1.0.1 
│ │ ├── deep-extend@0.4.1 
│ │ ├── ejs@2.5.6 
│ │ ├── glob@7.1.1  deduped
│ │ ├─┬ globby@4.1.0 
│ │ │ ├─┬ array-union@1.0.2 
│ │ │ │ └── array-uniq@1.0.3 
│ │ │ ├── arrify@1.0.1 
│ │ │ ├─┬ glob@6.0.4 
│ │ │ │ ├── inflight@1.0.6  deduped
│ │ │ │ ├── inherits@2.0.3  deduped
│ │ │ │ ├── minimatch@3.0.3  deduped
│ │ │ │ ├── once@1.4.0  deduped
│ │ │ │ └── path-is-absolute@1.0.1  deduped
│ │ │ ├── object-assign@4.1.1 
│ │ │ ├── pify@2.3.0 
│ │ │ └── pinkie-promise@2.0.1  deduped
│ │ ├── mkdirp@0.5.1  deduped
│ │ ├─┬ multimatch@2.1.0 
│ │ │ ├── array-differ@1.0.0 
│ │ │ ├── array-union@1.0.2  deduped
│ │ │ ├── arrify@1.0.1  deduped
│ │ │ └── minimatch@3.0.3  deduped
│ │ ├── rimraf@2.6.1  deduped
│ │ ├── through2@2.0.3  deduped
│ │ └─┬ vinyl@1.2.0 
│ │   ├── clone@1.0.2 
│ │   ├── clone-stats@0.0.1 
│ │   └── replace-ext@0.0.1 
│ ├── mkdirp@0.5.1  deduped
│ ├─┬ nopt@3.0.6 
│ │ └── abbrev@1.1.0 
│ ├─┬ path-exists@2.1.0 
│ │ └── pinkie-promise@2.0.1  deduped
│ ├── path-is-absolute@1.0.1 
│ ├─┬ pretty-bytes@3.0.1 
│ │ └── number-is-nan@1.0.1  deduped
│ ├── read-chunk@1.0.1 
│ ├─┬ read-pkg-up@1.0.1 
│ │ ├── find-up@1.1.2  deduped
│ │ └─┬ read-pkg@1.1.0 
│ │   ├─┬ load-json-file@1.1.0 
│ │   │ ├── graceful-fs@4.1.11 
│ │   │ ├── parse-json@2.2.0  deduped
│ │   │ ├── pify@2.3.0  deduped
│ │   │ ├── pinkie-promise@2.0.1  deduped
│ │   │ └─┬ strip-bom@2.0.0 
│ │   │   └── is-utf8@0.2.1 
│ │   ├── normalize-package-data@2.3.8  deduped
│ │   └─┬ path-type@1.1.0 
│ │     ├── graceful-fs@4.1.11  deduped
│ │     ├── pify@2.3.0  deduped
│ │     └── pinkie-promise@2.0.1  deduped
│ ├─┬ rimraf@2.6.1 
│ │ └── glob@7.1.1  deduped
│ ├─┬ run-async@2.3.0 
│ │ └── is-promise@2.1.0 
│ ├── shelljs@0.7.7  deduped
│ ├── text-table@0.2.0 
│ ├─┬ through2@2.0.3 
│ │ ├─┬ readable-stream@2.2.9 
│ │ │ ├── buffer-shims@1.0.0 
│ │ │ ├── core-util-is@1.0.2 
│ │ │ ├── inherits@2.0.3  deduped
│ │ │ ├── isarray@1.0.0 
│ │ │ ├── process-nextick-args@1.0.7 
│ │ │ ├─┬ string_decoder@1.0.0 
│ │ │ │ └── buffer-shims@1.0.0  deduped
│ │ │ └── util-deprecate@1.0.2  deduped
│ │ └── xtend@4.0.1  deduped
│ ├─┬ underscore.string@3.3.4 
│ │ ├── sprintf-js@1.0.3 
│ │ └── util-deprecate@1.0.2 
│ ├─┬ user-home@2.0.0 
│ │ └── os-homedir@1.0.2 
│ ├── yeoman-assert@2.2.3 
│ ├─┬ yeoman-environment@1.6.6 
│ │ ├── chalk@1.1.3  deduped
│ │ ├── debug@2.6.4  deduped
│ │ ├── diff@2.2.3 
│ │ ├── escape-string-regexp@1.0.5  deduped
│ │ ├── globby@4.1.0  deduped
│ │ ├─┬ grouped-queue@0.3.3 
│ │ │ └── lodash@4.17.4  deduped
│ │ ├── inquirer@1.2.3  deduped
│ │ ├── lodash@4.17.4  deduped
│ │ ├─┬ log-symbols@1.0.2 
│ │ │ └── chalk@1.1.3  deduped
│ │ ├─┬ mem-fs@1.1.3 
│ │ │ ├── through2@2.0.3  deduped
│ │ │ ├── vinyl@1.2.0  deduped
│ │ │ └─┬ vinyl-file@2.0.0 
│ │ │   ├── graceful-fs@4.1.11  deduped
│ │ │   ├── pify@2.3.0  deduped
│ │ │   ├── pinkie-promise@2.0.1  deduped
│ │ │   ├── strip-bom@2.0.0  deduped
│ │ │   ├─┬ strip-bom-stream@2.0.0 
│ │ │   │ ├─┬ first-chunk-stream@2.0.0 
│ │ │   │ │ └── readable-stream@2.2.9  deduped
│ │ │   │ └── strip-bom@2.0.0  deduped
│ │ │   └── vinyl@1.2.0  deduped
│ │ ├── text-table@0.2.0  deduped
│ │ └─┬ untildify@2.1.0 
│ │   └── os-homedir@1.0.2  deduped
│ ├── yeoman-test@1.6.0  deduped
│ └─┬ yeoman-welcome@1.0.1 
│   └── chalk@1.1.3  deduped
└─┬ yeoman-test@1.6.0 
  ├─┬ inquirer@1.2.3 
  │ ├── ansi-escapes@1.4.0 
  │ ├── chalk@1.1.3  deduped
  │ ├─┬ cli-cursor@1.0.2 
  │ │ └─┬ restore-cursor@1.0.1 
  │ │   ├── exit-hook@1.1.1 
  │ │   └── onetime@1.1.0 
  │ ├── cli-width@2.1.0 
  │ ├─┬ external-editor@1.1.1 
  │ │ ├── extend@3.0.0 
  │ │ ├─┬ spawn-sync@1.0.15 
  │ │ │ ├─┬ concat-stream@1.6.0 
  │ │ │ │ ├── inherits@2.0.3  deduped
  │ │ │ │ ├── readable-stream@2.2.9  deduped
  │ │ │ │ └── typedarray@0.0.6 
  │ │ │ └── os-shim@0.1.3 
  │ │ └─┬ tmp@0.0.29 
  │ │   └── os-tmpdir@1.0.2 
  │ ├─┬ figures@1.7.0 
  │ │ ├── escape-string-regexp@1.0.5  deduped
  │ │ └── object-assign@4.1.1 
  │ ├── lodash@4.17.4  deduped
  │ ├── mute-stream@0.0.6 
  │ ├── pinkie-promise@2.0.1  deduped
  │ ├── run-async@2.3.0  deduped
  │ ├── rx@4.1.0 
  │ ├─┬ string-width@1.0.2 
  │ │ ├── code-point-at@1.1.0 
  │ │ ├─┬ is-fullwidth-code-point@1.0.0 
  │ │ │ └── number-is-nan@1.0.1  deduped
  │ │ └── strip-ansi@3.0.1  deduped
  │ ├── strip-ansi@3.0.1  deduped
  │ └── through@2.3.8 
  ├── lodash@4.17.4  deduped
  ├── mkdirp@0.5.1  deduped
  ├─┬ pinkie-promise@2.0.1 
  │ └── pinkie@2.0.4 
  ├── rimraf@2.6.1  deduped
  ├─┬ sinon@1.17.7 
  │ ├─┬ formatio@1.1.1 
  │ │ └── samsam@1.1.2  deduped
  │ ├── lolex@1.3.2 
  │ ├── samsam@1.1.2 
  │ └── util@0.10.3  deduped
  ├── yeoman-environment@1.6.6  deduped
  └── yeoman-generator@0.24.1  deduped

npm WARN generator-polygene@3.0.0-RC0 No repository field.
npm WARN generator-polygene@3.0.0-RC0 No license field.
:tools:generator-polygene:setsCurrentVersionToPackageJson
:tools:generator-polygene:npmTest

> generator-polygene@3.0.0-RC0 test <https://builds.apache.org/job/Polygene(JavaEdition)-develop-java8-check/ws/tools/generator-polygene>
> ./node_modules/mocha/bin/mocha test/**/*_test.js --reporter mocha-junit-reporter --reporter-options
mochaFile=../../reports/tests/npmTest/generator-polygene.xml

/bin/sh: 1: Syntax error: word unexpected (expecting ")")
/bin/sh: 1: Syntax error: word unexpected (expecting ")")
/bin/sh: 1: Syntax error: word unexpected (expecting ")")
/bin/sh: 1: Syntax error: word unexpected (expecting ")")
/bin/sh: 1: Syntax error: word unexpected (expecting ")")
/bin/sh: 1: Syntax error: word unexpected (expecting ")")
/bin/sh: 1: Syntax error: word unexpected (expecting ")")
/bin/sh: 1: Syntax error: word unexpected (expecting ")")
/bin/sh: 1: Syntax error: word unexpected (expecting ")")
/bin/sh: 1: Syntax error: word unexpected (expecting ")")
/bin/sh: 1: Syntax error: word unexpected (expecting ")")
/bin/sh: 1: Syntax error: word unexpected (expecting ")")
/bin/sh: 1: Syntax error: word unexpected (expecting ")")
/bin/sh: 1: Syntax error: word unexpected (expecting ")")
/bin/sh: 1: Syntax error: word unexpected (expecting ")")
/bin/sh: 1: Syntax error: word unexpected (expecting ")")
/bin/sh: 1: Syntax error: word unexpected (expecting ")")
/bin/sh: 1: Syntax error: word unexpected (expecting ")")
/bin/sh: 1: Syntax error: word unexpected (expecting ")")
/bin/sh: 1: Syntax error: word unexpected (expecting ")")
/bin/sh: 1: Syntax error: word unexpected (expecting ")")
/bin/sh: 1: Syntax error: word unexpected (expecting ")")
/bin/sh: 1: Syntax error: word unexpected (expecting ")")
/bin/sh: 1: Syntax error: word unexpected (expecting ")")
/bin/sh: 1: Syntax error: word unexpected (expecting ")")
/bin/sh: 1: Syntax error: word unexpected (expecting ")")
/bin/sh: 1: Syntax error: word unexpected (expecting ")")
/bin/sh: 1: Syntax error: word unexpected (expecting ")")
/bin/sh: 1: Syntax error: word unexpected (expecting ")")
/bin/sh: 1: Syntax error: word unexpected (expecting ")")
/bin/sh: 1: Syntax error: word unexpected (expecting ")")
/bin/sh: 1: Syntax error: word unexpected (expecting ")")
/bin/sh: 1: Syntax error: word unexpected (expecting ")")
/bin/sh: 1: Syntax error: word unexpected (expecting ")")
/bin/sh: 1: Syntax error: word unexpected (expecting ")")
/bin/sh: 1: Syntax error: word unexpected (expecting ")")
/bin/sh: 1: Syntax error: word unexpected (expecting ")")
/bin/sh: 1: Syntax error: word unexpected (expecting ")")
/bin/sh: 1: Syntax error: word unexpected (expecting ")")
/bin/sh: 1: Syntax error: word unexpected (expecting ")")
npm ERR! code ELIFECYCLE
npm ERR! errno 40
npm ERR! generator-polygene@3.0.0-RC0 test: `./node_modules/mocha/bin/mocha test/**/*_test.js
--reporter mocha-junit-reporter --reporter-options mochaFile=../../reports/tests/npmTest/generator-polygene.xml`
npm ERR! Exit status 40
npm ERR! 
npm ERR! Failed at the generator-polygene@3.0.0-RC0 test script './node_modules/mocha/bin/mocha
test/**/*_test.js --reporter mocha-junit-reporter --reporter-options mochaFile=../../reports/tests/npmTest/generator-polygene.xml'.
npm ERR! Make sure you have the latest version of node.js and npm installed.
npm ERR! If you do, this is most likely a problem with the generator-polygene package,
npm ERR! not with npm itself.
npm ERR! Tell the author that this fails on your system:
npm ERR!     ./node_modules/mocha/bin/mocha test/**/*_test.js --reporter mocha-junit-reporter
--reporter-options mochaFile=../../reports/tests/npmTest/generator-polygene.xml
npm ERR! You can get information on how to open an issue for this project with:
npm ERR!     npm bugs generator-polygene
npm ERR! Or if that isn't available, you can get their info via:
npm ERR!     npm owner ls generator-polygene
npm ERR! There is likely additional logging output above.

npm ERR! A complete log of this run can be found in:
npm ERR!     /home/jenkins/.npm/_logs/2017-04-23T15_56_03_700Z-debug.log
:tools:generator-polygene:npmTest FAILED
:tools:model-detail:honkerCheck
:tools:model-detail:check
:tutorials:cargo:check
:tutorials:composites:check
:tutorials:hello:check
:tutorials:introduction:check UP-TO-DATE
:tutorials:services:check
:tutorials:introduction:tenminutes:check UP-TO-DATE
:tutorials:introduction:thirtyminutes:check UP-TO-DATE
:tutorials:introduction:twominutes:check UP-TO-DATE

FAILURE: Build failed with an exception.

* What went wrong:
Execution failed for task ':tools:generator-polygene:npmTest'.
> Process 'command '<https://builds.apache.org/job/Polygene(JavaEdition)-develop-java8-check/ws/tools/generator-polygene/build/node-install/npm-v4.4.4/bin/npm''>
finished with non-zero exit value 40

* Try:
Run with --stacktrace option to get the stack trace. Run with --info or --debug option to
get more log output.

BUILD FAILED

Total time: 14 mins 29.418 secs
Build step 'Invoke Gradle script' changed build result to FAILURE
Build step 'Invoke Gradle script' marked build as failure
Recording test results

Mime
View raw message