polygene-dev mailing list archives

Site index · List index
Message view « Date » · « Thread »
Top « Date » · « Thread »
From Apache Jenkins Server <jenk...@builds.apache.org>
Subject Build failed in Jenkins: Polygene(JavaEdition)-develop-java9-check #140
Date Sun, 23 Apr 2017 16:32:12 GMT
See <https://builds.apache.org/job/Polygene(JavaEdition)-develop-java9-check/140/display/redirect?page=changes>

Changes:

[paulmerlin] tools/generator-polygene makes more shells happy

------------------------------------------
[...truncated 852.83 KB...]
<https://builds.apache.org/job/Polygene(JavaEdition)-develop-java9-check/ws/libraries/sql/src/main/java/org/apache/polygene/library/sql/common/Databases.java>:94:
warning: no @throws for java.sql.SQLException
    public void query( String sql, ResultSetVisitor visitor )
                ^
<https://builds.apache.org/job/Polygene(JavaEdition)-develop-java9-check/ws/libraries/sql/src/main/java/org/apache/polygene/library/sql/common/Databases.java>:106:
warning: no @param for sql
    public void query( String sql, StatementVisitor statementVisitor, ResultSetVisitor resultSetVisitor
)
                ^
<https://builds.apache.org/job/Polygene(JavaEdition)-develop-java9-check/ws/libraries/sql/src/main/java/org/apache/polygene/library/sql/common/Databases.java>:106:
warning: no @param for statementVisitor
    public void query( String sql, StatementVisitor statementVisitor, ResultSetVisitor resultSetVisitor
)
                ^
<https://builds.apache.org/job/Polygene(JavaEdition)-develop-java9-check/ws/libraries/sql/src/main/java/org/apache/polygene/library/sql/common/Databases.java>:106:
warning: no @param for resultSetVisitor
    public void query( String sql, StatementVisitor statementVisitor, ResultSetVisitor resultSetVisitor
)
                ^
<https://builds.apache.org/job/Polygene(JavaEdition)-develop-java9-check/ws/libraries/sql/src/main/java/org/apache/polygene/library/sql/common/Databases.java>:106:
warning: no @throws for java.sql.SQLException
    public void query( String sql, StatementVisitor statementVisitor, ResultSetVisitor resultSetVisitor
)
                ^
<https://builds.apache.org/job/Polygene(JavaEdition)-develop-java9-check/ws/libraries/sql/src/main/java/org/apache/polygene/library/sql/common/SQLConfiguration.java>:35:
warning: no @return
    Property<String> schemaName();
                     ^

16 warnings
:libraries:sql:javadocJar
:libraries:sql:sourceJar
:libraries:sql:testSourceJar
:libraries:sql:signArchives SKIPPED
:libraries:sql:uploadStageArchivesCould not find metadata org.apache.polygene.libraries:org.apache.polygene.library.sql:3.0-SNAPSHOT/maven-metadata.xml
in remote (file://<https://builds.apache.org/job/Polygene(JavaEdition)-develop-java9-check/ws/libraries/sql/build/stage/archives)>
Could not find metadata org.apache.polygene.libraries:org.apache.polygene.library.sql/maven-metadata.xml
in remote (file://<https://builds.apache.org/job/Polygene(JavaEdition)-develop-java9-check/ws/libraries/sql/build/stage/archives)>

:libraries:sql-bonecp:javadoc
:libraries:sql-bonecp:javadocJar
:libraries:sql-bonecp:sourceJar
:libraries:sql-bonecp:testSourceJar
:libraries:sql-bonecp:signArchives SKIPPED
:libraries:sql-bonecp:uploadStageArchivesCould not find metadata org.apache.polygene.libraries:org.apache.polygene.library.sql-bonecp:3.0-SNAPSHOT/maven-metadata.xml
in remote (file://<https://builds.apache.org/job/Polygene(JavaEdition)-develop-java9-check/ws/libraries/sql-bonecp/build/stage/archives)>
Could not find metadata org.apache.polygene.libraries:org.apache.polygene.library.sql-bonecp/maven-metadata.xml
in remote (file://<https://builds.apache.org/job/Polygene(JavaEdition)-develop-java9-check/ws/libraries/sql-bonecp/build/stage/archives)>

:libraries:sql-dbcp:javadoc
:libraries:sql-dbcp:javadocJar
:libraries:sql-dbcp:sourceJar
:libraries:sql-dbcp:testSourceJar
:libraries:sql-dbcp:signArchives SKIPPED
:libraries:sql-dbcp:uploadStageArchivesCould not find metadata org.apache.polygene.libraries:org.apache.polygene.library.sql-dbcp:3.0-SNAPSHOT/maven-metadata.xml
in remote (file://<https://builds.apache.org/job/Polygene(JavaEdition)-develop-java9-check/ws/libraries/sql-dbcp/build/stage/archives)>
Could not find metadata org.apache.polygene.libraries:org.apache.polygene.library.sql-dbcp/maven-metadata.xml
in remote (file://<https://builds.apache.org/job/Polygene(JavaEdition)-develop-java9-check/ws/libraries/sql-dbcp/build/stage/archives)>

:libraries:sql-generator:javadoc<https://builds.apache.org/job/Polygene(JavaEdition)-develop-java9-check/ws/libraries/sql-generator/src/main/java/org/apache/polygene/library/sql/generator/grammar/modification/pgsql/PgSQLInsertStatement.java>:29:
warning: empty <p> tag
 * <p>
   ^
<https://builds.apache.org/job/Polygene(JavaEdition)-develop-java9-check/ws/libraries/sql-generator/src/main/java/org/apache/polygene/library/sql/generator/Typeable.java>:36:
warning: empty <p> tag
 * <p>
   ^
<https://builds.apache.org/job/Polygene(JavaEdition)-develop-java9-check/ws/libraries/sql-generator/src/main/java/org/apache/polygene/library/sql/generator/grammar/common/datatypes/SQLTime.java>:41:
warning: no @return
    Boolean isWithTimeZone();
            ^
<https://builds.apache.org/job/Polygene(JavaEdition)-develop-java9-check/ws/libraries/sql-generator/src/main/java/org/apache/polygene/library/sql/generator/grammar/common/datatypes/SQLTimeStamp.java>:39:
warning: no @return
    Boolean isWithTimeZone();
            ^
<https://builds.apache.org/job/Polygene(JavaEdition)-develop-java9-check/ws/libraries/sql-generator/src/main/java/org/apache/polygene/library/sql/generator/grammar/builders/query/ColumnsBuilder.java>:54:
warning: no @return
    ColumnsBuilder addNamedColumns( ColumnReferenceInfo... namedColumns );
                   ^
<https://builds.apache.org/job/Polygene(JavaEdition)-develop-java9-check/ws/libraries/sql-generator/src/main/java/org/apache/polygene/library/sql/generator/grammar/builders/query/QueryBuilder.java>:169:
warning: no @param for setQuantifier
    QueryBuilder except( SetQuantifier setQuantifier, CorrespondingSpec correspondingSpec,
                 ^
<https://builds.apache.org/job/Polygene(JavaEdition)-develop-java9-check/ws/libraries/sql-generator/src/main/java/org/apache/polygene/library/sql/generator/grammar/builders/query/QueryBuilder.java>:169:
warning: no @param for correspondingSpec
    QueryBuilder except( SetQuantifier setQuantifier, CorrespondingSpec correspondingSpec,
                 ^
<https://builds.apache.org/job/Polygene(JavaEdition)-develop-java9-check/ws/libraries/sql-generator/src/main/java/org/apache/polygene/library/sql/generator/grammar/builders/query/QuerySpecificationBuilder.java>:94:
warning: no @param for builder
    QuerySpecificationBuilder setSelect( ColumnsBuilder builder );
                              ^
<https://builds.apache.org/job/Polygene(JavaEdition)-develop-java9-check/ws/libraries/sql-generator/src/main/java/org/apache/polygene/library/sql/generator/grammar/builders/query/QuerySpecificationBuilder.java>:101:
warning: no @param for builder
    QuerySpecificationBuilder setFrom( FromBuilder builder );
                              ^
<https://builds.apache.org/job/Polygene(JavaEdition)-develop-java9-check/ws/libraries/sql-generator/src/main/java/org/apache/polygene/library/sql/generator/grammar/builders/query/QuerySpecificationBuilder.java>:108:
warning: no @param for builder
    QuerySpecificationBuilder setWhere( BooleanBuilder builder );
                              ^
<https://builds.apache.org/job/Polygene(JavaEdition)-develop-java9-check/ws/libraries/sql-generator/src/main/java/org/apache/polygene/library/sql/generator/grammar/builders/query/QuerySpecificationBuilder.java>:115:
warning: no @param for builder
    QuerySpecificationBuilder setGroupBy( GroupByBuilder builder );
                              ^
<https://builds.apache.org/job/Polygene(JavaEdition)-develop-java9-check/ws/libraries/sql-generator/src/main/java/org/apache/polygene/library/sql/generator/grammar/builders/query/QuerySpecificationBuilder.java>:122:
warning: no @param for builder
    QuerySpecificationBuilder setHaving( BooleanBuilder builder );
                              ^
<https://builds.apache.org/job/Polygene(JavaEdition)-develop-java9-check/ws/libraries/sql-generator/src/main/java/org/apache/polygene/library/sql/generator/grammar/builders/query/QuerySpecificationBuilder.java>:129:
warning: no @param for builder
    QuerySpecificationBuilder setOrderBy( OrderByBuilder builder );
                              ^

13 warnings
:libraries:sql-generator:javadocJar
:libraries:sql-generator:sourceJar
:libraries:sql-generator:testSourceJar
:libraries:sql-generator:signArchives SKIPPED
:libraries:sql-generator:uploadStageArchivesCould not find metadata org.apache.polygene.libraries:org.apache.polygene.library.sql-generator:3.0-SNAPSHOT/maven-metadata.xml
in remote (file://<https://builds.apache.org/job/Polygene(JavaEdition)-develop-java9-check/ws/libraries/sql-generator/build/stage/archives)>
Could not find metadata org.apache.polygene.libraries:org.apache.polygene.library.sql-generator/maven-metadata.xml
in remote (file://<https://builds.apache.org/job/Polygene(JavaEdition)-develop-java9-check/ws/libraries/sql-generator/build/stage/archives)>

:libraries:sql-liquibase:javadoc
:libraries:sql-liquibase:javadocJar
:libraries:sql-liquibase:sourceJar
:libraries:sql-liquibase:testSourceJar
:libraries:sql-liquibase:signArchives SKIPPED
:libraries:sql-liquibase:uploadStageArchivesCould not find metadata org.apache.polygene.libraries:org.apache.polygene.library.sql-liquibase:3.0-SNAPSHOT/maven-metadata.xml
in remote (file://<https://builds.apache.org/job/Polygene(JavaEdition)-develop-java9-check/ws/libraries/sql-liquibase/build/stage/archives)>
Could not find metadata org.apache.polygene.libraries:org.apache.polygene.library.sql-liquibase/maven-metadata.xml
in remote (file://<https://builds.apache.org/job/Polygene(JavaEdition)-develop-java9-check/ws/libraries/sql-liquibase/build/stage/archives)>

:libraries:uid:processVersionResources NO-SOURCE
:libraries:uid:versionClasses
:libraries:uid:jar
:libraries:uid:javadoc
:libraries:uid:javadocJar
:libraries:uid:sourceJar
:libraries:uid:testSourceJar
:libraries:uid:signArchives SKIPPED
:libraries:uid:uploadStageArchivesCould not find metadata org.apache.polygene.libraries:org.apache.polygene.library.uid:3.0-SNAPSHOT/maven-metadata.xml
in remote (file://<https://builds.apache.org/job/Polygene(JavaEdition)-develop-java9-check/ws/libraries/uid/build/stage/archives)>
Could not find metadata org.apache.polygene.libraries:org.apache.polygene.library.uid/maven-metadata.xml
in remote (file://<https://builds.apache.org/job/Polygene(JavaEdition)-develop-java9-check/ws/libraries/uid/build/stage/archives)>

:libraries:uowfile:processVersionResources NO-SOURCE
:libraries:uowfile:versionClasses
:libraries:uowfile:jar
:libraries:uowfile:javadoc<https://builds.apache.org/job/Polygene(JavaEdition)-develop-java9-check/ws/libraries/uowfile/src/main/java/org/apache/polygene/library/uowfile/plural/HasUoWFiles.java>:38:
warning: no @param for key
    File attachedFile( T key );
         ^
<https://builds.apache.org/job/Polygene(JavaEdition)-develop-java9-check/ws/libraries/uowfile/src/main/java/org/apache/polygene/library/uowfile/plural/HasUoWFiles.java>:38:
warning: no @return
    File attachedFile( T key );
         ^
<https://builds.apache.org/job/Polygene(JavaEdition)-develop-java9-check/ws/libraries/uowfile/src/main/java/org/apache/polygene/library/uowfile/plural/HasUoWFiles.java>:43:
warning: no @return
    Iterable<File> attachedFiles();
                   ^

3 warnings
:libraries:uowfile:javadocJar
:libraries:uowfile:sourceJar
:libraries:uowfile:testSourceJar
:libraries:uowfile:signArchives SKIPPED
:libraries:uowfile:uploadStageArchivesCould not find metadata org.apache.polygene.libraries:org.apache.polygene.library.uowfile:3.0-SNAPSHOT/maven-metadata.xml
in remote (file://<https://builds.apache.org/job/Polygene(JavaEdition)-develop-java9-check/ws/libraries/uowfile/build/stage/archives)>
Could not find metadata org.apache.polygene.libraries:org.apache.polygene.library.uowfile/maven-metadata.xml
in remote (file://<https://builds.apache.org/job/Polygene(JavaEdition)-develop-java9-check/ws/libraries/uowfile/build/stage/archives)>

:tools:envisage:processVersionResources NO-SOURCE
:tools:envisage:versionClasses
:tools:envisage:jar
:tools:envisage:javadoc
:tools:envisage:javadocJar
:tools:envisage:sourceJar
:tools:envisage:testSourceJar
:tools:envisage:signArchives SKIPPED
:tools:envisage:uploadStageArchivesCould not find metadata org.apache.polygene.tools:org.apache.polygene.tool.envisage:3.0-SNAPSHOT/maven-metadata.xml
in remote (file://<https://builds.apache.org/job/Polygene(JavaEdition)-develop-java9-check/ws/tools/envisage/build/stage/archives)>
Could not find metadata org.apache.polygene.tools:org.apache.polygene.tool.envisage/maven-metadata.xml
in remote (file://<https://builds.apache.org/job/Polygene(JavaEdition)-develop-java9-check/ws/tools/envisage/build/stage/archives)>

:tools:model-detail:javadoc
:tools:model-detail:javadocJar
:tools:model-detail:sourceJar
:tools:model-detail:testSourceJar
:tools:model-detail:signArchives SKIPPED
:tools:model-detail:uploadStageArchivesCould not find metadata org.apache.polygene.tools:org.apache.polygene.tool.model-detail:3.0-SNAPSHOT/maven-metadata.xml
in remote (file://<https://builds.apache.org/job/Polygene(JavaEdition)-develop-java9-check/ws/tools/model-detail/build/stage/archives)>
Could not find metadata org.apache.polygene.tools:org.apache.polygene.tool.model-detail/maven-metadata.xml
in remote (file://<https://builds.apache.org/job/Polygene(JavaEdition)-develop-java9-check/ws/tools/model-detail/build/stage/archives)>

:distributions:stageBinariesMavenRepository
:tools:generator-polygene:generateStageMavenRepositoryInitScript
:tools:generator-polygene:nodeSetup UP-TO-DATE
:tools:generator-polygene:npmSetup UP-TO-DATE
:tools:generator-polygene:npmInstallnpm WARN generator-polygene@3.0.0-RC0 No repository field.
npm WARN generator-polygene@3.0.0-RC0 No license field.

:tools:generator-polygene:setsCurrentVersionToPackageJson
:tools:generator-polygene:npmTest

> generator-polygene@3.0.0-RC0 test <https://builds.apache.org/job/Polygene(JavaEdition)-develop-java9-check/ws/tools/generator-polygene>
> ./node_modules/mocha/bin/mocha 'test/**/*_test.js' --reporter mocha-junit-reporter --reporter-options
mochaFile=../../reports/tests/npmTest/generator-polygene.xml

/bin/sh: 1: Syntax error: word unexpected (expecting ")")
/bin/sh: 1: Syntax error: word unexpected (expecting ")")
/bin/sh: 1: Syntax error: word unexpected (expecting ")")
/bin/sh: 1: Syntax error: word unexpected (expecting ")")
/bin/sh: 1: Syntax error: word unexpected (expecting ")")
/bin/sh: 1: Syntax error: word unexpected (expecting ")")
/bin/sh: 1: Syntax error: word unexpected (expecting ")")
/bin/sh: 1: Syntax error: word unexpected (expecting ")")
/bin/sh: 1: Syntax error: word unexpected (expecting ")")
/bin/sh: 1: Syntax error: word unexpected (expecting ")")
/bin/sh: 1: Syntax error: word unexpected (expecting ")")
/bin/sh: 1: Syntax error: word unexpected (expecting ")")
/bin/sh: 1: Syntax error: word unexpected (expecting ")")
/bin/sh: 1: Syntax error: word unexpected (expecting ")")
/bin/sh: 1: Syntax error: word unexpected (expecting ")")
/bin/sh: 1: Syntax error: word unexpected (expecting ")")
/bin/sh: 1: Syntax error: word unexpected (expecting ")")
/bin/sh: 1: Syntax error: word unexpected (expecting ")")
/bin/sh: 1: Syntax error: word unexpected (expecting ")")
/bin/sh: 1: Syntax error: word unexpected (expecting ")")
/bin/sh: 1: Syntax error: word unexpected (expecting ")")
/bin/sh: 1: Syntax error: word unexpected (expecting ")")
/bin/sh: 1: Syntax error: word unexpected (expecting ")")
/bin/sh: 1: Syntax error: word unexpected (expecting ")")
/bin/sh: 1: Syntax error: word unexpected (expecting ")")
/bin/sh: 1: Syntax error: word unexpected (expecting ")")
/bin/sh: 1: Syntax error: word unexpected (expecting ")")
/bin/sh: 1: Syntax error: word unexpected (expecting ")")
/bin/sh: 1: Syntax error: word unexpected (expecting ")")
/bin/sh: 1: Syntax error: word unexpected (expecting ")")
/bin/sh: 1: Syntax error: word unexpected (expecting ")")
/bin/sh: 1: Syntax error: word unexpected (expecting ")")
/bin/sh: 1: Syntax error: word unexpected (expecting ")")
/bin/sh: 1: Syntax error: word unexpected (expecting ")")
/bin/sh: 1: Syntax error: word unexpected (expecting ")")
/bin/sh: 1: Syntax error: word unexpected (expecting ")")
/bin/sh: 1: Syntax error: word unexpected (expecting ")")
/bin/sh: 1: Syntax error: word unexpected (expecting ")")
/bin/sh: 1: Syntax error: word unexpected (expecting ")")
/bin/sh: 1: Syntax error: word unexpected (expecting ")")
npm ERR! code ELIFECYCLE
npm ERR! errno 40
npm ERR! generator-polygene@3.0.0-RC0 test: `./node_modules/mocha/bin/mocha 'test/**/*_test.js'
--reporter mocha-junit-reporter --reporter-options mochaFile=../../reports/tests/npmTest/generator-polygene.xml`
npm ERR! Exit status 40
npm ERR! 
npm ERR! Failed at the generator-polygene@3.0.0-RC0 test script './node_modules/mocha/bin/mocha
'test/**/*_test.js' --reporter mocha-junit-reporter --reporter-options mochaFile=../../reports/tests/npmTest/generator-polygene.xml'.
npm ERR! Make sure you have the latest version of node.js and npm installed.
npm ERR! If you do, this is most likely a problem with the generator-polygene package,
npm ERR! not with npm itself.
npm ERR! Tell the author that this fails on your system:
npm ERR!     ./node_modules/mocha/bin/mocha 'test/**/*_test.js' --reporter mocha-junit-reporter
--reporter-options mochaFile=../../reports/tests/npmTest/generator-polygene.xml
npm ERR! You can get information on how to open an issue for this project with:
npm ERR!     npm bugs generator-polygene
npm ERR! Or if that isn't available, you can get their info via:
npm ERR!     npm owner ls generator-polygene
npm ERR! There is likely additional logging output above.

npm ERR! A complete log of this run can be found in:
npm ERR!     /home/jenkins/.npm/_logs/2017-04-23T16_32_04_684Z-debug.log
:tools:generator-polygene:npmTest FAILED
:tools:model-detail:honkerCheck
:tools:model-detail:check
:tutorials:cargo:check
:tutorials:composites:check
:tutorials:hello:check
:tutorials:introduction:check UP-TO-DATE
:tutorials:services:check
:tutorials:introduction:tenminutes:check UP-TO-DATE
:tutorials:introduction:thirtyminutes:check UP-TO-DATE
:tutorials:introduction:twominutes:check UP-TO-DATE

FAILURE: Build failed with an exception.

* What went wrong:
Execution failed for task ':tools:generator-polygene:npmTest'.
> Process 'command '<https://builds.apache.org/job/Polygene(JavaEdition)-develop-java9-check/ws/tools/generator-polygene/.gradle/npm/npm-v4.4.4/bin/npm''>
finished with non-zero exit value 40

* Try:
Run with --stacktrace option to get the stack trace. Run with --info or --debug option to
get more log output.

BUILD FAILED

Total time: 15 mins 35.567 secs
Build step 'Invoke Gradle script' changed build result to FAILURE
Build step 'Invoke Gradle script' marked build as failure
Recording test results

Mime
View raw message