polygene-dev mailing list archives

Site index · List index
Message view « Date » · « Thread »
Top « Date » · « Thread »
From Apache Jenkins Server <jenk...@builds.apache.org>
Subject Build failed in Jenkins: Polygene(JavaEdition)-develop-java9-check #139
Date Sun, 23 Apr 2017 16:16:25 GMT
See <https://builds.apache.org/job/Polygene(JavaEdition)-develop-java9-check/139/display/redirect?page=changes>

Changes:

[paulmerlin] tools/generator-polygene makes Ratâ„¢ happy

------------------------------------------
[...truncated 882.88 KB...]
  +-- realize-package-specifier@3.0.3 
  +-- request@2.81.0 
  | +-- aws-sign2@0.6.0 
  | +-- aws4@1.6.0 
  | +-- caseless@0.12.0 
  | +-- combined-stream@1.0.5 
  | | `-- delayed-stream@1.0.0 
  | +-- extend@3.0.0 
  | +-- forever-agent@0.6.1 
  | +-- form-data@2.1.2 
  | | `-- asynckit@0.4.0 
  | +-- har-validator@4.2.1 
  | | +-- ajv@4.11.4 
  | | | +-- co@4.6.0 
  | | | `-- json-stable-stringify@1.0.1 
  | | |   `-- jsonify@0.0.0 
  | | `-- har-schema@1.0.5 
  | +-- hawk@3.1.3 
  | | +-- boom@2.10.1 
  | | +-- cryptiles@2.0.5 
  | | +-- hoek@2.16.3 
  | | `-- sntp@1.0.9 
  | +-- http-signature@1.1.1 
  | | +-- assert-plus@0.2.0 
  | | +-- jsprim@1.3.1 
  | | | +-- extsprintf@1.0.2 
  | | | +-- json-schema@0.2.3 
  | | | `-- verror@1.3.6 
  | | `-- sshpk@1.11.0 
  | |   +-- asn1@0.2.3 
  | |   +-- assert-plus@1.0.0 
  | |   +-- bcrypt-pbkdf@1.0.1 
  | |   +-- dashdash@1.14.1 
  | |   +-- ecc-jsbn@0.1.1 
  | |   +-- getpass@0.1.6 
  | |   +-- jodid25519@1.0.2 
  | |   +-- jsbn@0.1.1 
  | |   `-- tweetnacl@0.14.5 
  | +-- is-typedarray@1.0.0 
  | +-- isstream@0.1.2 
  | +-- json-stringify-safe@5.0.1 
  | +-- mime-types@2.1.14 
  | | `-- mime-db@1.26.0 
  | +-- oauth-sign@0.8.2 
  | +-- performance-now@0.2.0 
  | +-- qs@6.4.0 
  | +-- safe-buffer@5.0.1 
  | +-- stringstream@0.0.5 
  | +-- tough-cookie@2.3.2 
  | | `-- punycode@1.4.1 
  | `-- tunnel-agent@0.6.0 
  +-- retry@0.10.1 
  +-- rimraf@2.6.1 
  +-- semver@5.3.0 
  +-- sha@2.0.1 
  +-- slide@1.1.6 
  +-- sorted-object@2.0.1 
  +-- sorted-union-stream@2.1.3 
  | +-- from2@1.3.0 
  | | `-- readable-stream@1.1.14 
  | |   +-- core-util-is@1.0.2 
  | |   +-- isarray@0.0.1 
  | |   `-- string_decoder@0.10.31 
  | `-- stream-iterate@1.1.1 
  +-- strip-ansi@3.0.1 
  +-- tar@2.2.1 
  | `-- block-stream@0.0.8 
  +-- text-table@0.2.0 
  +-- uid-number@0.0.6 
  +-- umask@1.1.0 
  +-- unique-filename@1.1.0 
  | `-- unique-slug@2.0.0 
  +-- unpipe@1.0.0 
  +-- update-notifier@2.1.0 
  | +-- boxen@1.0.0 
  | | +-- ansi-align@1.1.0 
  | | | `-- string-width@1.0.2 
  | | |   +-- code-point-at@1.1.0 
  | | |   `-- is-fullwidth-code-point@1.0.0 
  | | |     `-- number-is-nan@1.0.1 
  | | +-- camelcase@4.0.0 
  | | +-- cli-boxes@1.0.0 
  | | +-- string-width@2.0.0 
  | | | `-- is-fullwidth-code-point@2.0.0 
  | | +-- term-size@0.1.1 
  | | | `-- execa@0.4.0 
  | | |   +-- cross-spawn-async@2.2.5 
  | | |   | `-- lru-cache@4.0.2 
  | | |   |   +-- pseudomap@1.0.2 
  | | |   |   `-- yallist@2.0.0 
  | | |   +-- is-stream@1.1.0 
  | | |   +-- npm-run-path@1.0.0 
  | | |   +-- object-assign@4.1.1 
  | | |   +-- path-key@1.0.0 
  | | |   `-- strip-eof@1.0.0 
  | | `-- widest-line@1.0.0 
  | |   `-- string-width@1.0.2 
  | |     +-- code-point-at@1.1.0 
  | |     `-- is-fullwidth-code-point@1.0.0 
  | |       `-- number-is-nan@1.0.1 
  | +-- chalk@1.1.3 
  | | +-- ansi-styles@2.2.1 
  | | +-- escape-string-regexp@1.0.5 
  | | +-- has-ansi@2.0.0 
  | | `-- supports-color@2.0.0 
  | +-- configstore@3.0.0 
  | | +-- dot-prop@4.1.1 
  | | | `-- is-obj@1.0.1 
  | | `-- unique-string@1.0.0 
  | |   `-- crypto-random-string@1.0.0 
  | +-- is-npm@1.0.0 
  | +-- latest-version@3.0.0 
  | | `-- package-json@3.1.0 
  | |   +-- got@6.7.1 
  | |   | +-- create-error-class@3.0.2 
  | |   | | `-- capture-stack-trace@1.0.0 
  | |   | +-- duplexer3@0.1.4 
  | |   | +-- get-stream@3.0.0 
  | |   | +-- is-redirect@1.0.0 
  | |   | +-- is-retry-allowed@1.1.0 
  | |   | +-- is-stream@1.1.0 
  | |   | +-- lowercase-keys@1.0.0 
  | |   | +-- safe-buffer@5.0.1 
  | |   | +-- timed-out@4.0.1 
  | |   | +-- unzip-response@2.0.1 
  | |   | `-- url-parse-lax@1.0.0 
  | |   |   `-- prepend-http@1.0.4 
  | |   +-- registry-auth-token@3.1.0 
  | |   | `-- rc@1.1.7 
  | |   |   +-- deep-extend@0.4.1 
  | |   |   +-- minimist@1.2.0 
  | |   |   `-- strip-json-comments@2.0.1 
  | |   `-- registry-url@3.1.0 
  | |     `-- rc@1.1.7 
  | |       +-- deep-extend@0.4.1 
  | |       +-- minimist@1.2.0 
  | |       `-- strip-json-comments@2.0.1 
  | +-- lazy-req@2.0.0 
  | +-- semver-diff@2.1.0 
  | `-- xdg-basedir@3.0.0 
  +-- uuid@3.0.1 
  +-- validate-npm-package-license@3.0.1 
  | +-- spdx-correct@1.0.2 
  | | `-- spdx-license-ids@1.2.0 
  | `-- spdx-expression-parse@1.0.2 
  |   +-- spdx-exceptions@1.0.4 
  |   `-- spdx-license-ids@1.2.0 
  +-- validate-npm-package-name@3.0.0 
  | `-- builtins@1.0.3 
  +-- which@1.2.12 
  | `-- isexe@1.1.2 
  +-- wrappy@1.0.2 
  `-- write-file-atomic@1.3.1 

:tools:generator-polygene:npmInstallnpm WARN generator-polygene@3.0.0-RC0 No repository field.
npm WARN generator-polygene@3.0.0-RC0 No license field.

:tools:generator-polygene:setsCurrentVersionToPackageJson
:tools:generator-polygene:npmTest

> generator-polygene@3.0.0-RC0 test <https://builds.apache.org/job/Polygene(JavaEdition)-develop-java9-check/ws/tools/generator-polygene>
> ./node_modules/mocha/bin/mocha test/**/*_test.js --reporter mocha-junit-reporter --reporter-options
mochaFile=../../reports/tests/npmTest/generator-polygene.xml

/bin/sh: 1: Syntax error: word unexpected (expecting ")")
/bin/sh: 1: Syntax error: word unexpected (expecting ")")
/bin/sh: 1: Syntax error: word unexpected (expecting ")")
/bin/sh: 1: Syntax error: word unexpected (expecting ")")
/bin/sh: 1: Syntax error: word unexpected (expecting ")")
/bin/sh: 1: Syntax error: word unexpected (expecting ")")
/bin/sh: 1: Syntax error: word unexpected (expecting ")")
/bin/sh: 1: Syntax error: word unexpected (expecting ")")
/bin/sh: 1: Syntax error: word unexpected (expecting ")")
/bin/sh: 1: Syntax error: word unexpected (expecting ")")
/bin/sh: 1: Syntax error: word unexpected (expecting ")")
/bin/sh: 1: Syntax error: word unexpected (expecting ")")
/bin/sh: 1: Syntax error: word unexpected (expecting ")")
/bin/sh: 1: Syntax error: word unexpected (expecting ")")
/bin/sh: 1: Syntax error: word unexpected (expecting ")")
/bin/sh: 1: Syntax error: word unexpected (expecting ")")
/bin/sh: 1: Syntax error: word unexpected (expecting ")")
/bin/sh: 1: Syntax error: word unexpected (expecting ")")
/bin/sh: 1: Syntax error: word unexpected (expecting ")")
/bin/sh: 1: Syntax error: word unexpected (expecting ")")
/bin/sh: 1: Syntax error: word unexpected (expecting ")")
/bin/sh: 1: Syntax error: word unexpected (expecting ")")
/bin/sh: 1: Syntax error: word unexpected (expecting ")")
/bin/sh: 1: Syntax error: word unexpected (expecting ")")
/bin/sh: 1: Syntax error: word unexpected (expecting ")")
/bin/sh: 1: Syntax error: word unexpected (expecting ")")
/bin/sh: 1: Syntax error: word unexpected (expecting ")")
/bin/sh: 1: Syntax error: word unexpected (expecting ")")
/bin/sh: 1: Syntax error: word unexpected (expecting ")")
/bin/sh: 1: Syntax error: word unexpected (expecting ")")
/bin/sh: 1: Syntax error: word unexpected (expecting ")")
/bin/sh: 1: Syntax error: word unexpected (expecting ")")
/bin/sh: 1: Syntax error: word unexpected (expecting ")")
/bin/sh: 1: Syntax error: word unexpected (expecting ")")
/bin/sh: 1: Syntax error: word unexpected (expecting ")")
/bin/sh: 1: Syntax error: word unexpected (expecting ")")
/bin/sh: 1: Syntax error: word unexpected (expecting ")")
/bin/sh: 1: Syntax error: word unexpected (expecting ")")
/bin/sh: 1: Syntax error: word unexpected (expecting ")")
/bin/sh: 1: Syntax error: word unexpected (expecting ")")
npm ERR! code ELIFECYCLE
npm ERR! errno 40
npm ERR! generator-polygene@3.0.0-RC0 test: `./node_modules/mocha/bin/mocha test/**/*_test.js
--reporter mocha-junit-reporter --reporter-options mochaFile=../../reports/tests/npmTest/generator-polygene.xml`
npm ERR! Exit status 40
npm ERR! 
npm ERR! Failed at the generator-polygene@3.0.0-RC0 test script './node_modules/mocha/bin/mocha
test/**/*_test.js --reporter mocha-junit-reporter --reporter-options mochaFile=../../reports/tests/npmTest/generator-polygene.xml'.
npm ERR! Make sure you have the latest version of node.js and npm installed.
npm ERR! If you do, this is most likely a problem with the generator-polygene package,
npm ERR! not with npm itself.
npm ERR! Tell the author that this fails on your system:
npm ERR!     ./node_modules/mocha/bin/mocha test/**/*_test.js --reporter mocha-junit-reporter
--reporter-options mochaFile=../../reports/tests/npmTest/generator-polygene.xml
npm ERR! You can get information on how to open an issue for this project with:
npm ERR!     npm bugs generator-polygene
npm ERR! Or if that isn't available, you can get their info via:
npm ERR!     npm owner ls generator-polygene
npm ERR! There is likely additional logging output above.

npm ERR! A complete log of this run can be found in:
npm ERR!     /home/jenkins/.npm/_logs/2017-04-23T16_16_18_010Z-debug.log
:tools:generator-polygene:npmTest FAILED
:tools:model-detail:honkerCheck
:tools:model-detail:check
:tutorials:cargo:check
:tutorials:composites:check
:tutorials:hello:check
:tutorials:introduction:check UP-TO-DATE
:tutorials:services:check
:tutorials:introduction:tenminutes:check UP-TO-DATE
:tutorials:introduction:thirtyminutes:check UP-TO-DATE
:tutorials:introduction:twominutes:check UP-TO-DATE

FAILURE: Build failed with an exception.

* What went wrong:
Execution failed for task ':tools:generator-polygene:npmTest'.
> Process 'command '<https://builds.apache.org/job/Polygene(JavaEdition)-develop-java9-check/ws/tools/generator-polygene/.gradle/npm/npm-v4.4.4/bin/npm''>
finished with non-zero exit value 40

* Try:
Run with --stacktrace option to get the stack trace. Run with --info or --debug option to
get more log output.

BUILD FAILED

Total time: 15 mins 46.403 secs
Build step 'Invoke Gradle script' changed build result to FAILURE
Build step 'Invoke Gradle script' marked build as failure
Recording test results

Mime
View raw message