polygene-dev mailing list archives

Site index · List index
Message view « Date » · « Thread »
Top « Date » · « Thread »
From Apache Jenkins Server <jenk...@builds.apache.org>
Subject Build failed in Jenkins: Polygene(JavaEdition)-develop-java9-check #128
Date Sat, 15 Apr 2017 08:26:30 GMT
See <https://builds.apache.org/job/Polygene(JavaEdition)-develop-java9-check/128/display/redirect?page=changes>

Changes:

[niclas] Bring in Stanislav's sql-generator from GutHub, after his consent in

------------------------------------------
Started by an SCM change
[EnvInject] - Loading node environment variables.
Building remotely on ubuntu-4 (ubuntu trusty) in workspace <https://builds.apache.org/job/Polygene(JavaEdition)-develop-java9-check/ws/>
 > git rev-parse --is-inside-work-tree # timeout=10
Fetching changes from the remote Git repository
 > git config remote.origin.url https://git-wip-us.apache.org/repos/asf/polygene-java.git
# timeout=10
Fetching upstream changes from https://git-wip-us.apache.org/repos/asf/polygene-java.git
 > git --version # timeout=10
 > git fetch --tags --progress https://git-wip-us.apache.org/repos/asf/polygene-java.git
+refs/heads/*:refs/remotes/origin/*
 > git rev-parse refs/remotes/origin/develop^{commit} # timeout=10
 > git rev-parse refs/remotes/origin/origin/develop^{commit} # timeout=10
Checking out Revision a36086b600a76ee1252ae3a7e857739ed4c2ff09 (refs/remotes/origin/develop)
 > git config core.sparsecheckout # timeout=10
 > git checkout -f a36086b600a76ee1252ae3a7e857739ed4c2ff09
 > git rev-list d64c585abad89d925c01fee4f4e4f0890e616aba # timeout=10
[Polygene(JavaEdition)-develop-java9-check] $ /bin/bash -xe /tmp/hudson5158883059088311825.sh
+ uname -a
Linux pomona.apache.org 3.13.0-105-generic #152-Ubuntu SMP Fri Dec 2 15:37:11 UTC 2016 x86_64
x86_64 x86_64 GNU/Linux
+ lscpu
Architecture:          x86_64
CPU op-mode(s):        32-bit, 64-bit
Byte Order:            Little Endian
CPU(s):                16
On-line CPU(s) list:   0-15
Thread(s) per core:    2
Core(s) per socket:    4
Socket(s):             2
NUMA node(s):          2
Vendor ID:             GenuineIntel
CPU family:            6
Model:                 44
Stepping:              2
CPU MHz:               2401.000
BogoMIPS:              4800.23
Virtualization:        VT-x
L1d cache:             32K
L1i cache:             32K
L2 cache:              256K
L3 cache:              12288K
NUMA node0 CPU(s):     0-3,8-11
NUMA node1 CPU(s):     4-7,12-15
+ java -version
java version "9-ea"
Java(TM) SE Runtime Environment (build 9-ea+139)
Java HotSpot(TM) 64-Bit Server VM (build 9-ea+139, mixed mode)
+ mvn --version
/tmp/hudson5158883059088311825.sh: line 5: mvn: command not found
+ free -tm
             total       used       free     shared    buffers     cached
Mem:         48294      45537       2757         18       3151      28980
-/+ buffers/cache:      13404      34889
Swap:        49139      24640      24499
Total:       97434      70177      27257
[Gradle] - Launching build.
[Polygene(JavaEdition)-develop-java9-check] $ <https://builds.apache.org/job/Polygene(JavaEdition)-develop-java9-check/ws/gradlew>
--no-daemon --continue -Dversion=3.0-SNAPSHOT -PskipDocker clean check
To honour the JVM settings for this build a new JVM will be forked. Please consider using
the daemon: https://docs.gradle.org/3.5/userguide/gradle_daemon.html.
Daemon will be stopped at the end of the build stopping after processing
:buildSrc:compileJava NO-SOURCE
:buildSrc:compileGroovy UP-TO-DATE
:buildSrc:processResources UP-TO-DATE
:buildSrc:classes UP-TO-DATE
:buildSrc:jar UP-TO-DATE
:buildSrc:assemble UP-TO-DATE
:buildSrc:compileTestJava NO-SOURCE
:buildSrc:compileTestGroovy UP-TO-DATE
:buildSrc:processTestResources NO-SOURCE
:buildSrc:testClasses UP-TO-DATE
:buildSrc:test UP-TO-DATE
:buildSrc:check UP-TO-DATE
:buildSrc:build UP-TO-DATE
The Jetty plugin has been deprecated and is scheduled to be removed in Gradle 4.0. Consider
using the Gretty (https://github.com/akhikhl/gretty) plugin instead.
	at build_1xqrqqf31vk7tbdc617otcmgh.run(<https://builds.apache.org/job/Polygene(JavaEdition)-develop-java9-check/ws/samples/rental/build.gradle>:23)

FAILURE: Build failed with an exception.

* What went wrong:
Could not resolve all dependencies for configuration ':extensions:indexing-sql:compileClasspath'.
> Project :extensions:indexing-sql declares a dependency from configuration 'api' to configuration
'default' which is not declared in the descriptor for project :libraries:sql-generator.

* Try:
Run with --stacktrace option to get the stack trace. Run with --info or --debug option to
get more log output.

BUILD FAILED

Total time: 17.318 secs
Build step 'Invoke Gradle script' changed build result to FAILURE
Build step 'Invoke Gradle script' marked build as failure
Recording test results
ERROR: Step ?Publish JUnit test result report? failed: Test reports were found but none of
them are new. Did tests run? 
For example, <https://builds.apache.org/job/Polygene(JavaEdition)-develop-java9-check/ws/buildSrc/build/test-results/test/TEST-org.apache.polygene.gradle.release.ModuleReleaseSpecTest.xml>
is 2 days 19 hr old



Mime
View raw message