polygene-dev mailing list archives

Site index · List index
Message view « Date » · « Thread »
Top « Date » · « Thread »
From Apache Jenkins Server <jenk...@builds.apache.org>
Subject Build failed in Jenkins: Polygene(JavaEdition)-develop-java8-checkDists #176
Date Fri, 14 Apr 2017 10:44:15 GMT
See <https://builds.apache.org/job/Polygene(JavaEdition)-develop-java8-checkDists/176/display/redirect?page=changes>

Changes:

[niclas] Fixing pasing a model.json via --import in Yeoman generator. Rewriting

------------------------------------------
[...truncated 473.32 KB...]
Using tag 'org.apache.polygene:org.apache.polygene.internal.docker-s3server' for image.
Step 1 : FROM scality/s3server:mem-1fcb189
---> fb1c099765f2
Step 2 : ENV SCALITY_ACCESS_KEY_ID dummyIdentifier
---> Using cache
---> e99cc060f836
Step 3 : ENV SCALITY_SECRET_ACCESS_KEY dummyCredential
---> Using cache
---> 0a7099f0df14
Successfully built 0a7099f0df14
Created image with ID '0a7099f0df14'.
:internals:testsupport-internal:compileJava
:internals:testsupport-internal:compileJava - is not incremental (e.g. outputs have changed,
no previous execution, etc.).
:internals:testsupport-internal:processResources NO-SOURCE
:internals:testsupport-internal:classes
:internals:testsupport-internal:jar
:internals:testsupport-internal:assemble
:samples:dci:compileJava
:samples:dci:compileJava - is not incremental (e.g. outputs have changed, no previous execution,
etc.).
Note: <https://builds.apache.org/job/Polygene(JavaEdition)-develop-java8-checkDists/ws/samples/dci/src/main/java/org/apache/polygene/dci/moneytransfer/context/Role.java>
uses unchecked or unsafe operations.
Note: Recompile with -Xlint:unchecked for details.
:samples:dci:processResources NO-SOURCE
:samples:dci:classes
:samples:dci:jar
:samples:dci:assemble
:samples:forum:compileJava
:samples:forum:compileJava - is not incremental (e.g. outputs have changed, no previous execution,
etc.).
:samples:forum:processResources NO-SOURCE
:samples:forum:classes
:samples:forum:jar
:samples:forum:assemble
:samples:rental:compileJava
:samples:rental:compileJava - is not incremental (e.g. outputs have changed, no previous execution,
etc.).
Note: <https://builds.apache.org/job/Polygene(JavaEdition)-develop-java8-checkDists/ws/samples/rental/src/main/java/org/apache/polygene/sample/rental/web/Page.java>
uses unchecked or unsafe operations.
Note: Recompile with -Xlint:unchecked for details.
:samples:rental:processResources
:samples:rental:classes
:samples:rental:war
:samples:rental:assemble
:samples:sql-support:compileJava
:samples:sql-support:compileJava - is not incremental (e.g. outputs have changed, no previous
execution, etc.).
:samples:sql-support:processResources
:samples:sql-support:classes
:samples:sql-support:jar
:samples:sql-support:assemble
:samples:swing:compileJava
:samples:swing:compileJava - is not incremental (e.g. outputs have changed, no previous execution,
etc.).
Note: Some input files use unchecked or unsafe operations.
Note: Recompile with -Xlint:unchecked for details.
:samples:swing:processResources NO-SOURCE
:samples:swing:classes
:samples:swing:jar
:samples:swing:assemble
:tests:performance:compileJava
:tests:performance:compileJava - is not incremental (e.g. outputs have changed, no previous
execution, etc.).
:tests:performance:processResources NO-SOURCE
:tests:performance:classes
:tests:performance:jar
:tests:performance:assemble
:tests:regression:compileJava
:tests:regression:compileJava - is not incremental (e.g. outputs have changed, no previous
execution, etc.).
:tests:regression:processResources NO-SOURCE
:tests:regression:classes
:tests:regression:jar
:tests:regression:assemble
:tutorials:cargo:compileJava
:tutorials:cargo:compileJava - is not incremental (e.g. outputs have changed, no previous
execution, etc.).
:tutorials:cargo:processResources NO-SOURCE
:tutorials:cargo:classes
:tutorials:cargo:jar
:tutorials:cargo:assemble
:tutorials:composites:compileJava
:tutorials:composites:compileJava - is not incremental (e.g. outputs have changed, no previous
execution, etc.).
:tutorials:composites:processResources NO-SOURCE
:tutorials:composites:classes
:tutorials:composites:jar
:tutorials:composites:assemble
:tutorials:hello:compileJava
:tutorials:hello:compileJava - is not incremental (e.g. outputs have changed, no previous
execution, etc.).
:tutorials:hello:processResources NO-SOURCE
:tutorials:hello:classes
:tutorials:hello:jar
:tutorials:hello:assemble
:tutorials:introduction:compileJava
:tutorials:introduction:compileJava - is not incremental (e.g. outputs have changed, no previous
execution, etc.).
:tutorials:introduction:processResources NO-SOURCE
:tutorials:introduction:classes
:tutorials:introduction:jar
:tutorials:introduction:assemble
:tutorials:services:compileJava
:tutorials:services:compileJava - is not incremental (e.g. outputs have changed, no previous
execution, etc.).
:tutorials:services:processResources
:tutorials:services:classes
:tutorials:services:jar
:tutorials:services:assemble
:tutorials:introduction:tenminutes:compileJava
:tutorials:introduction:tenminutes:compileJava - is not incremental (e.g. outputs have changed,
no previous execution, etc.).
:tutorials:introduction:tenminutes:processResources NO-SOURCE
:tutorials:introduction:tenminutes:classes
:tutorials:introduction:tenminutes:jar
:tutorials:introduction:tenminutes:assemble
:tutorials:introduction:thirtyminutes:compileJava
:tutorials:introduction:thirtyminutes:compileJava - is not incremental (e.g. outputs have
changed, no previous execution, etc.).
Note: <https://builds.apache.org/job/Polygene(JavaEdition)-develop-java8-checkDists/ws/tutorials/introduction/thirtyminutes/src/main/java/org/apache/polygene/demo/thirtyminutes/ThirtyMinutesDocs.java>
uses unchecked or unsafe operations.
Note: Recompile with -Xlint:unchecked for details.
:tutorials:introduction:thirtyminutes:processResources NO-SOURCE
:tutorials:introduction:thirtyminutes:classes
:tutorials:introduction:thirtyminutes:jar
:tutorials:introduction:thirtyminutes:assemble
:tutorials:introduction:twominutes:compileJava
:tutorials:introduction:twominutes:compileJava - is not incremental (e.g. outputs have changed,
no previous execution, etc.).
:tutorials:introduction:twominutes:processResources NO-SOURCE
:tutorials:introduction:twominutes:classes
:tutorials:introduction:twominutes:jar
:tutorials:introduction:twominutes:assemble
:distributions:stageBinaryDistribution
:distributions:ratBinaryDistribution
:distributions:checkBinaryDistribution
:distributions:stageSourceDistribution
:distributions:ratSourceDistribution
:distributions:buildSourceDistribution
:distributions:checkSourceDistribution
:distributions:checkDistributions

FAILURE: Build failed with an exception.

* What went wrong:
Execution failed for task ':manual:website'.
> Process 'command 'asciidoc'' finished with non-zero exit value 1
  	STDOUT file://<https://builds.apache.org/job/Polygene(JavaEdition)-develop-java8-checkDists/ws/manual/build/tmp/website/adoc-2-docbook-stdout.log>
  	STDERR file://<https://builds.apache.org/job/Polygene(JavaEdition)-develop-java8-checkDists/ws/manual/build/tmp/website/adoc-2-docbook-stderr.log>

* Try:
Run with --info or --debug option to get more log output.

* Exception is:
org.gradle.api.tasks.TaskExecutionException: Execution failed for task ':manual:website'.
	at org.gradle.api.internal.tasks.execution.ExecuteActionsTaskExecuter.executeActions(ExecuteActionsTaskExecuter.java:98)
	at org.gradle.api.internal.tasks.execution.ExecuteActionsTaskExecuter.execute(ExecuteActionsTaskExecuter.java:68)
	at org.gradle.api.internal.tasks.execution.SkipUpToDateTaskExecuter.execute(SkipUpToDateTaskExecuter.java:62)
	at org.gradle.api.internal.tasks.execution.ValidatingTaskExecuter.execute(ValidatingTaskExecuter.java:58)
	at org.gradle.api.internal.tasks.execution.SkipEmptySourceFilesTaskExecuter.execute(SkipEmptySourceFilesTaskExecuter.java:88)
	at org.gradle.api.internal.tasks.execution.ResolveTaskArtifactStateTaskExecuter.execute(ResolveTaskArtifactStateTaskExecuter.java:46)
	at org.gradle.api.internal.tasks.execution.SkipTaskWithNoActionsExecuter.execute(SkipTaskWithNoActionsExecuter.java:51)
	at org.gradle.api.internal.tasks.execution.SkipOnlyIfTaskExecuter.execute(SkipOnlyIfTaskExecuter.java:54)
	at org.gradle.api.internal.tasks.execution.ExecuteAtMostOnceTaskExecuter.execute(ExecuteAtMostOnceTaskExecuter.java:43)
	at org.gradle.api.internal.tasks.execution.CatchExceptionTaskExecuter.execute(CatchExceptionTaskExecuter.java:34)
	at org.gradle.execution.taskgraph.DefaultTaskGraphExecuter$EventFiringTaskWorker$1.execute(DefaultTaskGraphExecuter.java:236)
	at org.gradle.execution.taskgraph.DefaultTaskGraphExecuter$EventFiringTaskWorker$1.execute(DefaultTaskGraphExecuter.java:228)
	at org.gradle.internal.Transformers$4.transform(Transformers.java:169)
	at org.gradle.internal.progress.DefaultBuildOperationExecutor.run(DefaultBuildOperationExecutor.java:106)
	at org.gradle.internal.progress.DefaultBuildOperationExecutor.run(DefaultBuildOperationExecutor.java:61)
	at org.gradle.execution.taskgraph.DefaultTaskGraphExecuter$EventFiringTaskWorker.execute(DefaultTaskGraphExecuter.java:228)
	at org.gradle.execution.taskgraph.DefaultTaskGraphExecuter$EventFiringTaskWorker.execute(DefaultTaskGraphExecuter.java:215)
	at org.gradle.execution.taskgraph.AbstractTaskPlanExecutor$TaskExecutorWorker.processTask(AbstractTaskPlanExecutor.java:77)
	at org.gradle.execution.taskgraph.AbstractTaskPlanExecutor$TaskExecutorWorker.run(AbstractTaskPlanExecutor.java:58)
	at org.gradle.execution.taskgraph.DefaultTaskPlanExecutor.process(DefaultTaskPlanExecutor.java:32)
	at org.gradle.execution.taskgraph.DefaultTaskGraphExecuter.execute(DefaultTaskGraphExecuter.java:113)
	at org.gradle.execution.SelectedTaskExecutionAction.execute(SelectedTaskExecutionAction.java:37)
	at org.gradle.execution.DefaultBuildExecuter.execute(DefaultBuildExecuter.java:37)
	at org.gradle.execution.DefaultBuildExecuter.access$000(DefaultBuildExecuter.java:23)
	at org.gradle.execution.DefaultBuildExecuter$1.proceed(DefaultBuildExecuter.java:43)
	at org.gradle.execution.DryRunBuildExecutionAction.execute(DryRunBuildExecutionAction.java:32)
	at org.gradle.execution.DefaultBuildExecuter.execute(DefaultBuildExecuter.java:37)
	at org.gradle.execution.DefaultBuildExecuter.execute(DefaultBuildExecuter.java:30)
	at org.gradle.initialization.DefaultGradleLauncher$RunTasksAction.execute(DefaultGradleLauncher.java:230)
	at org.gradle.initialization.DefaultGradleLauncher$RunTasksAction.execute(DefaultGradleLauncher.java:227)
	at org.gradle.internal.Transformers$4.transform(Transformers.java:169)
	at org.gradle.internal.progress.DefaultBuildOperationExecutor.run(DefaultBuildOperationExecutor.java:106)
	at org.gradle.internal.progress.DefaultBuildOperationExecutor.run(DefaultBuildOperationExecutor.java:56)
	at org.gradle.initialization.DefaultGradleLauncher.doBuildStages(DefaultGradleLauncher.java:161)
	at org.gradle.initialization.DefaultGradleLauncher.doBuild(DefaultGradleLauncher.java:112)
	at org.gradle.initialization.DefaultGradleLauncher.run(DefaultGradleLauncher.java:95)
	at org.gradle.launcher.exec.GradleBuildController.run(GradleBuildController.java:66)
	at org.gradle.tooling.internal.provider.ExecuteBuildActionRunner.run(ExecuteBuildActionRunner.java:28)
	at org.gradle.launcher.exec.ChainingBuildActionRunner.run(ChainingBuildActionRunner.java:35)
	at org.gradle.launcher.exec.InProcessBuildActionExecuter.execute(InProcessBuildActionExecuter.java:41)
	at org.gradle.launcher.exec.InProcessBuildActionExecuter.execute(InProcessBuildActionExecuter.java:26)
	at org.gradle.tooling.internal.provider.ContinuousBuildActionExecuter.execute(ContinuousBuildActionExecuter.java:75)
	at org.gradle.tooling.internal.provider.ContinuousBuildActionExecuter.execute(ContinuousBuildActionExecuter.java:49)
	at org.gradle.tooling.internal.provider.ServicesSetupBuildActionExecuter.execute(ServicesSetupBuildActionExecuter.java:49)
	at org.gradle.tooling.internal.provider.ServicesSetupBuildActionExecuter.execute(ServicesSetupBuildActionExecuter.java:31)
	at org.gradle.launcher.daemon.server.exec.ExecuteBuild.doBuild(ExecuteBuild.java:67)
	at org.gradle.launcher.daemon.server.exec.BuildCommandOnly.execute(BuildCommandOnly.java:36)
	at org.gradle.launcher.daemon.server.api.DaemonCommandExecution.proceed(DaemonCommandExecution.java:120)
	at org.gradle.launcher.daemon.server.exec.WatchForDisconnection.execute(WatchForDisconnection.java:37)
	at org.gradle.launcher.daemon.server.api.DaemonCommandExecution.proceed(DaemonCommandExecution.java:120)
	at org.gradle.launcher.daemon.server.exec.ResetDeprecationLogger.execute(ResetDeprecationLogger.java:26)
	at org.gradle.launcher.daemon.server.api.DaemonCommandExecution.proceed(DaemonCommandExecution.java:120)
	at org.gradle.launcher.daemon.server.exec.RequestStopIfSingleUsedDaemon.execute(RequestStopIfSingleUsedDaemon.java:34)
	at org.gradle.launcher.daemon.server.api.DaemonCommandExecution.proceed(DaemonCommandExecution.java:120)
	at org.gradle.launcher.daemon.server.exec.ForwardClientInput$2.call(ForwardClientInput.java:74)
	at org.gradle.launcher.daemon.server.exec.ForwardClientInput$2.call(ForwardClientInput.java:72)
	at org.gradle.util.Swapper.swap(Swapper.java:38)
	at org.gradle.launcher.daemon.server.exec.ForwardClientInput.execute(ForwardClientInput.java:72)
	at org.gradle.launcher.daemon.server.api.DaemonCommandExecution.proceed(DaemonCommandExecution.java:120)
	at org.gradle.launcher.daemon.server.exec.LogAndCheckHealth.execute(LogAndCheckHealth.java:50)
	at org.gradle.launcher.daemon.server.api.DaemonCommandExecution.proceed(DaemonCommandExecution.java:120)
	at org.gradle.launcher.daemon.server.exec.LogToClient.doBuild(LogToClient.java:60)
	at org.gradle.launcher.daemon.server.exec.BuildCommandOnly.execute(BuildCommandOnly.java:36)
	at org.gradle.launcher.daemon.server.api.DaemonCommandExecution.proceed(DaemonCommandExecution.java:120)
	at org.gradle.launcher.daemon.server.exec.EstablishBuildEnvironment.doBuild(EstablishBuildEnvironment.java:72)
	at org.gradle.launcher.daemon.server.exec.BuildCommandOnly.execute(BuildCommandOnly.java:36)
	at org.gradle.launcher.daemon.server.api.DaemonCommandExecution.proceed(DaemonCommandExecution.java:120)
	at org.gradle.launcher.daemon.server.exec.StartBuildOrRespondWithBusy$1.run(StartBuildOrRespondWithBusy.java:50)
	at org.gradle.launcher.daemon.server.DaemonStateCoordinator$1.run(DaemonStateCoordinator.java:297)
	at org.gradle.internal.concurrent.ExecutorPolicy$CatchAndRecordFailures.onExecute(ExecutorPolicy.java:63)
	at org.gradle.internal.concurrent.StoppableExecutorImpl$1.run(StoppableExecutorImpl.java:46)
Caused by: org.gradle.api.GradleException: Process 'command 'asciidoc'' finished with non-zero
exit value 1
	STDOUT file://<https://builds.apache.org/job/Polygene(JavaEdition)-develop-java8-checkDists/ws/manual/build/tmp/website/adoc-2-docbook-stdout.log>
	STDERR file://<https://builds.apache.org/job/Polygene(JavaEdition)-develop-java8-checkDists/ws/manual/build/tmp/website/adoc-2-docbook-stderr.log>
	at org.apache.polygene.gradle.tasks.ExecLogged.doExecLogged(ExecLogged.groovy:101)
	at org.apache.polygene.gradle.tasks.ExecLogged.execLogged(ExecLogged.groovy:71)
	at org.apache.polygene.gradle.structure.manual.DocumentationTask.generateXDoc(DocumentationTask.groovy:209)
	at org.apache.polygene.gradle.structure.manual.DocumentationTask.generate(DocumentationTask.groovy:101)
	at org.gradle.internal.reflect.JavaMethod.invoke(JavaMethod.java:73)
	at org.gradle.api.internal.project.taskfactory.DefaultTaskClassInfoStore$StandardTaskAction.doExecute(DefaultTaskClassInfoStore.java:141)
	at org.gradle.api.internal.project.taskfactory.DefaultTaskClassInfoStore$StandardTaskAction.execute(DefaultTaskClassInfoStore.java:134)
	at org.gradle.api.internal.project.taskfactory.DefaultTaskClassInfoStore$StandardTaskAction.execute(DefaultTaskClassInfoStore.java:123)
	at org.gradle.api.internal.AbstractTask$TaskActionWrapper.execute(AbstractTask.java:692)
	at org.gradle.api.internal.AbstractTask$TaskActionWrapper.execute(AbstractTask.java:675)
	at org.gradle.api.internal.tasks.execution.ExecuteActionsTaskExecuter$1.execute(ExecuteActionsTaskExecuter.java:115)
	at org.gradle.api.internal.tasks.execution.ExecuteActionsTaskExecuter$1.execute(ExecuteActionsTaskExecuter.java:109)
	at org.gradle.internal.Transformers$4.transform(Transformers.java:169)
	at org.gradle.internal.progress.DefaultBuildOperationExecutor.run(DefaultBuildOperationExecutor.java:106)
	at org.gradle.internal.progress.DefaultBuildOperationExecutor.run(DefaultBuildOperationExecutor.java:56)
	at org.gradle.api.internal.tasks.execution.ExecuteActionsTaskExecuter.executeAction(ExecuteActionsTaskExecuter.java:109)
	at org.gradle.api.internal.tasks.execution.ExecuteActionsTaskExecuter.executeActions(ExecuteActionsTaskExecuter.java:90)
	... 70 more
Caused by: org.gradle.process.internal.ExecException: Process 'command 'asciidoc'' finished
with non-zero exit value 1
	at org.gradle.process.internal.DefaultExecHandle$ExecResultImpl.assertNormalExitValue(DefaultExecHandle.java:369)
	at org.gradle.process.internal.DefaultExecAction.execute(DefaultExecAction.java:31)
	at org.gradle.api.internal.file.DefaultFileOperations.exec(DefaultFileOperations.java:176)
	at org.gradle.api.internal.project.DefaultProject.exec(DefaultProject.java:1036)
	at org.gradle.api.internal.project.DefaultProject.exec(DefaultProject.java:1031)
	at org.apache.polygene.gradle.tasks.ExecLogged$_execLogged_closure2.doCall(ExecLogged.groovy:72)
	at com.sun.proxy.$Proxy66.accept(Unknown Source)
	at org.apache.polygene.gradle.tasks.ExecLogged.doExecLogged(ExecLogged.groovy:97)
	... 86 more


BUILD FAILED

Total time: 29 mins 28.308 secs
Build step 'Invoke Gradle script' changed build result to FAILURE
Build step 'Invoke Gradle script' marked build as failure
Archiving artifacts
Recording test results
Publishing Javadoc

Mime
View raw message