polygene-dev mailing list archives

Site index · List index
Message view « Date » · « Thread »
Top « Date » · « Thread »
From Paul Merlin <paulmer...@apache.org>
Subject Re: Build failed in Jenkins: Polygene(JavaEdition)-develop-java8-checkDists #126
Date Mon, 06 Mar 2017 11:32:35 GMT
Niclas Hedhman a écrit :
> Did I cause this??

Nope!

The failures are from docker integration tests that still fail on CI.
We'll get this once a week, when this job checks the generated source
distribution, until I find time to fix this.



> On Mon, Mar 6, 2017 at 5:40 PM, Apache Jenkins Server <
> jenkins@builds.apache.org> wrote:
>
>> See <https://builds.apache.org/job/Polygene(JavaEdition)-
>> develop-java8-checkDists/126/display/redirect?page=changes>
>>
>> Changes:
>>
>> [niclas] Wrong class name for the assembler
>>
>> [niclas] Fixes on the Yeoman generator
>>
>> [niclas] POLYGENE-234 : Adding a default name to services.
>>
>> [niclas] POLYGENE-234 : Realized that there used to be some type of default
>>
>> [niclas] POLYGENE-234 : Adding the use of Assemblers in Solr indexing
>>
>> [niclas] POLYGENE-235: Adding "query" and "indexing" tags to SQL Indexing
>>
>> [niclas] POLYGENE-235 : Adding "query" and "indexing" to RDF Indexing.
>>
>> [niclas] POLYGENE-235 : Adding "query" and "indexing" tags to ElasticSearch
>>
>> [niclas] Various improvements in Cassandra ES, from using it in an
>> application.
>>
>> [niclas] POLYGENE-158 : A bunch of work on the Yeoman project creator.
>> Still far
>>
>> [niclas] The Metrics dependencies are all messed up. Killed
>> libry("metrics") and
>>
>> [gragaller] POLYGENE-236: Let the embedded MongoDB Server bind to localhost
>>
>> [gragaller] POLYGENE-237: Changed database name to 'polygene-test' to
>> avoid illegal
>>
>> ------------------------------------------
>> [...truncated 482.75 KB...]
>>         at org.gradle.api.internal.project.taskfactory.
>> DefaultTaskClassInfoStore$StandardTaskAction.execute(
>> DefaultTaskClassInfoStore.java:134)
>>         at org.gradle.api.internal.project.taskfactory.
>> DefaultTaskClassInfoStore$StandardTaskAction.execute(
>> DefaultTaskClassInfoStore.java:123)
>>         at org.gradle.api.internal.AbstractTask$TaskActionWrapper.execute(
>> AbstractTask.java:632)
>>         at org.gradle.api.internal.AbstractTask$TaskActionWrapper.execute(
>> AbstractTask.java:615)
>>         at org.gradle.api.internal.tasks.execution.
>> ExecuteActionsTaskExecuter.executeAction(ExecuteActionsTaskExecuter.
>> java:95)
>>         at org.gradle.api.internal.tasks.execution.
>> ExecuteActionsTaskExecuter.executeActions(ExecuteActionsTaskExecuter.
>> java:76)
>>         ... 73 more
>>
>> ============================================================
>> ==================
>>
>> 4: Task failed with an exception.
>> -----------
>> * What went wrong:
>> Execution failed for task ':distributions:signZipSourceDistribution'.
>>> Cannot perform signing task ':distributions:signZipSourceDistribution'
>> because it has no configured signatory
>>
>> * Try:
>> Run with --info or --debug option to get more log output.
>>
>> * Exception is:
>> org.gradle.api.tasks.TaskExecutionException: Execution failed for task
>> ':distributions:signZipSourceDistribution'.
>>         at org.gradle.api.internal.tasks.execution.
>> ExecuteActionsTaskExecuter.executeActions(ExecuteActionsTaskExecuter.
>> java:84)
>>         at org.gradle.api.internal.tasks.execution.
>> ExecuteActionsTaskExecuter.execute(ExecuteActionsTaskExecuter.java:55)
>>         at org.gradle.api.internal.tasks.execution.
>> SkipUpToDateTaskExecuter.execute(SkipUpToDateTaskExecuter.java:62)
>>         at org.gradle.api.internal.tasks.execution.ValidatingTaskExecuter.
>> execute(ValidatingTaskExecuter.java:58)
>>         at org.gradle.api.internal.tasks.execution.
>> SkipEmptySourceFilesTaskExecuter.execute(SkipEmptySourceFilesTaskExecut
>> er.java:88)
>>         at org.gradle.api.internal.tasks.execution.
>> ResolveTaskArtifactStateTaskExecuter.execute(
>> ResolveTaskArtifactStateTaskExecuter.java:46)
>>         at org.gradle.api.internal.tasks.execution.
>> SkipTaskWithNoActionsExecuter.execute(SkipTaskWithNoActionsExecuter.
>> java:51)
>>         at org.gradle.api.internal.tasks.execution.SkipOnlyIfTaskExecuter.
>> execute(SkipOnlyIfTaskExecuter.java:54)
>>         at org.gradle.api.internal.tasks.execution.
>> ExecuteAtMostOnceTaskExecuter.execute(ExecuteAtMostOnceTaskExecuter.
>> java:43)
>>         at org.gradle.api.internal.tasks.execution.
>> CatchExceptionTaskExecuter.execute(CatchExceptionTaskExecuter.java:34)
>>         at org.gradle.execution.taskgraph.DefaultTaskGraphExecuter$
>> EventFiringTaskWorker$1.execute(DefaultTaskGraphExecuter.java:236)
>>         at org.gradle.execution.taskgraph.DefaultTaskGraphExecuter$
>> EventFiringTaskWorker$1.execute(DefaultTaskGraphExecuter.java:228)
>>         at org.gradle.internal.Transformers$4.transform(
>> Transformers.java:169)
>>         at org.gradle.internal.progress.DefaultBuildOperationExecutor.run(
>> DefaultBuildOperationExecutor.java:106)
>>         at org.gradle.internal.progress.DefaultBuildOperationExecutor.run(
>> DefaultBuildOperationExecutor.java:61)
>>         at org.gradle.execution.taskgraph.DefaultTaskGraphExecuter$
>> EventFiringTaskWorker.execute(DefaultTaskGraphExecuter.java:228)
>>         at org.gradle.execution.taskgraph.DefaultTaskGraphExecuter$
>> EventFiringTaskWorker.execute(DefaultTaskGraphExecuter.java:215)
>>         at org.gradle.execution.taskgraph.AbstractTaskPlanExecutor$
>> TaskExecutorWorker.processTask(AbstractTaskPlanExecutor.java:77)
>>         at org.gradle.execution.taskgraph.AbstractTaskPlanExecutor$
>> TaskExecutorWorker.run(AbstractTaskPlanExecutor.java:58)
>>         at org.gradle.execution.taskgraph.DefaultTaskPlanExecutor.process(
>> DefaultTaskPlanExecutor.java:32)
>>         at org.gradle.execution.taskgraph.DefaultTaskGraphExecuter.
>> execute(DefaultTaskGraphExecuter.java:113)
>>         at org.gradle.execution.SelectedTaskExecutionAction.execute(
>> SelectedTaskExecutionAction.java:37)
>>         at org.gradle.execution.DefaultBuildExecuter.execute(
>> DefaultBuildExecuter.java:37)
>>         at org.gradle.execution.DefaultBuildExecuter.access$
>> 000(DefaultBuildExecuter.java:23)
>>         at org.gradle.execution.DefaultBuildExecuter$1.
>> proceed(DefaultBuildExecuter.java:43)
>>         at org.gradle.execution.DryRunBuildExecutionAction.execute(
>> DryRunBuildExecutionAction.java:32)
>>         at org.gradle.execution.DefaultBuildExecuter.execute(
>> DefaultBuildExecuter.java:37)
>>         at org.gradle.execution.DefaultBuildExecuter.execute(
>> DefaultBuildExecuter.java:30)
>>         at org.gradle.initialization.DefaultGradleLauncher$
>> RunTasksAction.execute(DefaultGradleLauncher.java:256)
>>         at org.gradle.initialization.DefaultGradleLauncher$
>> RunTasksAction.execute(DefaultGradleLauncher.java:253)
>>         at org.gradle.internal.Transformers$4.transform(
>> Transformers.java:169)
>>         at org.gradle.internal.progress.DefaultBuildOperationExecutor.run(
>> DefaultBuildOperationExecutor.java:106)
>>         at org.gradle.internal.progress.DefaultBuildOperationExecutor.run(
>> DefaultBuildOperationExecutor.java:56)
>>         at org.gradle.initialization.DefaultGradleLauncher.doBuildStages(
>> DefaultGradleLauncher.java:175)
>>         at org.gradle.initialization.DefaultGradleLauncher.doBuild(
>> DefaultGradleLauncher.java:119)
>>         at org.gradle.initialization.DefaultGradleLauncher.run(
>> DefaultGradleLauncher.java:102)
>>         at org.gradle.launcher.exec.GradleBuildController.run(
>> GradleBuildController.java:71)
>>         at org.gradle.tooling.internal.provider.
>> ExecuteBuildActionRunner.run(ExecuteBuildActionRunner.java:28)
>>         at org.gradle.launcher.exec.ChainingBuildActionRunner.run(
>> ChainingBuildActionRunner.java:35)
>>         at org.gradle.launcher.exec.InProcessBuildActionExecuter.execute(
>> InProcessBuildActionExecuter.java:41)
>>         at org.gradle.launcher.exec.InProcessBuildActionExecuter.execute(
>> InProcessBuildActionExecuter.java:26)
>>         at org.gradle.tooling.internal.provider.
>> ContinuousBuildActionExecuter.execute(ContinuousBuildActionExecuter.
>> java:75)
>>         at org.gradle.tooling.internal.provider.
>> ContinuousBuildActionExecuter.execute(ContinuousBuildActionExecuter.
>> java:49)
>>         at org.gradle.tooling.internal.provider.
>> ServicesSetupBuildActionExecuter.execute(ServicesSetupBuildActionExecut
>> er.java:49)
>>         at org.gradle.tooling.internal.provider.
>> ServicesSetupBuildActionExecuter.execute(ServicesSetupBuildActionExecut
>> er.java:31)
>>         at org.gradle.launcher.daemon.server.exec.ExecuteBuild.
>> doBuild(ExecuteBuild.java:67)
>>         at org.gradle.launcher.daemon.server.exec.BuildCommandOnly.
>> execute(BuildCommandOnly.java:36)
>>         at org.gradle.launcher.daemon.server.api.DaemonCommandExecution.
>> proceed(DaemonCommandExecution.java:120)
>>         at org.gradle.launcher.daemon.server.exec.
>> WatchForDisconnection.execute(WatchForDisconnection.java:47)
>>         at org.gradle.launcher.daemon.server.api.DaemonCommandExecution.
>> proceed(DaemonCommandExecution.java:120)
>>         at org.gradle.launcher.daemon.server.exec.ResetDeprecationLogger.
>> execute(ResetDeprecationLogger.java:26)
>>         at org.gradle.launcher.daemon.server.api.DaemonCommandExecution.
>> proceed(DaemonCommandExecution.java:120)
>>         at org.gradle.launcher.daemon.server.exec.
>> RequestStopIfSingleUsedDaemon.execute(RequestStopIfSingleUsedDaemon.
>> java:34)
>>         at org.gradle.launcher.daemon.server.api.DaemonCommandExecution.
>> proceed(DaemonCommandExecution.java:120)
>>         at org.gradle.launcher.daemon.server.exec.
>> ForwardClientInput$2.call(ForwardClientInput.java:74)
>>         at org.gradle.launcher.daemon.server.exec.
>> ForwardClientInput$2.call(ForwardClientInput.java:72)
>>         at org.gradle.util.Swapper.swap(Swapper.java:38)
>>         at org.gradle.launcher.daemon.server.exec.
>> ForwardClientInput.execute(ForwardClientInput.java:72)
>>         at org.gradle.launcher.daemon.server.api.DaemonCommandExecution.
>> proceed(DaemonCommandExecution.java:120)
>>         at org.gradle.launcher.daemon.server.exec.LogAndCheckHealth.
>> execute(LogAndCheckHealth.java:50)
>>         at org.gradle.launcher.daemon.server.api.DaemonCommandExecution.
>> proceed(DaemonCommandExecution.java:120)
>>         at org.gradle.launcher.daemon.server.exec.LogToClient.
>> doBuild(LogToClient.java:60)
>>         at org.gradle.launcher.daemon.server.exec.BuildCommandOnly.
>> execute(BuildCommandOnly.java:36)
>>         at org.gradle.launcher.daemon.server.api.DaemonCommandExecution.
>> proceed(DaemonCommandExecution.java:120)
>>         at org.gradle.launcher.daemon.server.exec.
>> EstablishBuildEnvironment.doBuild(EstablishBuildEnvironment.java:72)
>>         at org.gradle.launcher.daemon.server.exec.BuildCommandOnly.
>> execute(BuildCommandOnly.java:36)
>>         at org.gradle.launcher.daemon.server.api.DaemonCommandExecution.
>> proceed(DaemonCommandExecution.java:120)
>>         at org.gradle.launcher.daemon.server.exec.
>> StartBuildOrRespondWithBusy$1.run(StartBuildOrRespondWithBusy.java:50)
>>         at org.gradle.launcher.daemon.server.DaemonStateCoordinator$
>> 1.run(DaemonStateCoordinator.java:297)
>>         at org.gradle.internal.concurrent.ExecutorPolicy$
>> CatchAndRecordFailures.onExecute(ExecutorPolicy.java:63)
>>         at org.gradle.internal.concurrent.StoppableExecutorImpl$1.run(
>> StoppableExecutorImpl.java:46)
>>         at java.util.concurrent.ThreadPoolExecutor.runWorker(
>> ThreadPoolExecutor.java:1142)
>>         at java.util.concurrent.ThreadPoolExecutor$Worker.run(
>> ThreadPoolExecutor.java:617)
>>         at java.lang.Thread.run(Thread.java:745)
>> Caused by: org.gradle.api.InvalidUserDataException: Cannot perform
>> signing task ':distributions:signZipSourceDistribution' because it has no
>> configured signatory
>>         at org.gradle.plugins.signing.Sign.generate(Sign.java:267)
>>         at sun.reflect.NativeMethodAccessorImpl.invoke0(Native Method)
>>         at sun.reflect.NativeMethodAccessorImpl.invoke(
>> NativeMethodAccessorImpl.java:62)
>>         at sun.reflect.DelegatingMethodAccessorImpl.invoke(
>> DelegatingMethodAccessorImpl.java:43)
>>         at java.lang.reflect.Method.invoke(Method.java:498)
>>         at org.gradle.internal.reflect.JavaMethod.invoke(JavaMethod.
>> java:73)
>>         at org.gradle.api.internal.project.taskfactory.
>> DefaultTaskClassInfoStore$StandardTaskAction.doExecute(
>> DefaultTaskClassInfoStore.java:141)
>>         at org.gradle.api.internal.project.taskfactory.
>> DefaultTaskClassInfoStore$StandardTaskAction.execute(
>> DefaultTaskClassInfoStore.java:134)
>>         at org.gradle.api.internal.project.taskfactory.
>> DefaultTaskClassInfoStore$StandardTaskAction.execute(
>> DefaultTaskClassInfoStore.java:123)
>>         at org.gradle.api.internal.AbstractTask$TaskActionWrapper.execute(
>> AbstractTask.java:632)
>>         at org.gradle.api.internal.AbstractTask$TaskActionWrapper.execute(
>> AbstractTask.java:615)
>>         at org.gradle.api.internal.tasks.execution.
>> ExecuteActionsTaskExecuter.executeAction(ExecuteActionsTaskExecuter.
>> java:95)
>>         at org.gradle.api.internal.tasks.execution.
>> ExecuteActionsTaskExecuter.executeActions(ExecuteActionsTaskExecuter.
>> java:76)
>>         ... 73 more
>>
>> ============================================================
>> ==================
>>
>> 5: Task failed with an exception.
>> -----------
>> * What went wrong:
>> Execution failed for task ':distributions:buildSourceDistribution'.
>>> Process 'command './gradlew'' finished with non-zero exit value 1
>>         STDOUT file://<https://builds.apache.
>> org/job/Polygene(JavaEdition)-develop-java8-checkDists/ws/
>> distributions/build/log/buildSourceDistribution/buildSourceDistribution-
>> stdout.log>
>>         STDERR file://<https://builds.apache.
>> org/job/Polygene(JavaEdition)-develop-java8-checkDists/ws/
>> distributions/build/log/buildSourceDistribution/buildSourceDistribution-
>> stderr.log>
>>
>> * Try:
>> Run with --info or --debug option to get more log output.
>>
>> * Exception is:
>> org.gradle.api.tasks.TaskExecutionException: Execution failed for task
>> ':distributions:buildSourceDistribution'.
>>         at org.gradle.api.internal.tasks.execution.
>> ExecuteActionsTaskExecuter.executeActions(ExecuteActionsTaskExecuter.
>> java:84)
>>         at org.gradle.api.internal.tasks.execution.
>> ExecuteActionsTaskExecuter.execute(ExecuteActionsTaskExecuter.java:55)
>>         at org.gradle.api.internal.tasks.execution.
>> SkipUpToDateTaskExecuter.execute(SkipUpToDateTaskExecuter.java:62)
>>         at org.gradle.api.internal.tasks.execution.ValidatingTaskExecuter.
>> execute(ValidatingTaskExecuter.java:58)
>>         at org.gradle.api.internal.tasks.execution.
>> SkipEmptySourceFilesTaskExecuter.execute(SkipEmptySourceFilesTaskExecut
>> er.java:88)
>>         at org.gradle.api.internal.tasks.execution.
>> ResolveTaskArtifactStateTaskExecuter.execute(
>> ResolveTaskArtifactStateTaskExecuter.java:46)
>>         at org.gradle.api.internal.tasks.execution.
>> SkipTaskWithNoActionsExecuter.execute(SkipTaskWithNoActionsExecuter.
>> java:51)
>>         at org.gradle.api.internal.tasks.execution.SkipOnlyIfTaskExecuter.
>> execute(SkipOnlyIfTaskExecuter.java:54)
>>         at org.gradle.api.internal.tasks.execution.
>> ExecuteAtMostOnceTaskExecuter.execute(ExecuteAtMostOnceTaskExecuter.
>> java:43)
>>         at org.gradle.api.internal.tasks.execution.
>> CatchExceptionTaskExecuter.execute(CatchExceptionTaskExecuter.java:34)
>>         at org.gradle.execution.taskgraph.DefaultTaskGraphExecuter$
>> EventFiringTaskWorker$1.execute(DefaultTaskGraphExecuter.java:236)
>>         at org.gradle.execution.taskgraph.DefaultTaskGraphExecuter$
>> EventFiringTaskWorker$1.execute(DefaultTaskGraphExecuter.java:228)
>>         at org.gradle.internal.Transformers$4.transform(
>> Transformers.java:169)
>>         at org.gradle.internal.progress.DefaultBuildOperationExecutor.run(
>> DefaultBuildOperationExecutor.java:106)
>>         at org.gradle.internal.progress.DefaultBuildOperationExecutor.run(
>> DefaultBuildOperationExecutor.java:61)
>>         at org.gradle.execution.taskgraph.DefaultTaskGraphExecuter$
>> EventFiringTaskWorker.execute(DefaultTaskGraphExecuter.java:228)
>>         at org.gradle.execution.taskgraph.DefaultTaskGraphExecuter$
>> EventFiringTaskWorker.execute(DefaultTaskGraphExecuter.java:215)
>>         at org.gradle.execution.taskgraph.AbstractTaskPlanExecutor$
>> TaskExecutorWorker.processTask(AbstractTaskPlanExecutor.java:77)
>>         at org.gradle.execution.taskgraph.AbstractTaskPlanExecutor$
>> TaskExecutorWorker.run(AbstractTaskPlanExecutor.java:58)
>>         at org.gradle.execution.taskgraph.DefaultTaskPlanExecutor.process(
>> DefaultTaskPlanExecutor.java:32)
>>         at org.gradle.execution.taskgraph.DefaultTaskGraphExecuter.
>> execute(DefaultTaskGraphExecuter.java:113)
>>         at org.gradle.execution.SelectedTaskExecutionAction.execute(
>> SelectedTaskExecutionAction.java:37)
>>         at org.gradle.execution.DefaultBuildExecuter.execute(
>> DefaultBuildExecuter.java:37)
>>         at org.gradle.execution.DefaultBuildExecuter.access$
>> 000(DefaultBuildExecuter.java:23)
>>         at org.gradle.execution.DefaultBuildExecuter$1.
>> proceed(DefaultBuildExecuter.java:43)
>>         at org.gradle.execution.DryRunBuildExecutionAction.execute(
>> DryRunBuildExecutionAction.java:32)
>>         at org.gradle.execution.DefaultBuildExecuter.execute(
>> DefaultBuildExecuter.java:37)
>>         at org.gradle.execution.DefaultBuildExecuter.execute(
>> DefaultBuildExecuter.java:30)
>>         at org.gradle.initialization.DefaultGradleLauncher$
>> RunTasksAction.execute(DefaultGradleLauncher.java:256)
>>         at org.gradle.initialization.DefaultGradleLauncher$
>> RunTasksAction.execute(DefaultGradleLauncher.java:253)
>>         at org.gradle.internal.Transformers$4.transform(
>> Transformers.java:169)
>>         at org.gradle.internal.progress.DefaultBuildOperationExecutor.run(
>> DefaultBuildOperationExecutor.java:106)
>>         at org.gradle.internal.progress.DefaultBuildOperationExecutor.run(
>> DefaultBuildOperationExecutor.java:56)
>>         at org.gradle.initialization.DefaultGradleLauncher.doBuildStages(
>> DefaultGradleLauncher.java:175)
>>         at org.gradle.initialization.DefaultGradleLauncher.doBuild(
>> DefaultGradleLauncher.java:119)
>>         at org.gradle.initialization.DefaultGradleLauncher.run(
>> DefaultGradleLauncher.java:102)
>>         at org.gradle.launcher.exec.GradleBuildController.run(
>> GradleBuildController.java:71)
>>         at org.gradle.tooling.internal.provider.
>> ExecuteBuildActionRunner.run(ExecuteBuildActionRunner.java:28)
>>         at org.gradle.launcher.exec.ChainingBuildActionRunner.run(
>> ChainingBuildActionRunner.java:35)
>>         at org.gradle.launcher.exec.InProcessBuildActionExecuter.execute(
>> InProcessBuildActionExecuter.java:41)
>>         at org.gradle.launcher.exec.InProcessBuildActionExecuter.execute(
>> InProcessBuildActionExecuter.java:26)
>>         at org.gradle.tooling.internal.provider.
>> ContinuousBuildActionExecuter.execute(ContinuousBuildActionExecuter.
>> java:75)
>>         at org.gradle.tooling.internal.provider.
>> ContinuousBuildActionExecuter.execute(ContinuousBuildActionExecuter.
>> java:49)
>>         at org.gradle.tooling.internal.provider.
>> ServicesSetupBuildActionExecuter.execute(ServicesSetupBuildActionExecut
>> er.java:49)
>>         at org.gradle.tooling.internal.provider.
>> ServicesSetupBuildActionExecuter.execute(ServicesSetupBuildActionExecut
>> er.java:31)
>>         at org.gradle.launcher.daemon.server.exec.ExecuteBuild.
>> doBuild(ExecuteBuild.java:67)
>>         at org.gradle.launcher.daemon.server.exec.BuildCommandOnly.
>> execute(BuildCommandOnly.java:36)
>>         at org.gradle.launcher.daemon.server.api.DaemonCommandExecution.
>> proceed(DaemonCommandExecution.java:120)
>>         at org.gradle.launcher.daemon.server.exec.
>> WatchForDisconnection.execute(WatchForDisconnection.java:47)
>>         at org.gradle.launcher.daemon.server.api.DaemonCommandExecution.
>> proceed(DaemonCommandExecution.java:120)
>>         at org.gradle.launcher.daemon.server.exec.ResetDeprecationLogger.
>> execute(ResetDeprecationLogger.java:26)
>>         at org.gradle.launcher.daemon.server.api.DaemonCommandExecution.
>> proceed(DaemonCommandExecution.java:120)
>>         at org.gradle.launcher.daemon.server.exec.
>> RequestStopIfSingleUsedDaemon.execute(RequestStopIfSingleUsedDaemon.
>> java:34)
>>         at org.gradle.launcher.daemon.server.api.DaemonCommandExecution.
>> proceed(DaemonCommandExecution.java:120)
>>         at org.gradle.launcher.daemon.server.exec.
>> ForwardClientInput$2.call(ForwardClientInput.java:74)
>>         at org.gradle.launcher.daemon.server.exec.
>> ForwardClientInput$2.call(ForwardClientInput.java:72)
>>         at org.gradle.util.Swapper.swap(Swapper.java:38)
>>         at org.gradle.launcher.daemon.server.exec.
>> ForwardClientInput.execute(ForwardClientInput.java:72)
>>         at org.gradle.launcher.daemon.server.api.DaemonCommandExecution.
>> proceed(DaemonCommandExecution.java:120)
>>         at org.gradle.launcher.daemon.server.exec.LogAndCheckHealth.
>> execute(LogAndCheckHealth.java:50)
>>         at org.gradle.launcher.daemon.server.api.DaemonCommandExecution.
>> proceed(DaemonCommandExecution.java:120)
>>         at org.gradle.launcher.daemon.server.exec.LogToClient.
>> doBuild(LogToClient.java:60)
>>         at org.gradle.launcher.daemon.server.exec.BuildCommandOnly.
>> execute(BuildCommandOnly.java:36)
>>         at org.gradle.launcher.daemon.server.api.DaemonCommandExecution.
>> proceed(DaemonCommandExecution.java:120)
>>         at org.gradle.launcher.daemon.server.exec.
>> EstablishBuildEnvironment.doBuild(EstablishBuildEnvironment.java:72)
>>         at org.gradle.launcher.daemon.server.exec.BuildCommandOnly.
>> execute(BuildCommandOnly.java:36)
>>         at org.gradle.launcher.daemon.server.api.DaemonCommandExecution.
>> proceed(DaemonCommandExecution.java:120)
>>         at org.gradle.launcher.daemon.server.exec.
>> StartBuildOrRespondWithBusy$1.run(StartBuildOrRespondWithBusy.java:50)
>>         at org.gradle.launcher.daemon.server.DaemonStateCoordinator$
>> 1.run(DaemonStateCoordinator.java:297)
>>         at org.gradle.internal.concurrent.ExecutorPolicy$
>> CatchAndRecordFailures.onExecute(ExecutorPolicy.java:63)
>>         at org.gradle.internal.concurrent.StoppableExecutorImpl$1.run(
>> StoppableExecutorImpl.java:46)
>>         at java.util.concurrent.ThreadPoolExecutor.runWorker(
>> ThreadPoolExecutor.java:1142)
>>         at java.util.concurrent.ThreadPoolExecutor$Worker.run(
>> ThreadPoolExecutor.java:617)
>>         at java.lang.Thread.run(Thread.java:745)
>> Caused by: org.gradle.api.GradleException: Process 'command './gradlew''
>> finished with non-zero exit value 1
>>         STDOUT file://<https://builds.apache.
>> org/job/Polygene(JavaEdition)-develop-java8-checkDists/ws/
>> distributions/build/log/buildSourceDistribution/buildSourceDistribution-
>> stdout.log>
>>         STDERR file://<https://builds.apache.
>> org/job/Polygene(JavaEdition)-develop-java8-checkDists/ws/
>> distributions/build/log/buildSourceDistribution/buildSourceDistribution-
>> stderr.log>
>>         at org.apache.polygene.gradle.tasks.ExecLogged.doExecLogged(
>> ExecLogged.groovy:101)
>>         at org.apache.polygene.gradle.tasks.ExecLogged.exec(
>> ExecLogged.groovy:54)
>>         at sun.reflect.NativeMethodAccessorImpl.invoke0(Native Method)
>>         at sun.reflect.NativeMethodAccessorImpl.invoke(
>> NativeMethodAccessorImpl.java:62)
>>         at sun.reflect.DelegatingMethodAccessorImpl.invoke(
>> DelegatingMethodAccessorImpl.java:43)
>>         at java.lang.reflect.Method.invoke(Method.java:498)
>>         at org.gradle.internal.reflect.JavaMethod.invoke(JavaMethod.
>> java:73)
>>         at org.gradle.api.internal.project.taskfactory.
>> DefaultTaskClassInfoStore$StandardTaskAction.doExecute(
>> DefaultTaskClassInfoStore.java:141)
>>         at org.gradle.api.internal.project.taskfactory.
>> DefaultTaskClassInfoStore$StandardTaskAction.execute(
>> DefaultTaskClassInfoStore.java:134)
>>         at org.gradle.api.internal.project.taskfactory.
>> DefaultTaskClassInfoStore$StandardTaskAction.execute(
>> DefaultTaskClassInfoStore.java:123)
>>         at org.gradle.api.internal.AbstractTask$TaskActionWrapper.execute(
>> AbstractTask.java:632)
>>         at org.gradle.api.internal.AbstractTask$TaskActionWrapper.execute(
>> AbstractTask.java:615)
>>         at org.gradle.api.internal.tasks.execution.
>> ExecuteActionsTaskExecuter.executeAction(ExecuteActionsTaskExecuter.
>> java:95)
>>         at org.gradle.api.internal.tasks.execution.
>> ExecuteActionsTaskExecuter.executeActions(ExecuteActionsTaskExecuter.
>> java:76)
>>         ... 73 more
>> Caused by: org.gradle.process.internal.ExecException: Process 'command
>> './gradlew'' finished with non-zero exit value 1
>>         at org.gradle.process.internal.DefaultExecHandle$ExecResultImpl.
>> assertNormalExitValue(DefaultExecHandle.java:369)
>>         at org.gradle.process.internal.DefaultExecAction.execute(
>> DefaultExecAction.java:31)
>>         at org.gradle.api.tasks.AbstractExecTask.exec(
>> AbstractExecTask.java:54)
>>         at org.apache.polygene.gradle.tasks.ExecLogged.super$5$exec(
>> ExecLogged.groovy)
>>         at org.apache.polygene.gradle.tasks.ExecLogged$_exec_
>> closure1.doCall(ExecLogged.groovy:57)
>>         at sun.reflect.NativeMethodAccessorImpl.invoke0(Native Method)
>>         at sun.reflect.NativeMethodAccessorImpl.invoke(
>> NativeMethodAccessorImpl.java:62)
>>         at sun.reflect.DelegatingMethodAccessorImpl.invoke(
>> DelegatingMethodAccessorImpl.java:43)
>>         at java.lang.reflect.Method.invoke(Method.java:498)
>>         at org.codehaus.groovy.reflection.CachedMethod.
>> invoke(CachedMethod.java:93)
>>         at groovy.lang.MetaMethod.doMethodInvoke(MetaMethod.java:325)
>>         at org.codehaus.groovy.runtime.metaclass.ClosureMetaClass.
>> invokeMethod(ClosureMetaClass.java:294)
>>         at groovy.lang.MetaClassImpl.invokeMethod(MetaClassImpl.java:1024)
>>         at groovy.lang.Closure.call(Closure.java:414)
>>         at org.codehaus.groovy.runtime.ConvertedClosure.invokeCustom(
>> ConvertedClosure.java:54)
>>         at org.codehaus.groovy.runtime.ConversionHandler.invoke(
>> ConversionHandler.java:124)
>>         at com.sun.proxy.$Proxy69.accept(Unknown Source)
>>         at org.apache.polygene.gradle.tasks.ExecLogged.doExecLogged(
>> ExecLogged.groovy:97)
>>         ... 86 more
>>
>> ============================================================
>> ==================
>>
>> BUILD FAILED
>>
>> Total time: 9 mins 9.109 secs
>> Build step 'Invoke Gradle script' changed build result to FAILURE
>> Build step 'Invoke Gradle script' marked build as failure
>> Archiving artifacts
>> Recording test results
>> Publishing Javadoc
>>
>
>
>

Mime
  • Unnamed multipart/alternative (inline, None, 0 bytes)
View raw message