polygene-dev mailing list archives

Site index · List index
Message view « Date » · « Thread »
Top « Date » · « Thread »
From Apache Jenkins Server <jenk...@builds.apache.org>
Subject Build failed in Jenkins: Polygene(JavaEdition)-develop-java8-checkDists #117
Date Sat, 18 Feb 2017 05:58:13 GMT
See <https://builds.apache.org/job/Polygene(JavaEdition)-develop-java8-checkDists/117/changes>

Changes:

[niclas] Adding missing Javadocs.

[niclas] Deprecating the Visitor pattern. It is not in line with the Stream API

[niclas] Wrong labeling in yeoman generator

[niclas] POLYGENE-225 - Cassandra entitystore implemented.

[niclas] Removed the previous shell system, as the Yeoman one seems more

[niclas] Yeoman generator improvements

[niclas] Yeoman generator doc inclusion

[niclas] POLYGENE-226 - Start on the Initial Value Provider stuff. Not trivial,

[niclas] POLYGENE-224 - I think this is fixed. Please note the long comment about

[niclas] POLYGENE-224 - Needed to do the same fix in

[niclas] Cassandra client depends on a tri-licensed GitBuh project

------------------------------------------
[...truncated 2592 lines...]
:libraries:jmx:check
:libraries:jmx:build
:libraries:lang-groovy:assemble
:libraries:lang-groovy:honkerCheck
:libraries:lang-groovy:check
:libraries:lang-groovy:build
:libraries:lang-javascript:assemble
:libraries:lang-javascript:honkerCheck
:libraries:lang-javascript:check
:libraries:lang-javascript:build
:libraries:locking:assemble
:libraries:locking:honkerCheck
:libraries:locking:check
:libraries:locking:build
:libraries:logging:assemble
:libraries:logging:honkerCheck
:libraries:logging:check
:libraries:logging:build
:libraries:metrics:assemble
:libraries:metrics:honkerCheck
:libraries:metrics:check
:libraries:metrics:build
:libraries:osgi:assemble
:libraries:osgi:honkerCheck
:libraries:osgi:check
:libraries:osgi:build
:libraries:rdf:assemble
:libraries:rdf:honkerCheck
:libraries:rdf:check
:libraries:rdf:build
:libraries:rest:assemble
:libraries:rest:honkerCheck
:libraries:rest:check
:libraries:rest:build
:libraries:rest-client:assemble
:libraries:rest-client:honkerCheck
:libraries:rest-client:check
:libraries:rest-client:build
:libraries:rest-common:assemble
:libraries:rest-common:honkerCheck
:libraries:rest-common:check
:libraries:rest-common:build
:libraries:rest-server:assemble
:libraries:rest-server:honkerCheck
:libraries:rest-server:check
:libraries:rest-server:build
:libraries:restlet:assemble
:libraries:restlet:honkerCheck
:libraries:restlet:check
:libraries:restlet:build
:libraries:scripting:assemble
:libraries:scripting:honkerCheck
:libraries:scripting:check
:libraries:scripting:build
:libraries:servlet:assemble
:libraries:servlet:honkerCheck
:libraries:servlet:check
:libraries:servlet:build
:libraries:shiro-core:assemble
:libraries:shiro-core:honkerCheck
:libraries:shiro-core:check
:libraries:shiro-core:build
:libraries:shiro-web:assemble
:libraries:shiro-web:honkerCheck
:libraries:shiro-web:check
:libraries:shiro-web:build
:libraries:spring:assemble
:libraries:spring:honkerCheck
:libraries:spring:check
:libraries:spring:build
:libraries:sql:assemble
:libraries:sql:honkerCheck
:libraries:sql:check
:libraries:sql:build
:libraries:sql-bonecp:assemble
:libraries:sql-bonecp:honkerCheck
:libraries:sql-bonecp:check
:libraries:sql-bonecp:build
:libraries:sql-dbcp:assemble
:libraries:sql-dbcp:honkerCheck
:libraries:sql-dbcp:check
:libraries:sql-dbcp:build
:libraries:sql-liquibase:assemble
:libraries:sql-liquibase:honkerCheck
:libraries:sql-liquibase:check
:libraries:sql-liquibase:build
:libraries:uid:assemble
:libraries:uid:honkerCheck
:libraries:uid:check
:libraries:uid:build
:libraries:uowfile:assemble
:libraries:uowfile:honkerCheck
:libraries:uowfile:check
:libraries:uowfile:build
:tools:envisage:assemble
:tools:envisage:honkerCheck
:tools:envisage:check
:tools:envisage:build
:tools:model-detail:assemble
:tools:model-detail:honkerCheck
:tools:model-detail:check
:tools:model-detail:build
:distributions:tarBinaryDistribution
:distributions:srcDistFilteredFiles
:distributions:tarSourceDistribution
:distributions:zipBinaryDistribution
:distributions:zipSourceDistribution
:distributions:assemble
:release:assemble UP-TO-DATE
:internals:testsupport-internal:assemble
:samples:dci:jar
:samples:dci:assemble
:samples:forum:jar
:samples:forum:assemble
:samples:rental:war
:samples:rental:assemble
:samples:sql-support:jar
:samples:sql-support:assemble
:samples:swing:jar
:samples:swing:assemble
:tests:performance:jar
:tests:performance:assemble
:tests:regression:jar
:tests:regression:assemble
:tutorials:cargo:jar
:tutorials:cargo:assemble
:tutorials:composites:jar
:tutorials:composites:assemble
:tutorials:hello:jar
:tutorials:hello:assemble
:tutorials:introduction:jar
:tutorials:introduction:assemble
:tutorials:services:jar
:tutorials:services:assemble
:tutorials:introduction:tenminutes:assemble
:tutorials:introduction:thirtyminutes:jar
:tutorials:introduction:thirtyminutes:assemble
:tutorials:introduction:twominutes:jar
:tutorials:introduction:twominutes:assemble
:distributions:stageBinaryDistribution
:distributions:ratBinaryDistribution
:distributions:checkBinaryDistribution
:distributions:stageSourceDistribution
:distributions:ratSourceDistribution FAILED
:distributions:buildSourceDistribution

FAILURE: Build failed with an exception.

* What went wrong:
Execution failed for task ':distributions:ratSourceDistribution'.
> Found 3 files with unapproved/unknown licenses. See <https://builds.apache.org/job/Polygene(JavaEdition)-develop-java8-checkDists/ws/distributions/build/reports/rat/index.html>

* Try:
Run with --info or --debug option to get more log output.

* Exception is:
org.gradle.api.tasks.TaskExecutionException: Execution failed for task ':distributions:ratSourceDistribution'.
	at org.gradle.api.internal.tasks.execution.ExecuteActionsTaskExecuter.executeActions(ExecuteActionsTaskExecuter.java:84)
	at org.gradle.api.internal.tasks.execution.ExecuteActionsTaskExecuter.execute(ExecuteActionsTaskExecuter.java:55)
	at org.gradle.api.internal.tasks.execution.SkipUpToDateTaskExecuter.execute(SkipUpToDateTaskExecuter.java:62)
	at org.gradle.api.internal.tasks.execution.ValidatingTaskExecuter.execute(ValidatingTaskExecuter.java:58)
	at org.gradle.api.internal.tasks.execution.SkipEmptySourceFilesTaskExecuter.execute(SkipEmptySourceFilesTaskExecuter.java:88)
	at org.gradle.api.internal.tasks.execution.ResolveTaskArtifactStateTaskExecuter.execute(ResolveTaskArtifactStateTaskExecuter.java:46)
	at org.gradle.api.internal.tasks.execution.SkipTaskWithNoActionsExecuter.execute(SkipTaskWithNoActionsExecuter.java:51)
	at org.gradle.api.internal.tasks.execution.SkipOnlyIfTaskExecuter.execute(SkipOnlyIfTaskExecuter.java:54)
	at org.gradle.api.internal.tasks.execution.ExecuteAtMostOnceTaskExecuter.execute(ExecuteAtMostOnceTaskExecuter.java:43)
	at org.gradle.api.internal.tasks.execution.CatchExceptionTaskExecuter.execute(CatchExceptionTaskExecuter.java:34)
	at org.gradle.execution.taskgraph.DefaultTaskGraphExecuter$EventFiringTaskWorker$1.execute(DefaultTaskGraphExecuter.java:236)
	at org.gradle.execution.taskgraph.DefaultTaskGraphExecuter$EventFiringTaskWorker$1.execute(DefaultTaskGraphExecuter.java:228)
	at org.gradle.internal.Transformers$4.transform(Transformers.java:169)
	at org.gradle.internal.progress.DefaultBuildOperationExecutor.run(DefaultBuildOperationExecutor.java:106)
	at org.gradle.internal.progress.DefaultBuildOperationExecutor.run(DefaultBuildOperationExecutor.java:61)
	at org.gradle.execution.taskgraph.DefaultTaskGraphExecuter$EventFiringTaskWorker.execute(DefaultTaskGraphExecuter.java:228)
	at org.gradle.execution.taskgraph.DefaultTaskGraphExecuter$EventFiringTaskWorker.execute(DefaultTaskGraphExecuter.java:215)
	at org.gradle.execution.taskgraph.AbstractTaskPlanExecutor$TaskExecutorWorker.processTask(AbstractTaskPlanExecutor.java:77)
	at org.gradle.execution.taskgraph.AbstractTaskPlanExecutor$TaskExecutorWorker.run(AbstractTaskPlanExecutor.java:58)
	at org.gradle.execution.taskgraph.DefaultTaskPlanExecutor.process(DefaultTaskPlanExecutor.java:32)
	at org.gradle.execution.taskgraph.DefaultTaskGraphExecuter.execute(DefaultTaskGraphExecuter.java:113)
	at org.gradle.execution.SelectedTaskExecutionAction.execute(SelectedTaskExecutionAction.java:37)
	at org.gradle.execution.DefaultBuildExecuter.execute(DefaultBuildExecuter.java:37)
	at org.gradle.execution.DefaultBuildExecuter.access$000(DefaultBuildExecuter.java:23)
	at org.gradle.execution.DefaultBuildExecuter$1.proceed(DefaultBuildExecuter.java:43)
	at org.gradle.execution.DryRunBuildExecutionAction.execute(DryRunBuildExecutionAction.java:32)
	at org.gradle.execution.DefaultBuildExecuter.execute(DefaultBuildExecuter.java:37)
	at org.gradle.execution.DefaultBuildExecuter.execute(DefaultBuildExecuter.java:30)
	at org.gradle.initialization.DefaultGradleLauncher$3.execute(DefaultGradleLauncher.java:196)
	at org.gradle.initialization.DefaultGradleLauncher$3.execute(DefaultGradleLauncher.java:193)
	at org.gradle.internal.Transformers$4.transform(Transformers.java:169)
	at org.gradle.internal.progress.DefaultBuildOperationExecutor.run(DefaultBuildOperationExecutor.java:106)
	at org.gradle.internal.progress.DefaultBuildOperationExecutor.run(DefaultBuildOperationExecutor.java:56)
	at org.gradle.initialization.DefaultGradleLauncher.doBuildStages(DefaultGradleLauncher.java:193)
	at org.gradle.initialization.DefaultGradleLauncher.doBuild(DefaultGradleLauncher.java:119)
	at org.gradle.initialization.DefaultGradleLauncher.run(DefaultGradleLauncher.java:102)
	at org.gradle.launcher.exec.GradleBuildController.run(GradleBuildController.java:71)
	at org.gradle.tooling.internal.provider.ExecuteBuildActionRunner.run(ExecuteBuildActionRunner.java:28)
	at org.gradle.launcher.exec.ChainingBuildActionRunner.run(ChainingBuildActionRunner.java:35)
	at org.gradle.launcher.exec.InProcessBuildActionExecuter.execute(InProcessBuildActionExecuter.java:41)
	at org.gradle.launcher.exec.InProcessBuildActionExecuter.execute(InProcessBuildActionExecuter.java:26)
	at org.gradle.tooling.internal.provider.ContinuousBuildActionExecuter.execute(ContinuousBuildActionExecuter.java:75)
	at org.gradle.tooling.internal.provider.ContinuousBuildActionExecuter.execute(ContinuousBuildActionExecuter.java:49)
	at org.gradle.tooling.internal.provider.ServicesSetupBuildActionExecuter.execute(ServicesSetupBuildActionExecuter.java:44)
	at org.gradle.tooling.internal.provider.ServicesSetupBuildActionExecuter.execute(ServicesSetupBuildActionExecuter.java:29)
	at org.gradle.launcher.daemon.server.exec.ExecuteBuild.doBuild(ExecuteBuild.java:67)
	at org.gradle.launcher.daemon.server.exec.BuildCommandOnly.execute(BuildCommandOnly.java:36)
	at org.gradle.launcher.daemon.server.api.DaemonCommandExecution.proceed(DaemonCommandExecution.java:120)
	at org.gradle.launcher.daemon.server.exec.WatchForDisconnection.execute(WatchForDisconnection.java:47)
	at org.gradle.launcher.daemon.server.api.DaemonCommandExecution.proceed(DaemonCommandExecution.java:120)
	at org.gradle.launcher.daemon.server.exec.ResetDeprecationLogger.execute(ResetDeprecationLogger.java:26)
	at org.gradle.launcher.daemon.server.api.DaemonCommandExecution.proceed(DaemonCommandExecution.java:120)
	at org.gradle.launcher.daemon.server.exec.RequestStopIfSingleUsedDaemon.execute(RequestStopIfSingleUsedDaemon.java:34)
	at org.gradle.launcher.daemon.server.api.DaemonCommandExecution.proceed(DaemonCommandExecution.java:120)
	at org.gradle.launcher.daemon.server.exec.ForwardClientInput$2.call(ForwardClientInput.java:74)
	at org.gradle.launcher.daemon.server.exec.ForwardClientInput$2.call(ForwardClientInput.java:72)
	at org.gradle.util.Swapper.swap(Swapper.java:38)
	at org.gradle.launcher.daemon.server.exec.ForwardClientInput.execute(ForwardClientInput.java:72)
	at org.gradle.launcher.daemon.server.api.DaemonCommandExecution.proceed(DaemonCommandExecution.java:120)
	at org.gradle.launcher.daemon.server.exec.LogAndCheckHealth.execute(LogAndCheckHealth.java:50)
	at org.gradle.launcher.daemon.server.api.DaemonCommandExecution.proceed(DaemonCommandExecution.java:120)
	at org.gradle.launcher.daemon.server.exec.LogToClient.doBuild(LogToClient.java:60)
	at org.gradle.launcher.daemon.server.exec.BuildCommandOnly.execute(BuildCommandOnly.java:36)
	at org.gradle.launcher.daemon.server.api.DaemonCommandExecution.proceed(DaemonCommandExecution.java:120)
	at org.gradle.launcher.daemon.server.exec.EstablishBuildEnvironment.doBuild(EstablishBuildEnvironment.java:72)
	at org.gradle.launcher.daemon.server.exec.BuildCommandOnly.execute(BuildCommandOnly.java:36)
	at org.gradle.launcher.daemon.server.api.DaemonCommandExecution.proceed(DaemonCommandExecution.java:120)
	at org.gradle.launcher.daemon.server.exec.StartBuildOrRespondWithBusy$1.run(StartBuildOrRespondWithBusy.java:50)
	at org.gradle.launcher.daemon.server.DaemonStateCoordinator$1.run(DaemonStateCoordinator.java:297)
	at org.gradle.internal.concurrent.ExecutorPolicy$CatchAndRecordFailures.onExecute(ExecutorPolicy.java:54)
	at org.gradle.internal.concurrent.StoppableExecutorImpl$1.run(StoppableExecutorImpl.java:40)
Caused by: org.gradle.api.GradleException: Found 3 files with unapproved/unknown licenses.
See <https://builds.apache.org/job/Polygene(JavaEdition)-develop-java8-checkDists/ws/distributions/build/reports/rat/index.html>
	at org.apache.rat.gradle.RatTask.rat(RatTask.groovy:95)
	at org.gradle.internal.reflect.JavaMethod.invoke(JavaMethod.java:73)
	at org.gradle.api.internal.project.taskfactory.DefaultTaskClassInfoStore$StandardTaskAction.doExecute(DefaultTaskClassInfoStore.java:141)
	at org.gradle.api.internal.project.taskfactory.DefaultTaskClassInfoStore$StandardTaskAction.execute(DefaultTaskClassInfoStore.java:134)
	at org.gradle.api.internal.project.taskfactory.DefaultTaskClassInfoStore$StandardTaskAction.execute(DefaultTaskClassInfoStore.java:123)
	at org.gradle.api.internal.AbstractTask$TaskActionWrapper.execute(AbstractTask.java:632)
	at org.gradle.api.internal.AbstractTask$TaskActionWrapper.execute(AbstractTask.java:615)
	at org.gradle.api.internal.tasks.execution.ExecuteActionsTaskExecuter.executeAction(ExecuteActionsTaskExecuter.java:95)
	at org.gradle.api.internal.tasks.execution.ExecuteActionsTaskExecuter.executeActions(ExecuteActionsTaskExecuter.java:76)
	... 70 more


BUILD FAILED

Total time: 23 mins 8.357 secs
Build step 'Invoke Gradle script' changed build result to FAILURE
Build step 'Invoke Gradle script' marked build as failure
Archiving artifacts
Recording test results
Publishing Javadoc

Mime
View raw message