polygene-dev mailing list archives

Site index · List index
Message view « Date » · « Thread »
Top « Date » · « Thread »
From Apache Jenkins Server <jenk...@builds.apache.org>
Subject Build failed in Jenkins: Polygene(JavaEdition)-develop-java9-check #48
Date Mon, 09 Jan 2017 18:27:57 GMT
See <https://builds.apache.org/job/Polygene(JavaEdition)-develop-java9-check/48/>

------------------------------------------
Started by an SCM change
[EnvInject] - Loading node environment variables.
Building remotely on H12 (ubuntu) in workspace <https://builds.apache.org/job/Polygene(JavaEdition)-develop-java9-check/ws/>
 > git rev-parse --is-inside-work-tree # timeout=10
Fetching changes from the remote Git repository
 > git config remote.origin.url https://git-wip-us.apache.org/repos/asf/polygene-java.git
# timeout=10
Fetching upstream changes from https://git-wip-us.apache.org/repos/asf/polygene-java.git
 > git --version # timeout=10
 > git -c core.askpass=true fetch --tags --progress https://git-wip-us.apache.org/repos/asf/polygene-java.git
+refs/heads/*:refs/remotes/origin/*
 > git rev-parse refs/remotes/origin/develop^{commit} # timeout=10
 > git rev-parse refs/remotes/origin/origin/develop^{commit} # timeout=10
Checking out Revision 0bfa4627b5519f3470b3ace23f34a888288b6ade (refs/remotes/origin/develop)
 > git config core.sparsecheckout # timeout=10
 > git checkout -f 0bfa4627b5519f3470b3ace23f34a888288b6ade
First time build. Skipping changelog.
[Polygene(JavaEdition)-develop-java9-check] $ /bin/bash -xe /tmp/hudson508450602599854264.sh
+ uname -a
Linux asf912.gq1.ygridcore.net 4.4.0-43-generic #63-Ubuntu SMP Wed Oct 12 13:48:03 UTC 2016
x86_64 x86_64 x86_64 GNU/Linux
+ lscpu
Architecture:          x86_64
CPU op-mode(s):        32-bit, 64-bit
Byte Order:            Little Endian
CPU(s):                24
On-line CPU(s) list:   0-23
Thread(s) per core:    2
Core(s) per socket:    6
Socket(s):             2
NUMA node(s):          2
Vendor ID:             GenuineIntel
CPU family:            6
Model:                 45
Model name:            Intel(R) Xeon(R) CPU E5-2430 0 @ 2.20GHz
Stepping:              7
CPU MHz:               1242.828
CPU max MHz:           2700.0000
CPU min MHz:           1200.0000
BogoMIPS:              4401.50
Virtualization:        VT-x
L1d cache:             32K
L1i cache:             32K
L2 cache:              256K
L3 cache:              15360K
NUMA node0 CPU(s):     0,2,4,6,8,10,12,14,16,18,20,22
NUMA node1 CPU(s):     1,3,5,7,9,11,13,15,17,19,21,23
Flags:                 fpu vme de pse tsc msr pae mce cx8 apic sep mtrr pge mca cmov pat pse36
clflush dts acpi mmx fxsr sse sse2 ss ht tm pbe syscall nx pdpe1gb rdtscp lm constant_tsc
arch_perfmon pebs bts rep_good nopl xtopology nonstop_tsc aperfmperf eagerfpu pni pclmulqdq
dtes64 monitor ds_cpl vmx smx est tm2 ssse3 cx16 xtpr pdcm pcid dca sse4_1 sse4_2 x2apic popcnt
tsc_deadline_timer aes xsave avx lahf_lm epb tpr_shadow vnmi flexpriority ept vpid xsaveopt
dtherm ida arat pln pts
+ java -version
java version "9-ea"
Java(TM) SE Runtime Environment (build 9-ea+139)
Java HotSpot(TM) 64-Bit Server VM (build 9-ea+139, mixed mode)
+ mvn --version
/tmp/hudson508450602599854264.sh: line 5: mvn: command not found
+ free -tm
              total        used        free      shared  buff/cache   available
Mem:          96638        6296       17657         944       72685       88624
Swap:         98256         254       98002
Total:       194895        6551      115659
[Gradle] - Launching build.
[Polygene(JavaEdition)-develop-java9-check] $ <https://builds.apache.org/job/Polygene(JavaEdition)-develop-java9-check/ws/gradlew>
--no-daemon --continue -Dversion=3.0-SNAPSHOT clean check
To honour the JVM settings for this build a new JVM will be forked. Please consider using
the daemon: https://docs.gradle.org/3.2.1/userguide/gradle_daemon.html.
Daemon will be stopped at the end of the build stopping after processing
Download https://plugins.gradle.org/m2/gradle/plugin/com/palantir/gradle/docker/gradle-docker/0.9.2/gradle-docker-0.9.2.pom
Download https://plugins.gradle.org/m2/gradle/plugin/com/palantir/gradle/docker/gradle-docker/0.9.2/gradle-docker-0.9.2.jar
:buildSrc:compileJava UP-TO-DATE
:buildSrc:compileGroovy
:buildSrc:processResources
:buildSrc:classes
:buildSrc:jar
:buildSrc:assemble
:buildSrc:compileTestJava UP-TO-DATE
:buildSrc:compileTestGroovy
:buildSrc:processTestResources UP-TO-DATE
:buildSrc:testClasses
:buildSrc:test
:buildSrc:check
:buildSrc:build

FAILURE: Build failed with an exception.

* Where:
Build file '<https://builds.apache.org/job/Polygene(JavaEdition)-develop-java9-check/ws/internals/docker-memcached/build.gradle'>
line: 19

* What went wrong:
A problem occurred evaluating project ':internals:docker-memcached'.
> Failed to apply plugin [class 'com.palantir.gradle.docker.PalantirDockerPlugin']
   > Could not create an instance of type com.palantir.gradle.docker.DockerExtension_Decorated.

* Try:
Run with --stacktrace option to get the stack trace. Run with --info or --debug option to
get more log output.

BUILD FAILED

Total time: 23.551 secs
Build step 'Invoke Gradle script' changed build result to FAILURE
Build step 'Invoke Gradle script' marked build as failure
Recording test results

Mime
View raw message