polygene-dev mailing list archives

Site index · List index
Message view « Date » · « Thread »
Top « Date » · « Thread »
From Apache Jenkins Server <jenk...@builds.apache.org>
Subject Build failed in Jenkins: Polygene(JavaEdition)-develop-java8-checkDists #109
Date Sat, 17 Dec 2016 10:23:39 GMT
See <https://builds.apache.org/job/Polygene(JavaEdition)-develop-java8-checkDists/109/changes>

Changes:

[paulmerlin] build: unit test ModuleReleaseSpec

[paulmerlin] build: fix xslt task inputs declaration

------------------------------------------
[...truncated 6202 lines...]
:org.apache.zest:org.apache.zest.tools:org.apache.zest.tool.model-detail:javadoc
:org.apache.zest:org.apache.zest.tools:org.apache.zest.tool.envisage:javadoc
:org.apache.zest:org.apache.zest.tools:org.apache.zest.tool.envisage:javadocJar
:org.apache.zest:org.apache.zest.tools:org.apache.zest.tool.envisage:sourceJar
:org.apache.zest:org.apache.zest.tools:org.apache.zest.tool.envisage:testSourceJar
:org.apache.zest:org.apache.zest.tools:org.apache.zest.tool.envisage:signArchives SKIPPED
:org.apache.zest:org.apache.zest.tools:org.apache.zest.tool.envisage:assemble
:org.apache.zest:org.apache.zest.tools:org.apache.zest.tool.envisage:dependencyReport
:org.apache.zest:org.apache.zest.tools:org.apache.zest.tool.model-detail:javadocJar
:org.apache.zest:org.apache.zest.tools:org.apache.zest.tool.model-detail:sourceJar
:org.apache.zest:org.apache.zest.tools:org.apache.zest.tool.model-detail:testSourceJar
:org.apache.zest:org.apache.zest.tools:org.apache.zest.tool.model-detail:signArchives SKIPPED
:org.apache.zest:org.apache.zest.tools:org.apache.zest.tool.model-detail:assemble
:org.apache.zest:org.apache.zest.tools:org.apache.zest.tool.model-detail:dependencyReport
:org.apache.zest:org.apache.zest.tools:org.apache.zest.tool.shell:processVersionResources
UP-TO-DATE
:org.apache.zest:org.apache.zest.tools:org.apache.zest.tool.shell:versionClasses
:org.apache.zest:org.apache.zest.tools:org.apache.zest.tool.shell:jar
:org.apache.zest:org.apache.zest.tools:org.apache.zest.tool.shell:startScripts
:org.apache.zest:org.apache.zest.tools:org.apache.zest.tool.shell:distTar
:org.apache.zest:org.apache.zest.tools:org.apache.zest.tool.shell:distZip
:org.apache.zest:org.apache.zest.tools:org.apache.zest.tool.shell:javadoc
:org.apache.zest:org.apache.zest.tools:org.apache.zest.tool.shell:javadocJar
:org.apache.zest:org.apache.zest.tools:org.apache.zest.tool.shell:sourceJar
:org.apache.zest:org.apache.zest.tools:org.apache.zest.tool.shell:testSourceJar
:org.apache.zest:org.apache.zest.tools:org.apache.zest.tool.shell:signArchives SKIPPED
:org.apache.zest:org.apache.zest.tools:org.apache.zest.tool.shell:assemble
:org.apache.zest:org.apache.zest.tools:org.apache.zest.tool.shell:dependencyReport
:org.apache.zest:org.apache.zest.tutorials:org.apache.zest.tutorial.cargo:processVersionResources
UP-TO-DATE
:org.apache.zest:org.apache.zest.tutorials:org.apache.zest.tutorial.cargo:versionClasses
:org.apache.zest:org.apache.zest.tutorials:org.apache.zest.tutorial.cargo:jar
:org.apache.zest:org.apache.zest.tutorials:org.apache.zest.tutorial.cargo:javadoc
:org.apache.zest:org.apache.zest.tutorials:org.apache.zest.tutorial.cargo:javadocJar
:org.apache.zest:org.apache.zest.tutorials:org.apache.zest.tutorial.cargo:sourceJar
:org.apache.zest:org.apache.zest.tutorials:org.apache.zest.tutorial.cargo:testSourceJar
:org.apache.zest:org.apache.zest.tutorials:org.apache.zest.tutorial.cargo:signArchives SKIPPED
:org.apache.zest:org.apache.zest.tutorials:org.apache.zest.tutorial.cargo:assemble
:org.apache.zest:org.apache.zest.tutorials:org.apache.zest.tutorial.cargo:dependencyReport
:org.apache.zest:org.apache.zest.tutorials:org.apache.zest.tutorial.composites:processVersionResources
UP-TO-DATE
:org.apache.zest:org.apache.zest.tutorials:org.apache.zest.tutorial.composites:versionClasses
:org.apache.zest:org.apache.zest.tutorials:org.apache.zest.tutorial.composites:jar
:org.apache.zest:org.apache.zest.tutorials:org.apache.zest.tutorial.composites:javadoc
:org.apache.zest:org.apache.zest.tutorials:org.apache.zest.tutorial.composites:javadocJar
:org.apache.zest:org.apache.zest.tutorials:org.apache.zest.tutorial.composites:sourceJar
:org.apache.zest:org.apache.zest.tutorials:org.apache.zest.tutorial.composites:testSourceJar
:org.apache.zest:org.apache.zest.tutorials:org.apache.zest.tutorial.composites:signArchives
SKIPPED
:org.apache.zest:org.apache.zest.tutorials:org.apache.zest.tutorial.composites:assemble
:org.apache.zest:org.apache.zest.tutorials:org.apache.zest.tutorial.composites:dependencyReport
:org.apache.zest:org.apache.zest.tutorials:org.apache.zest.tutorial.hello:processVersionResources
UP-TO-DATE
:org.apache.zest:org.apache.zest.tutorials:org.apache.zest.tutorial.hello:versionClasses
:org.apache.zest:org.apache.zest.tutorials:org.apache.zest.tutorial.hello:jar
:org.apache.zest:org.apache.zest.tutorials:org.apache.zest.tutorial.hello:javadoc
:org.apache.zest:org.apache.zest.tutorials:org.apache.zest.tutorial.hello:javadocJar
:org.apache.zest:org.apache.zest.tutorials:org.apache.zest.tutorial.hello:sourceJar
:org.apache.zest:org.apache.zest.tutorials:org.apache.zest.tutorial.hello:testSourceJar
:org.apache.zest:org.apache.zest.tutorials:org.apache.zest.tutorial.hello:signArchives SKIPPED
:org.apache.zest:org.apache.zest.tutorials:org.apache.zest.tutorial.hello:assemble
:org.apache.zest:org.apache.zest.tutorials:org.apache.zest.tutorial.hello:dependencyReport
:org.apache.zest:org.apache.zest.tutorials:org.apache.zest.tutorial.introduction:processVersionResources
UP-TO-DATE
:org.apache.zest:org.apache.zest.tutorials:org.apache.zest.tutorial.introduction:versionClasses
:org.apache.zest:org.apache.zest.tutorials:org.apache.zest.tutorial.introduction:jar
:org.apache.zest:org.apache.zest.tutorials:org.apache.zest.tutorial.introduction:javadoc
:org.apache.zest:org.apache.zest.tutorials:org.apache.zest.tutorial.introduction:javadocJar
:org.apache.zest:org.apache.zest.tutorials:org.apache.zest.tutorial.introduction:sourceJar
:org.apache.zest:org.apache.zest.tutorials:org.apache.zest.tutorial.introduction:testSourceJar
:org.apache.zest:org.apache.zest.tutorials:org.apache.zest.tutorial.introduction:signArchives
SKIPPED
:org.apache.zest:org.apache.zest.tutorials:org.apache.zest.tutorial.introduction:assemble
:org.apache.zest:org.apache.zest.tutorials:org.apache.zest.tutorial.introduction:dependencyReport
:org.apache.zest:org.apache.zest.tutorials:org.apache.zest.tutorial.services:processVersionResources
UP-TO-DATE
:org.apache.zest:org.apache.zest.tutorials:org.apache.zest.tutorial.services:versionClasses
:org.apache.zest:org.apache.zest.tutorials:org.apache.zest.tutorial.services:jar
:org.apache.zest:org.apache.zest.tutorials:org.apache.zest.tutorial.services:javadoc
:org.apache.zest:org.apache.zest.tutorials:org.apache.zest.tutorial.services:javadocJar
:org.apache.zest:org.apache.zest.tutorials:org.apache.zest.tutorial.services:sourceJar
:org.apache.zest:org.apache.zest.tutorials:org.apache.zest.tutorial.services:testSourceJar
:org.apache.zest:org.apache.zest.tutorials:org.apache.zest.tutorial.services:signArchives
SKIPPED
:org.apache.zest:org.apache.zest.tutorials:org.apache.zest.tutorial.services:assemble
:org.apache.zest:org.apache.zest.tutorials:org.apache.zest.tutorial.services:dependencyReport
:org.apache.zest:org.apache.zest.tutorials:org.apache.zest.tutorial.introduction:org.apache.zest.tutorial.introduction.tenminutes:javadoc
:org.apache.zest:org.apache.zest.tutorials:org.apache.zest.tutorial.introduction:org.apache.zest.tutorial.introduction.tenminutes:javadocJar
:org.apache.zest:org.apache.zest.tutorials:org.apache.zest.tutorial.introduction:org.apache.zest.tutorial.introduction.tenminutes:sourceJar
:org.apache.zest:org.apache.zest.tutorials:org.apache.zest.tutorial.introduction:org.apache.zest.tutorial.introduction.tenminutes:testSourceJar
:org.apache.zest:org.apache.zest.tutorials:org.apache.zest.tutorial.introduction:org.apache.zest.tutorial.introduction.tenminutes:signArchives
SKIPPED
:org.apache.zest:org.apache.zest.tutorials:org.apache.zest.tutorial.introduction:org.apache.zest.tutorial.introduction.tenminutes:assemble
:org.apache.zest:org.apache.zest.tutorials:org.apache.zest.tutorial.introduction:org.apache.zest.tutorial.introduction.tenminutes:dependencyReport
:org.apache.zest:org.apache.zest.tutorials:org.apache.zest.tutorial.introduction:org.apache.zest.tutorial.introduction.thirtyminutes:processVersionResources
UP-TO-DATE
:org.apache.zest:org.apache.zest.tutorials:org.apache.zest.tutorial.introduction:org.apache.zest.tutorial.introduction.thirtyminutes:versionClasses
:org.apache.zest:org.apache.zest.tutorials:org.apache.zest.tutorial.introduction:org.apache.zest.tutorial.introduction.thirtyminutes:jar
:org.apache.zest:org.apache.zest.tutorials:org.apache.zest.tutorial.introduction:org.apache.zest.tutorial.introduction.thirtyminutes:javadoc
:org.apache.zest:org.apache.zest.tutorials:org.apache.zest.tutorial.introduction:org.apache.zest.tutorial.introduction.thirtyminutes:javadocJar
:org.apache.zest:org.apache.zest.tutorials:org.apache.zest.tutorial.introduction:org.apache.zest.tutorial.introduction.thirtyminutes:sourceJar
:org.apache.zest:org.apache.zest.tutorials:org.apache.zest.tutorial.introduction:org.apache.zest.tutorial.introduction.thirtyminutes:testSourceJar
:org.apache.zest:org.apache.zest.tutorials:org.apache.zest.tutorial.introduction:org.apache.zest.tutorial.introduction.thirtyminutes:signArchives
SKIPPED
:org.apache.zest:org.apache.zest.tutorials:org.apache.zest.tutorial.introduction:org.apache.zest.tutorial.introduction.thirtyminutes:assemble
:org.apache.zest:org.apache.zest.tutorials:org.apache.zest.tutorial.introduction:org.apache.zest.tutorial.introduction.thirtyminutes:dependencyReport
:org.apache.zest:org.apache.zest.tutorials:org.apache.zest.tutorial.introduction:org.apache.zest.tutorial.introduction.twominutes:processVersionResources
UP-TO-DATE
:org.apache.zest:org.apache.zest.tutorials:org.apache.zest.tutorial.introduction:org.apache.zest.tutorial.introduction.twominutes:versionClasses
:org.apache.zest:org.apache.zest.tutorials:org.apache.zest.tutorial.introduction:org.apache.zest.tutorial.introduction.twominutes:jar
:org.apache.zest:org.apache.zest.tutorials:org.apache.zest.tutorial.introduction:org.apache.zest.tutorial.introduction.twominutes:javadoc
:org.apache.zest:org.apache.zest.tutorials:org.apache.zest.tutorial.introduction:org.apache.zest.tutorial.introduction.twominutes:javadocJar
:org.apache.zest:org.apache.zest.tutorials:org.apache.zest.tutorial.introduction:org.apache.zest.tutorial.introduction.twominutes:sourceJar
:org.apache.zest:org.apache.zest.tutorials:org.apache.zest.tutorial.introduction:org.apache.zest.tutorial.introduction.twominutes:testSourceJar
:org.apache.zest:org.apache.zest.tutorials:org.apache.zest.tutorial.introduction:org.apache.zest.tutorial.introduction.twominutes:signArchives
SKIPPED
:org.apache.zest:org.apache.zest.tutorials:org.apache.zest.tutorial.introduction:org.apache.zest.tutorial.introduction.twominutes:assemble
:org.apache.zest:org.apache.zest.tutorials:org.apache.zest.tutorial.introduction:org.apache.zest.tutorial.introduction.twominutes:dependencyReport
:org.apache.zest:generateGradleGoOfflineHelpers
:org.apache.zest:generateMavenGoOfflineHelpers
:org.apache.zest:srcDistFilteredFiles
:org.apache.zest:tarSources
:org.apache.zest:zipSources
:checkSrcDist FAILED

FAILURE: Build failed with an exception.

* What went wrong:
Execution failed for task ':org.apache.zest.libraries:org.apache.zest.library.servlet:test'.
> There were failing tests. See the report at: file://<https://builds.apache.org/job/Polygene(JavaEdition)-develop-java8-checkDists/ws/build/unpacked-distributions/src/apache-zest-java-3.0-SNAPSHOT-src/libraries/servlet/build/reports/tests/test/index.html>

* Try:
Run with --info or --debug option to get more log output.

* Exception is:
org.gradle.api.tasks.TaskExecutionException: Execution failed for task ':org.apache.zest.libraries:org.apache.zest.library.servlet:test'.
	at org.gradle.api.internal.tasks.execution.ExecuteActionsTaskExecuter.executeActions(ExecuteActionsTaskExecuter.java:84)
	at org.gradle.api.internal.tasks.execution.ExecuteActionsTaskExecuter.execute(ExecuteActionsTaskExecuter.java:55)
	at org.gradle.api.internal.tasks.execution.SkipUpToDateTaskExecuter.execute(SkipUpToDateTaskExecuter.java:61)
	at org.gradle.api.internal.tasks.execution.ValidatingTaskExecuter.execute(ValidatingTaskExecuter.java:58)
	at org.gradle.api.internal.tasks.execution.SkipEmptySourceFilesTaskExecuter.execute(SkipEmptySourceFilesTaskExecuter.java:88)
	at org.gradle.api.internal.tasks.execution.ResolveTaskArtifactStateTaskExecuter.execute(ResolveTaskArtifactStateTaskExecuter.java:45)
	at org.gradle.api.internal.tasks.execution.SkipTaskWithNoActionsExecuter.execute(SkipTaskWithNoActionsExecuter.java:51)
	at org.gradle.api.internal.tasks.execution.SkipOnlyIfTaskExecuter.execute(SkipOnlyIfTaskExecuter.java:54)
	at org.gradle.api.internal.tasks.execution.ExecuteAtMostOnceTaskExecuter.execute(ExecuteAtMostOnceTaskExecuter.java:43)
	at org.gradle.api.internal.tasks.execution.CatchExceptionTaskExecuter.execute(CatchExceptionTaskExecuter.java:34)
	at org.gradle.execution.taskgraph.DefaultTaskGraphExecuter$EventFiringTaskWorker.execute(DefaultTaskGraphExecuter.java:233)
	at org.gradle.execution.taskgraph.DefaultTaskGraphExecuter$EventFiringTaskWorker.execute(DefaultTaskGraphExecuter.java:215)
	at org.gradle.execution.taskgraph.AbstractTaskPlanExecutor$TaskExecutorWorker.processTask(AbstractTaskPlanExecutor.java:74)
	at org.gradle.execution.taskgraph.AbstractTaskPlanExecutor$TaskExecutorWorker.run(AbstractTaskPlanExecutor.java:55)
	at org.gradle.execution.taskgraph.DefaultTaskPlanExecutor.process(DefaultTaskPlanExecutor.java:32)
	at org.gradle.execution.taskgraph.DefaultTaskGraphExecuter.execute(DefaultTaskGraphExecuter.java:113)
	at org.gradle.execution.SelectedTaskExecutionAction.execute(SelectedTaskExecutionAction.java:37)
	at org.gradle.execution.DefaultBuildExecuter.execute(DefaultBuildExecuter.java:37)
	at org.gradle.execution.DefaultBuildExecuter.access$000(DefaultBuildExecuter.java:23)
	at org.gradle.execution.DefaultBuildExecuter$1.proceed(DefaultBuildExecuter.java:43)
	at org.gradle.execution.DryRunBuildExecutionAction.execute(DryRunBuildExecutionAction.java:32)
	at org.gradle.execution.DefaultBuildExecuter.execute(DefaultBuildExecuter.java:37)
	at org.gradle.execution.DefaultBuildExecuter.execute(DefaultBuildExecuter.java:30)
	at org.gradle.initialization.DefaultGradleLauncher$4.run(DefaultGradleLauncher.java:197)
	at org.gradle.internal.Factories$1.create(Factories.java:25)
	at org.gradle.internal.progress.DefaultBuildOperationExecutor.run(DefaultBuildOperationExecutor.java:91)
	at org.gradle.internal.progress.DefaultBuildOperationExecutor.run(DefaultBuildOperationExecutor.java:53)
	at org.gradle.initialization.DefaultGradleLauncher.doBuildStages(DefaultGradleLauncher.java:194)
	at org.gradle.initialization.DefaultGradleLauncher.access$200(DefaultGradleLauncher.java:36)
	at org.gradle.initialization.DefaultGradleLauncher$1.create(DefaultGradleLauncher.java:118)
	at org.gradle.initialization.DefaultGradleLauncher$1.create(DefaultGradleLauncher.java:112)
	at org.gradle.internal.progress.DefaultBuildOperationExecutor.run(DefaultBuildOperationExecutor.java:91)
	at org.gradle.internal.progress.DefaultBuildOperationExecutor.run(DefaultBuildOperationExecutor.java:63)
	at org.gradle.initialization.DefaultGradleLauncher.doBuild(DefaultGradleLauncher.java:112)
	at org.gradle.initialization.DefaultGradleLauncher.run(DefaultGradleLauncher.java:98)
	at org.gradle.api.tasks.GradleBuild.build(GradleBuild.java:121)
	at org.gradle.internal.reflect.JavaMethod.invoke(JavaMethod.java:73)
	at org.gradle.api.internal.project.taskfactory.DefaultTaskClassInfoStore$StandardTaskAction.doExecute(DefaultTaskClassInfoStore.java:141)
	at org.gradle.api.internal.project.taskfactory.DefaultTaskClassInfoStore$StandardTaskAction.execute(DefaultTaskClassInfoStore.java:134)
	at org.gradle.api.internal.project.taskfactory.DefaultTaskClassInfoStore$StandardTaskAction.execute(DefaultTaskClassInfoStore.java:123)
	at org.gradle.api.internal.AbstractTask$TaskActionWrapper.execute(AbstractTask.java:624)
	at org.gradle.api.internal.AbstractTask$TaskActionWrapper.execute(AbstractTask.java:607)
	at org.gradle.api.internal.tasks.execution.ExecuteActionsTaskExecuter.executeAction(ExecuteActionsTaskExecuter.java:95)
	at org.gradle.api.internal.tasks.execution.ExecuteActionsTaskExecuter.executeActions(ExecuteActionsTaskExecuter.java:76)
	at org.gradle.api.internal.tasks.execution.ExecuteActionsTaskExecuter.execute(ExecuteActionsTaskExecuter.java:55)
	at org.gradle.api.internal.tasks.execution.SkipUpToDateTaskExecuter.execute(SkipUpToDateTaskExecuter.java:61)
	at org.gradle.api.internal.tasks.execution.ValidatingTaskExecuter.execute(ValidatingTaskExecuter.java:58)
	at org.gradle.api.internal.tasks.execution.SkipEmptySourceFilesTaskExecuter.execute(SkipEmptySourceFilesTaskExecuter.java:88)
	at org.gradle.api.internal.tasks.execution.ResolveTaskArtifactStateTaskExecuter.execute(ResolveTaskArtifactStateTaskExecuter.java:45)
	at org.gradle.api.internal.tasks.execution.SkipTaskWithNoActionsExecuter.execute(SkipTaskWithNoActionsExecuter.java:51)
	at org.gradle.api.internal.tasks.execution.SkipOnlyIfTaskExecuter.execute(SkipOnlyIfTaskExecuter.java:54)
	at org.gradle.api.internal.tasks.execution.ExecuteAtMostOnceTaskExecuter.execute(ExecuteAtMostOnceTaskExecuter.java:43)
	at org.gradle.api.internal.tasks.execution.CatchExceptionTaskExecuter.execute(CatchExceptionTaskExecuter.java:34)
	at org.gradle.execution.taskgraph.DefaultTaskGraphExecuter$EventFiringTaskWorker.execute(DefaultTaskGraphExecuter.java:233)
	at org.gradle.execution.taskgraph.DefaultTaskGraphExecuter$EventFiringTaskWorker.execute(DefaultTaskGraphExecuter.java:215)
	at org.gradle.execution.taskgraph.AbstractTaskPlanExecutor$TaskExecutorWorker.processTask(AbstractTaskPlanExecutor.java:74)
	at org.gradle.execution.taskgraph.AbstractTaskPlanExecutor$TaskExecutorWorker.run(AbstractTaskPlanExecutor.java:55)
	at org.gradle.execution.taskgraph.DefaultTaskPlanExecutor.process(DefaultTaskPlanExecutor.java:32)
	at org.gradle.execution.taskgraph.DefaultTaskGraphExecuter.execute(DefaultTaskGraphExecuter.java:113)
	at org.gradle.execution.SelectedTaskExecutionAction.execute(SelectedTaskExecutionAction.java:37)
	at org.gradle.execution.DefaultBuildExecuter.execute(DefaultBuildExecuter.java:37)
	at org.gradle.execution.DefaultBuildExecuter.access$000(DefaultBuildExecuter.java:23)
	at org.gradle.execution.DefaultBuildExecuter$1.proceed(DefaultBuildExecuter.java:43)
	at org.gradle.execution.DryRunBuildExecutionAction.execute(DryRunBuildExecutionAction.java:32)
	at org.gradle.execution.DefaultBuildExecuter.execute(DefaultBuildExecuter.java:37)
	at org.gradle.execution.DefaultBuildExecuter.execute(DefaultBuildExecuter.java:30)
	at org.gradle.initialization.DefaultGradleLauncher$4.run(DefaultGradleLauncher.java:197)
	at org.gradle.internal.Factories$1.create(Factories.java:25)
	at org.gradle.internal.progress.DefaultBuildOperationExecutor.run(DefaultBuildOperationExecutor.java:91)
	at org.gradle.internal.progress.DefaultBuildOperationExecutor.run(DefaultBuildOperationExecutor.java:53)
	at org.gradle.initialization.DefaultGradleLauncher.doBuildStages(DefaultGradleLauncher.java:194)
	at org.gradle.initialization.DefaultGradleLauncher.access$200(DefaultGradleLauncher.java:36)
	at org.gradle.initialization.DefaultGradleLauncher$1.create(DefaultGradleLauncher.java:118)
	at org.gradle.initialization.DefaultGradleLauncher$1.create(DefaultGradleLauncher.java:112)
	at org.gradle.internal.progress.DefaultBuildOperationExecutor.run(DefaultBuildOperationExecutor.java:91)
	at org.gradle.internal.progress.DefaultBuildOperationExecutor.run(DefaultBuildOperationExecutor.java:63)
	at org.gradle.initialization.DefaultGradleLauncher.doBuild(DefaultGradleLauncher.java:112)
	at org.gradle.initialization.DefaultGradleLauncher.run(DefaultGradleLauncher.java:98)
	at org.gradle.launcher.exec.GradleBuildController.run(GradleBuildController.java:66)
	at org.gradle.tooling.internal.provider.ExecuteBuildActionRunner.run(ExecuteBuildActionRunner.java:28)
	at org.gradle.launcher.exec.ChainingBuildActionRunner.run(ChainingBuildActionRunner.java:35)
	at org.gradle.launcher.exec.InProcessBuildActionExecuter.execute(InProcessBuildActionExecuter.java:41)
	at org.gradle.launcher.exec.InProcessBuildActionExecuter.execute(InProcessBuildActionExecuter.java:26)
	at org.gradle.tooling.internal.provider.ContinuousBuildActionExecuter.execute(ContinuousBuildActionExecuter.java:75)
	at org.gradle.tooling.internal.provider.ContinuousBuildActionExecuter.execute(ContinuousBuildActionExecuter.java:49)
	at org.gradle.tooling.internal.provider.ServicesSetupBuildActionExecuter.execute(ServicesSetupBuildActionExecuter.java:44)
	at org.gradle.tooling.internal.provider.ServicesSetupBuildActionExecuter.execute(ServicesSetupBuildActionExecuter.java:29)
	at org.gradle.launcher.cli.RunBuildAction.run(RunBuildAction.java:51)
	at org.gradle.internal.Actions$RunnableActionAdapter.execute(Actions.java:173)
	at org.gradle.launcher.cli.CommandLineActionFactory$ParseAndBuildAction.execute(CommandLineActionFactory.java:244)
	at org.gradle.launcher.cli.CommandLineActionFactory$ParseAndBuildAction.execute(CommandLineActionFactory.java:217)
	at org.gradle.launcher.cli.JavaRuntimeValidationAction.execute(JavaRuntimeValidationAction.java:33)
	at org.gradle.launcher.cli.JavaRuntimeValidationAction.execute(JavaRuntimeValidationAction.java:24)
	at org.gradle.launcher.cli.ExceptionReportingAction.execute(ExceptionReportingAction.java:33)
	at org.gradle.launcher.cli.ExceptionReportingAction.execute(ExceptionReportingAction.java:22)
	at org.gradle.launcher.cli.CommandLineActionFactory$WithLogging.execute(CommandLineActionFactory.java:210)
	at org.gradle.launcher.cli.CommandLineActionFactory$WithLogging.execute(CommandLineActionFactory.java:174)
	at org.gradle.launcher.Main.doAction(Main.java:33)
	at org.gradle.launcher.bootstrap.EntryPoint.run(EntryPoint.java:45)
	at org.gradle.launcher.bootstrap.ProcessBootstrap.runNoExit(ProcessBootstrap.java:60)
	at org.gradle.launcher.bootstrap.ProcessBootstrap.run(ProcessBootstrap.java:37)
	at org.gradle.launcher.GradleMain.main(GradleMain.java:23)
	at org.gradle.wrapper.BootstrapMainStarter.start(BootstrapMainStarter.java:31)
	at org.gradle.wrapper.WrapperExecutor.execute(WrapperExecutor.java:108)
	at org.gradle.wrapper.GradleWrapperMain.main(GradleWrapperMain.java:61)
Caused by: org.gradle.api.GradleException: There were failing tests. See the report at: file://<https://builds.apache.org/job/Polygene(JavaEdition)-develop-java8-checkDists/ws/build/unpacked-distributions/src/apache-zest-java-3.0-SNAPSHOT-src/libraries/servlet/build/reports/tests/test/index.html>
	at org.gradle.api.tasks.testing.Test.handleTestFailures(Test.java:1242)
	at org.gradle.api.tasks.testing.Test.executeTests(Test.java:654)
	at org.gradle.internal.reflect.JavaMethod.invoke(JavaMethod.java:73)
	at org.gradle.api.internal.project.taskfactory.DefaultTaskClassInfoStore$StandardTaskAction.doExecute(DefaultTaskClassInfoStore.java:141)
	at org.gradle.api.internal.project.taskfactory.DefaultTaskClassInfoStore$StandardTaskAction.execute(DefaultTaskClassInfoStore.java:134)
	at org.gradle.api.internal.project.taskfactory.DefaultTaskClassInfoStore$StandardTaskAction.execute(DefaultTaskClassInfoStore.java:123)
	at org.gradle.api.internal.AbstractTask$TaskActionWrapper.execute(AbstractTask.java:624)
	at org.gradle.api.internal.AbstractTask$TaskActionWrapper.execute(AbstractTask.java:607)
	at org.gradle.api.internal.tasks.execution.ExecuteActionsTaskExecuter.executeAction(ExecuteActionsTaskExecuter.java:95)
	at org.gradle.api.internal.tasks.execution.ExecuteActionsTaskExecuter.executeActions(ExecuteActionsTaskExecuter.java:76)
	... 104 more


BUILD FAILED

Total time: 52 mins 10.105 secs
Build step 'Invoke Gradle script' changed build result to FAILURE
Build step 'Invoke Gradle script' marked build as failure
Archiving artifacts
Recording test results
Publishing Javadoc

Mime
View raw message