polygene-dev mailing list archives

Site index · List index
Message view « Date » · « Thread »
Top « Date » · « Thread »
From Apache Jenkins Server <jenk...@builds.apache.org>
Subject Build failed in Jenkins: Zest(JavaEdition)-develop-java8-checkDists #95
Date Sun, 20 Nov 2016 11:32:19 GMT
See <https://builds.apache.org/job/Zest(JavaEdition)-develop-java8-checkDists/95/changes>

Changes:

[paulmerlin] ZEST-177 Upgrade to ElasticSearch 5

[paulmerlin] build: move all tasks/plugins to the same package in buildSrc

[paulmerlin] ZEST-190 Fix documentation snippet include

[paulmerlin] build: enable gradle’s configure-on-demand

[paulmerlin] testsupport: introduce @NotYetImplemented annotation and its JUnit rule

[paulmerlin] build: introduce zest extension for shorted dependency notation

[paulmerlin] build: use zest extension for shorter dependency notation

[paulmerlin] build: move build logic from build scripts to plugins in buildSrc

[paulmerlin] minor: fix some javac & javadoc warnings in core

[paulmerlin] testsupport: limit resource usage of FreePortFinder

[paulmerlin] ZEST-188 Remove remains of scala support

[paulmerlin] build: fix task groups

[paulmerlin] build: extract dev/release version condition

[paulmerlin] build: move website & manual build logic to ManualPlugin in buildSrc

[paulmerlin] Revert "build: enable gradle’s configure-on-demand"

[paulmerlin] build: safer cleanup in ExecLogged

[paulmerlin] Fix forum sample

[paulmerlin] build: fix samples tasks name conflicts

[paulmerlin] build: isolate test working/tmp/home directories

[paulmerlin] fileconfig: introduce convention helper

[paulmerlin] tests: use fileconfig convention everywhere

[paulmerlin] build: match Gradle maxWorkers and Test maxParallelForks

[paulmerlin] testsupport: prefer TemporaryFolder over DelTree junit rule

[paulmerlin] build: move back dependencies declaration from buildSrc to ./

[paulmerlin] osgi: upgrade to 4.3.1 and fix compilation

[paulmerlin] uowfile: fix tests for parallel execution

[paulmerlin] fileconfig: add coverage

[paulmerlin] tools/shell: fix non-isolated tests and file operations

[paulmerlin] build: better tests isolation

[paulmerlin] tests: properly isolate all tests that rely on fileconfig

[paulmerlin] http: fix tests using keystores broken in isolation

[paulmerlin] tests: properly isolate all tests that rely on ephemeral network ports

[paulmerlin] index-elastic: assembly with provided client & tests speedup

------------------------------------------
[...truncated 6403 lines...]
:org.apache.zest:org.apache.zest.samples:org.apache.zest.sample.swing:javadoc<https://builds.apache.org/job/Zest(JavaEdition)-develop-java8-checkDists/ws/build/unpacked-distributions/src/apache-zest-java-3.0-SNAPSHOT-src/samples/swing/src/main/java/org/apache/zest/sample/swing/binding/internal/BoundAssociation.java>:48:
warning: no @param for objectBuilderFactory
    public BoundAssociation( @Uses Method associationMethod, @Structure ObjectFactory objectBuilderFactory,
           ^
<https://builds.apache.org/job/Zest(JavaEdition)-develop-java8-checkDists/ws/build/unpacked-distributions/src/apache-zest-java-3.0-SNAPSHOT-src/samples/swing/src/main/java/org/apache/zest/sample/swing/binding/internal/BoundAssociation.java>:48:
warning: no @param for allAdapters
    public BoundAssociation( @Uses Method associationMethod, @Structure ObjectFactory objectBuilderFactory,
           ^
<https://builds.apache.org/job/Zest(JavaEdition)-develop-java8-checkDists/ws/build/unpacked-distributions/src/apache-zest-java-3.0-SNAPSHOT-src/samples/swing/src/main/java/org/apache/zest/sample/swing/binding/internal/BoundProperty.java>:46:
warning: no @param for objectBuilderFactory
    public BoundProperty( @Uses Method propertyMethod, @Structure ObjectFactory objectBuilderFactory,
           ^
<https://builds.apache.org/job/Zest(JavaEdition)-develop-java8-checkDists/ws/build/unpacked-distributions/src/apache-zest-java-3.0-SNAPSHOT-src/samples/swing/src/main/java/org/apache/zest/sample/swing/binding/internal/BoundProperty.java>:46:
warning: no @param for allAdapters
    public BoundProperty( @Uses Method propertyMethod, @Structure ObjectFactory objectBuilderFactory,
           ^

4 warnings
:org.apache.zest:org.apache.zest.samples:org.apache.zest.sample.swing:javadocJar
:org.apache.zest:org.apache.zest.samples:org.apache.zest.sample.swing:sourceJar
:org.apache.zest:org.apache.zest.samples:org.apache.zest.sample.swing:testSourceJar
:org.apache.zest:org.apache.zest.samples:org.apache.zest.sample.swing:signArchives SKIPPED
:org.apache.zest:org.apache.zest.samples:org.apache.zest.sample.swing:assemble
:org.apache.zest:org.apache.zest.samples:org.apache.zest.sample.swing:dependencyReport
:org.apache.zest:org.apache.zest.tests:org.apache.zest.test.performance:processVersionResources
UP-TO-DATE
:org.apache.zest:org.apache.zest.tests:org.apache.zest.test.performance:versionClasses
:org.apache.zest:org.apache.zest.tests:org.apache.zest.test.performance:jar
:org.apache.zest:org.apache.zest.tests:org.apache.zest.test.performance:javadoc
:org.apache.zest:org.apache.zest.tests:org.apache.zest.test.performance:javadocJar
:org.apache.zest:org.apache.zest.tests:org.apache.zest.test.performance:sourceJar
:org.apache.zest:org.apache.zest.tests:org.apache.zest.test.performance:testSourceJar
:org.apache.zest:org.apache.zest.tests:org.apache.zest.test.performance:signArchives SKIPPED
:org.apache.zest:org.apache.zest.tests:org.apache.zest.test.performance:assemble
:org.apache.zest:org.apache.zest.tests:org.apache.zest.test.performance:dependencyReport
:org.apache.zest:org.apache.zest.tests:org.apache.zest.test.regression:processVersionResources
UP-TO-DATE
:org.apache.zest:org.apache.zest.tests:org.apache.zest.test.regression:versionClasses
:org.apache.zest:org.apache.zest.tests:org.apache.zest.test.regression:jar
:org.apache.zest:org.apache.zest.tests:org.apache.zest.test.regression:javadoc
:org.apache.zest:org.apache.zest.tests:org.apache.zest.test.regression:javadocJar
:org.apache.zest:org.apache.zest.tests:org.apache.zest.test.regression:sourceJar
:org.apache.zest:org.apache.zest.tests:org.apache.zest.test.regression:testSourceJar
:org.apache.zest:org.apache.zest.tests:org.apache.zest.test.regression:signArchives SKIPPED
:org.apache.zest:org.apache.zest.tests:org.apache.zest.test.regression:assemble
:org.apache.zest:org.apache.zest.tests:org.apache.zest.test.regression:dependencyReport
:org.apache.zest:org.apache.zest.tools:org.apache.zest.tool.envisage:processVersionResources
UP-TO-DATE
:org.apache.zest:org.apache.zest.tools:org.apache.zest.tool.envisage:versionClasses
:org.apache.zest:org.apache.zest.tools:org.apache.zest.tool.envisage:jar
:org.apache.zest:org.apache.zest.tools:org.apache.zest.tool.model-detail:javadoc
:org.apache.zest:org.apache.zest.tools:org.apache.zest.tool.envisage:javadoc
:org.apache.zest:org.apache.zest.tools:org.apache.zest.tool.envisage:javadocJar
:org.apache.zest:org.apache.zest.tools:org.apache.zest.tool.envisage:sourceJar
:org.apache.zest:org.apache.zest.tools:org.apache.zest.tool.envisage:testSourceJar
:org.apache.zest:org.apache.zest.tools:org.apache.zest.tool.envisage:signArchives SKIPPED
:org.apache.zest:org.apache.zest.tools:org.apache.zest.tool.envisage:assemble
:org.apache.zest:org.apache.zest.tools:org.apache.zest.tool.envisage:dependencyReport
:org.apache.zest:org.apache.zest.tools:org.apache.zest.tool.model-detail:javadocJar
:org.apache.zest:org.apache.zest.tools:org.apache.zest.tool.model-detail:sourceJar
:org.apache.zest:org.apache.zest.tools:org.apache.zest.tool.model-detail:testSourceJar
:org.apache.zest:org.apache.zest.tools:org.apache.zest.tool.model-detail:signArchives SKIPPED
:org.apache.zest:org.apache.zest.tools:org.apache.zest.tool.model-detail:assemble
:org.apache.zest:org.apache.zest.tools:org.apache.zest.tool.model-detail:dependencyReport
:org.apache.zest:org.apache.zest.tools:org.apache.zest.tool.shell:processVersionResources
UP-TO-DATE
:org.apache.zest:org.apache.zest.tools:org.apache.zest.tool.shell:versionClasses
:org.apache.zest:org.apache.zest.tools:org.apache.zest.tool.shell:jar
:org.apache.zest:org.apache.zest.tools:org.apache.zest.tool.shell:startScripts
:org.apache.zest:org.apache.zest.tools:org.apache.zest.tool.shell:distTar
:org.apache.zest:org.apache.zest.tools:org.apache.zest.tool.shell:distZip
:org.apache.zest:org.apache.zest.tools:org.apache.zest.tool.shell:javadoc
:org.apache.zest:org.apache.zest.tools:org.apache.zest.tool.shell:javadocJar
:org.apache.zest:org.apache.zest.tools:org.apache.zest.tool.shell:sourceJar
:org.apache.zest:org.apache.zest.tools:org.apache.zest.tool.shell:testSourceJar
:org.apache.zest:org.apache.zest.tools:org.apache.zest.tool.shell:signArchives SKIPPED
:org.apache.zest:org.apache.zest.tools:org.apache.zest.tool.shell:assemble
:org.apache.zest:org.apache.zest.tools:org.apache.zest.tool.shell:dependencyReport
:org.apache.zest:org.apache.zest.tutorials:org.apache.zest.tutorial.cargo:processVersionResources
UP-TO-DATE
:org.apache.zest:org.apache.zest.tutorials:org.apache.zest.tutorial.cargo:versionClasses
:org.apache.zest:org.apache.zest.tutorials:org.apache.zest.tutorial.cargo:jar
:org.apache.zest:org.apache.zest.tutorials:org.apache.zest.tutorial.cargo:javadoc
:org.apache.zest:org.apache.zest.tutorials:org.apache.zest.tutorial.cargo:javadocJar
:org.apache.zest:org.apache.zest.tutorials:org.apache.zest.tutorial.cargo:sourceJar
:org.apache.zest:org.apache.zest.tutorials:org.apache.zest.tutorial.cargo:testSourceJar
:org.apache.zest:org.apache.zest.tutorials:org.apache.zest.tutorial.cargo:signArchives SKIPPED
:org.apache.zest:org.apache.zest.tutorials:org.apache.zest.tutorial.cargo:assemble
:org.apache.zest:org.apache.zest.tutorials:org.apache.zest.tutorial.cargo:dependencyReport
:org.apache.zest:org.apache.zest.tutorials:org.apache.zest.tutorial.composites:processVersionResources
UP-TO-DATE
:org.apache.zest:org.apache.zest.tutorials:org.apache.zest.tutorial.composites:versionClasses
:org.apache.zest:org.apache.zest.tutorials:org.apache.zest.tutorial.composites:jar
:org.apache.zest:org.apache.zest.tutorials:org.apache.zest.tutorial.composites:javadoc
:org.apache.zest:org.apache.zest.tutorials:org.apache.zest.tutorial.composites:javadocJar
:org.apache.zest:org.apache.zest.tutorials:org.apache.zest.tutorial.composites:sourceJar
:org.apache.zest:org.apache.zest.tutorials:org.apache.zest.tutorial.composites:testSourceJar
:org.apache.zest:org.apache.zest.tutorials:org.apache.zest.tutorial.composites:signArchives
SKIPPED
:org.apache.zest:org.apache.zest.tutorials:org.apache.zest.tutorial.composites:assemble
:org.apache.zest:org.apache.zest.tutorials:org.apache.zest.tutorial.composites:dependencyReport
:org.apache.zest:org.apache.zest.tutorials:org.apache.zest.tutorial.hello:processVersionResources
UP-TO-DATE
:org.apache.zest:org.apache.zest.tutorials:org.apache.zest.tutorial.hello:versionClasses
:org.apache.zest:org.apache.zest.tutorials:org.apache.zest.tutorial.hello:jar
:org.apache.zest:org.apache.zest.tutorials:org.apache.zest.tutorial.hello:javadoc
:org.apache.zest:org.apache.zest.tutorials:org.apache.zest.tutorial.hello:javadocJar
:org.apache.zest:org.apache.zest.tutorials:org.apache.zest.tutorial.hello:sourceJar
:org.apache.zest:org.apache.zest.tutorials:org.apache.zest.tutorial.hello:testSourceJar
:org.apache.zest:org.apache.zest.tutorials:org.apache.zest.tutorial.hello:signArchives SKIPPED
:org.apache.zest:org.apache.zest.tutorials:org.apache.zest.tutorial.hello:assemble
:org.apache.zest:org.apache.zest.tutorials:org.apache.zest.tutorial.hello:dependencyReport
:org.apache.zest:org.apache.zest.tutorials:org.apache.zest.tutorial.introduction:processVersionResources
UP-TO-DATE
:org.apache.zest:org.apache.zest.tutorials:org.apache.zest.tutorial.introduction:versionClasses
:org.apache.zest:org.apache.zest.tutorials:org.apache.zest.tutorial.introduction:jar
:org.apache.zest:org.apache.zest.tutorials:org.apache.zest.tutorial.introduction:javadoc
:org.apache.zest:org.apache.zest.tutorials:org.apache.zest.tutorial.introduction:javadocJar
:org.apache.zest:org.apache.zest.tutorials:org.apache.zest.tutorial.introduction:sourceJar
:org.apache.zest:org.apache.zest.tutorials:org.apache.zest.tutorial.introduction:testSourceJar
:org.apache.zest:org.apache.zest.tutorials:org.apache.zest.tutorial.introduction:signArchives
SKIPPED
:org.apache.zest:org.apache.zest.tutorials:org.apache.zest.tutorial.introduction:assemble
:org.apache.zest:org.apache.zest.tutorials:org.apache.zest.tutorial.introduction:dependencyReport
:org.apache.zest:org.apache.zest.tutorials:org.apache.zest.tutorial.services:processVersionResources
UP-TO-DATE
:org.apache.zest:org.apache.zest.tutorials:org.apache.zest.tutorial.services:versionClasses
:org.apache.zest:org.apache.zest.tutorials:org.apache.zest.tutorial.services:jar
:org.apache.zest:org.apache.zest.tutorials:org.apache.zest.tutorial.services:javadoc
:org.apache.zest:org.apache.zest.tutorials:org.apache.zest.tutorial.services:javadocJar
:org.apache.zest:org.apache.zest.tutorials:org.apache.zest.tutorial.services:sourceJar
:org.apache.zest:org.apache.zest.tutorials:org.apache.zest.tutorial.services:testSourceJar
:org.apache.zest:org.apache.zest.tutorials:org.apache.zest.tutorial.services:signArchives
SKIPPED
:org.apache.zest:org.apache.zest.tutorials:org.apache.zest.tutorial.services:assemble
:org.apache.zest:org.apache.zest.tutorials:org.apache.zest.tutorial.services:dependencyReport
:org.apache.zest:org.apache.zest.tutorials:org.apache.zest.tutorial.introduction:org.apache.zest.tutorial.introduction.tenminutes:javadoc
:org.apache.zest:org.apache.zest.tutorials:org.apache.zest.tutorial.introduction:org.apache.zest.tutorial.introduction.tenminutes:javadocJar
:org.apache.zest:org.apache.zest.tutorials:org.apache.zest.tutorial.introduction:org.apache.zest.tutorial.introduction.tenminutes:sourceJar
:org.apache.zest:org.apache.zest.tutorials:org.apache.zest.tutorial.introduction:org.apache.zest.tutorial.introduction.tenminutes:testSourceJar
:org.apache.zest:org.apache.zest.tutorials:org.apache.zest.tutorial.introduction:org.apache.zest.tutorial.introduction.tenminutes:signArchives
SKIPPED
:org.apache.zest:org.apache.zest.tutorials:org.apache.zest.tutorial.introduction:org.apache.zest.tutorial.introduction.tenminutes:assemble
:org.apache.zest:org.apache.zest.tutorials:org.apache.zest.tutorial.introduction:org.apache.zest.tutorial.introduction.tenminutes:dependencyReport
:org.apache.zest:org.apache.zest.tutorials:org.apache.zest.tutorial.introduction:org.apache.zest.tutorial.introduction.thirtyminutes:processVersionResources
UP-TO-DATE
:org.apache.zest:org.apache.zest.tutorials:org.apache.zest.tutorial.introduction:org.apache.zest.tutorial.introduction.thirtyminutes:versionClasses
:org.apache.zest:org.apache.zest.tutorials:org.apache.zest.tutorial.introduction:org.apache.zest.tutorial.introduction.thirtyminutes:jar
:org.apache.zest:org.apache.zest.tutorials:org.apache.zest.tutorial.introduction:org.apache.zest.tutorial.introduction.thirtyminutes:javadoc
:org.apache.zest:org.apache.zest.tutorials:org.apache.zest.tutorial.introduction:org.apache.zest.tutorial.introduction.thirtyminutes:javadocJar
:org.apache.zest:org.apache.zest.tutorials:org.apache.zest.tutorial.introduction:org.apache.zest.tutorial.introduction.thirtyminutes:sourceJar
:org.apache.zest:org.apache.zest.tutorials:org.apache.zest.tutorial.introduction:org.apache.zest.tutorial.introduction.thirtyminutes:testSourceJar
:org.apache.zest:org.apache.zest.tutorials:org.apache.zest.tutorial.introduction:org.apache.zest.tutorial.introduction.thirtyminutes:signArchives
SKIPPED
:org.apache.zest:org.apache.zest.tutorials:org.apache.zest.tutorial.introduction:org.apache.zest.tutorial.introduction.thirtyminutes:assemble
:org.apache.zest:org.apache.zest.tutorials:org.apache.zest.tutorial.introduction:org.apache.zest.tutorial.introduction.thirtyminutes:dependencyReport
:org.apache.zest:org.apache.zest.tutorials:org.apache.zest.tutorial.introduction:org.apache.zest.tutorial.introduction.twominutes:processVersionResources
UP-TO-DATE
:org.apache.zest:org.apache.zest.tutorials:org.apache.zest.tutorial.introduction:org.apache.zest.tutorial.introduction.twominutes:versionClasses
:org.apache.zest:org.apache.zest.tutorials:org.apache.zest.tutorial.introduction:org.apache.zest.tutorial.introduction.twominutes:jar
:org.apache.zest:org.apache.zest.tutorials:org.apache.zest.tutorial.introduction:org.apache.zest.tutorial.introduction.twominutes:javadoc
:org.apache.zest:org.apache.zest.tutorials:org.apache.zest.tutorial.introduction:org.apache.zest.tutorial.introduction.twominutes:javadocJar
:org.apache.zest:org.apache.zest.tutorials:org.apache.zest.tutorial.introduction:org.apache.zest.tutorial.introduction.twominutes:sourceJar
:org.apache.zest:org.apache.zest.tutorials:org.apache.zest.tutorial.introduction:org.apache.zest.tutorial.introduction.twominutes:testSourceJar
:org.apache.zest:org.apache.zest.tutorials:org.apache.zest.tutorial.introduction:org.apache.zest.tutorial.introduction.twominutes:signArchives
SKIPPED
:org.apache.zest:org.apache.zest.tutorials:org.apache.zest.tutorial.introduction:org.apache.zest.tutorial.introduction.twominutes:assemble
:org.apache.zest:org.apache.zest.tutorials:org.apache.zest.tutorial.introduction:org.apache.zest.tutorial.introduction.twominutes:dependencyReport
:org.apache.zest:buildAll
:org.apache.zest:generateGradleGoOfflineHelpers
:org.apache.zest:generateMavenGoOfflineHelpers
:org.apache.zest:tarBinaries
:org.apache.zest:srcDistFilteredFiles
:org.apache.zest:tarSources
:org.apache.zest:zipBinaries
:org.apache.zest:zipSources
:org.apache.zest:signArchives SKIPPED
:org.apache.zest:assemble

FAILURE: Build failed with an exception.

* What went wrong:
Execution failed for task ':checkBinDist_rat'.
> Found 2 files with unapproved/unknown licenses. See <https://builds.apache.org/job/Zest(JavaEdition)-develop-java8-checkDists/ws/build/reports/rat-bin-dist/index.html>

* Try:
Run with --info or --debug option to get more log output.

* Exception is:
org.gradle.api.tasks.TaskExecutionException: Execution failed for task ':checkBinDist_rat'.
	at org.gradle.api.internal.tasks.execution.ExecuteActionsTaskExecuter.executeActions(ExecuteActionsTaskExecuter.java:69)
	at org.gradle.api.internal.tasks.execution.ExecuteActionsTaskExecuter.execute(ExecuteActionsTaskExecuter.java:46)
	at org.gradle.api.internal.tasks.execution.PostExecutionAnalysisTaskExecuter.execute(PostExecutionAnalysisTaskExecuter.java:35)
	at org.gradle.api.internal.tasks.execution.SkipUpToDateTaskExecuter.execute(SkipUpToDateTaskExecuter.java:64)
	at org.gradle.api.internal.tasks.execution.ValidatingTaskExecuter.execute(ValidatingTaskExecuter.java:58)
	at org.gradle.api.internal.tasks.execution.SkipEmptySourceFilesTaskExecuter.execute(SkipEmptySourceFilesTaskExecuter.java:52)
	at org.gradle.api.internal.tasks.execution.SkipTaskWithNoActionsExecuter.execute(SkipTaskWithNoActionsExecuter.java:52)
	at org.gradle.api.internal.tasks.execution.SkipOnlyIfTaskExecuter.execute(SkipOnlyIfTaskExecuter.java:53)
	at org.gradle.api.internal.tasks.execution.ExecuteAtMostOnceTaskExecuter.execute(ExecuteAtMostOnceTaskExecuter.java:43)
	at org.gradle.execution.taskgraph.DefaultTaskGraphExecuter$EventFiringTaskWorker.execute(DefaultTaskGraphExecuter.java:233)
	at org.gradle.execution.taskgraph.DefaultTaskGraphExecuter$EventFiringTaskWorker.execute(DefaultTaskGraphExecuter.java:215)
	at org.gradle.execution.taskgraph.AbstractTaskPlanExecutor$TaskExecutorWorker.processTask(AbstractTaskPlanExecutor.java:74)
	at org.gradle.execution.taskgraph.AbstractTaskPlanExecutor$TaskExecutorWorker.run(AbstractTaskPlanExecutor.java:55)
	at org.gradle.execution.taskgraph.DefaultTaskPlanExecutor.process(DefaultTaskPlanExecutor.java:32)
	at org.gradle.execution.taskgraph.DefaultTaskGraphExecuter.execute(DefaultTaskGraphExecuter.java:113)
	at org.gradle.execution.SelectedTaskExecutionAction.execute(SelectedTaskExecutionAction.java:37)
	at org.gradle.execution.DefaultBuildExecuter.execute(DefaultBuildExecuter.java:37)
	at org.gradle.execution.DefaultBuildExecuter.access$000(DefaultBuildExecuter.java:23)
	at org.gradle.execution.DefaultBuildExecuter$1.proceed(DefaultBuildExecuter.java:43)
	at org.gradle.execution.DryRunBuildExecutionAction.execute(DryRunBuildExecutionAction.java:32)
	at org.gradle.execution.DefaultBuildExecuter.execute(DefaultBuildExecuter.java:37)
	at org.gradle.execution.DefaultBuildExecuter.execute(DefaultBuildExecuter.java:30)
	at org.gradle.initialization.DefaultGradleLauncher$4.run(DefaultGradleLauncher.java:186)
	at org.gradle.internal.Factories$1.create(Factories.java:22)
	at org.gradle.internal.progress.DefaultBuildOperationExecutor.run(DefaultBuildOperationExecutor.java:91)
	at org.gradle.internal.progress.DefaultBuildOperationExecutor.run(DefaultBuildOperationExecutor.java:53)
	at org.gradle.initialization.DefaultGradleLauncher.doBuildStages(DefaultGradleLauncher.java:183)
	at org.gradle.initialization.DefaultGradleLauncher.access$200(DefaultGradleLauncher.java:33)
	at org.gradle.initialization.DefaultGradleLauncher$1.create(DefaultGradleLauncher.java:112)
	at org.gradle.initialization.DefaultGradleLauncher$1.create(DefaultGradleLauncher.java:106)
	at org.gradle.internal.progress.DefaultBuildOperationExecutor.run(DefaultBuildOperationExecutor.java:91)
	at org.gradle.internal.progress.DefaultBuildOperationExecutor.run(DefaultBuildOperationExecutor.java:63)
	at org.gradle.initialization.DefaultGradleLauncher.doBuild(DefaultGradleLauncher.java:106)
	at org.gradle.initialization.DefaultGradleLauncher.run(DefaultGradleLauncher.java:92)
	at org.gradle.launcher.exec.GradleBuildController.run(GradleBuildController.java:66)
	at org.gradle.tooling.internal.provider.ExecuteBuildActionRunner.run(ExecuteBuildActionRunner.java:28)
	at org.gradle.launcher.exec.ChainingBuildActionRunner.run(ChainingBuildActionRunner.java:35)
	at org.gradle.launcher.exec.InProcessBuildActionExecuter.execute(InProcessBuildActionExecuter.java:41)
	at org.gradle.launcher.exec.InProcessBuildActionExecuter.execute(InProcessBuildActionExecuter.java:26)
	at org.gradle.tooling.internal.provider.ContinuousBuildActionExecuter.execute(ContinuousBuildActionExecuter.java:79)
	at org.gradle.tooling.internal.provider.ContinuousBuildActionExecuter.execute(ContinuousBuildActionExecuter.java:51)
	at org.gradle.launcher.cli.RunBuildAction.run(RunBuildAction.java:51)
	at org.gradle.internal.Actions$RunnableActionAdapter.execute(Actions.java:173)
	at org.gradle.launcher.cli.CommandLineActionFactory$ParseAndBuildAction.execute(CommandLineActionFactory.java:244)
	at org.gradle.launcher.cli.CommandLineActionFactory$ParseAndBuildAction.execute(CommandLineActionFactory.java:217)
	at org.gradle.launcher.cli.JavaRuntimeValidationAction.execute(JavaRuntimeValidationAction.java:33)
	at org.gradle.launcher.cli.JavaRuntimeValidationAction.execute(JavaRuntimeValidationAction.java:24)
	at org.gradle.launcher.cli.ExceptionReportingAction.execute(ExceptionReportingAction.java:33)
	at org.gradle.launcher.cli.ExceptionReportingAction.execute(ExceptionReportingAction.java:22)
	at org.gradle.launcher.cli.CommandLineActionFactory$WithLogging.execute(CommandLineActionFactory.java:210)
	at org.gradle.launcher.cli.CommandLineActionFactory$WithLogging.execute(CommandLineActionFactory.java:174)
	at org.gradle.launcher.Main.doAction(Main.java:33)
	at org.gradle.launcher.bootstrap.EntryPoint.run(EntryPoint.java:45)
	at org.gradle.launcher.bootstrap.ProcessBootstrap.runNoExit(ProcessBootstrap.java:60)
	at org.gradle.launcher.bootstrap.ProcessBootstrap.run(ProcessBootstrap.java:37)
	at org.gradle.launcher.GradleMain.main(GradleMain.java:23)
	at org.gradle.wrapper.BootstrapMainStarter.start(BootstrapMainStarter.java:30)
	at org.gradle.wrapper.WrapperExecutor.execute(WrapperExecutor.java:129)
	at org.gradle.wrapper.GradleWrapperMain.main(GradleWrapperMain.java:61)
Caused by: org.gradle.api.GradleException: Found 2 files with unapproved/unknown licenses.
See <https://builds.apache.org/job/Zest(JavaEdition)-develop-java8-checkDists/ws/build/reports/rat-bin-dist/index.html>
	at org.apache.rat.gradle.RatTask.rat(RatTask.groovy:83)
	at org.gradle.internal.reflect.JavaMethod.invoke(JavaMethod.java:75)
	at org.gradle.api.internal.project.taskfactory.DefaultTaskClassInfoStore$StandardTaskAction.doExecute(DefaultTaskClassInfoStore.java:136)
	at org.gradle.api.internal.project.taskfactory.DefaultTaskClassInfoStore$StandardTaskAction.execute(DefaultTaskClassInfoStore.java:129)
	at org.gradle.api.internal.project.taskfactory.DefaultTaskClassInfoStore$StandardTaskAction.execute(DefaultTaskClassInfoStore.java:118)
	at org.gradle.api.internal.AbstractTask$TaskActionWrapper.execute(AbstractTask.java:623)
	at org.gradle.api.internal.AbstractTask$TaskActionWrapper.execute(AbstractTask.java:606)
	at org.gradle.api.internal.tasks.execution.ExecuteActionsTaskExecuter.executeAction(ExecuteActionsTaskExecuter.java:80)
	at org.gradle.api.internal.tasks.execution.ExecuteActionsTaskExecuter.executeActions(ExecuteActionsTaskExecuter.java:61)
	... 58 more


BUILD FAILED

Total time: 24 mins 0.54 secs
Build step 'Invoke Gradle script' changed build result to FAILURE
Build step 'Invoke Gradle script' marked build as failure
Archiving artifacts
Recording test results
Publishing Javadoc

Mime
View raw message