polygene-dev mailing list archives

Site index · List index
Message view « Date » · « Thread »
Top « Date » · « Thread »
From Apache Jenkins Server <jenk...@builds.apache.org>
Subject Build failed in Jenkins: Zest(JavaEdition)-develop-java9-check #18
Date Sun, 06 Nov 2016 17:57:14 GMT
See <https://builds.apache.org/job/Zest(JavaEdition)-develop-java9-check/18/changes>

Changes:

[paulmerlin] Remove now unused Wicket dependency declaration

[paulmerlin] Minor libraries upgrades

[paulmerlin] build: remove idea plugin as Gradle project import works out of the box

[paulmerlin] build: remove eclipse plugin as Gradle project import works out of the

[paulmerlin] build: remove custom wrapper task, this is not needed anymore

[paulmerlin] build: prefer httpS repositories when possible

[paulmerlin] build: remove provided configuration, Gradle now provide compileOnly

[paulmerlin] build: remove old hack to continue on test failures

[paulmerlin] build: remove unused task

[paulmerlin] build: remove some now not needed groovy flags

[paulmerlin] build: fix restlet maven repository url

[paulmerlin] build: remove unused project extra property

[paulmerlin] build: groovy @CompileStatic buildSrc

[paulmerlin] build: remove unnecessary output

[paulmerlin] build: fix asciidoc snippet filter tag matching

[paulmerlin] doc: fix various snippet tags

------------------------------------------
[...truncated 3369 lines...]
	at org.gradle.internal.Actions$RunnableActionAdapter.execute(Actions.java:173)
	at org.gradle.launcher.cli.CommandLineActionFactory$ParseAndBuildAction.execute(CommandLineActionFactory.java:244)
	at org.gradle.launcher.cli.CommandLineActionFactory$ParseAndBuildAction.execute(CommandLineActionFactory.java:217)
	at org.gradle.launcher.cli.JavaRuntimeValidationAction.execute(JavaRuntimeValidationAction.java:33)
	at org.gradle.launcher.cli.JavaRuntimeValidationAction.execute(JavaRuntimeValidationAction.java:24)
	at org.gradle.launcher.cli.ExceptionReportingAction.execute(ExceptionReportingAction.java:33)
	at org.gradle.launcher.cli.ExceptionReportingAction.execute(ExceptionReportingAction.java:22)
	at org.gradle.launcher.cli.CommandLineActionFactory$WithLogging.execute(CommandLineActionFactory.java:210)
	at org.gradle.launcher.cli.CommandLineActionFactory$WithLogging.execute(CommandLineActionFactory.java:174)
	at org.gradle.launcher.Main.doAction(Main.java:33)
	at org.gradle.launcher.bootstrap.EntryPoint.run(EntryPoint.java:45)
	at jdk.internal.reflect.NativeMethodAccessorImpl.invoke0(java.base@9-ea/Native Method)
	at jdk.internal.reflect.NativeMethodAccessorImpl.invoke(java.base@9-ea/NativeMethodAccessorImpl.java:62)
	at jdk.internal.reflect.DelegatingMethodAccessorImpl.invoke(java.base@9-ea/DelegatingMethodAccessorImpl.java:43)
	at java.lang.reflect.Method.invoke(java.base@9-ea/Method.java:535)
	at org.gradle.launcher.bootstrap.ProcessBootstrap.runNoExit(ProcessBootstrap.java:60)
	at org.gradle.launcher.bootstrap.ProcessBootstrap.run(ProcessBootstrap.java:37)
	at org.gradle.launcher.GradleMain.main(GradleMain.java:23)
	at jdk.internal.reflect.NativeMethodAccessorImpl.invoke0(java.base@9-ea/Native Method)
	at jdk.internal.reflect.NativeMethodAccessorImpl.invoke(java.base@9-ea/NativeMethodAccessorImpl.java:62)
	at jdk.internal.reflect.DelegatingMethodAccessorImpl.invoke(java.base@9-ea/DelegatingMethodAccessorImpl.java:43)
	at java.lang.reflect.Method.invoke(java.base@9-ea/Method.java:535)
	at org.gradle.wrapper.BootstrapMainStarter.start(BootstrapMainStarter.java:30)
	at org.gradle.wrapper.WrapperExecutor.execute(WrapperExecutor.java:129)
	at org.gradle.wrapper.GradleWrapperMain.main(GradleWrapperMain.java:61)
java.lang.NullPointerException
	at aQute.bnd.header.OSGiHeader.quote(OSGiHeader.java:150)
	at aQute.bnd.header.Attrs.append(Attrs.java:416)
	at aQute.bnd.header.Attrs.append(Attrs.java:397)
	at aQute.bnd.header.Parameters.append(Parameters.java:175)
	at aQute.bnd.header.Parameters.toString(Parameters.java:164)
	at aQute.bnd.osgi.Analyzer.calcManifest(Analyzer.java:788)
	at org.gradle.api.internal.plugins.osgi.DefaultOsgiManifest.getEffectiveManifest(DefaultOsgiManifest.java:70)
	at org.gradle.api.internal.plugins.osgi.DefaultOsgiManifest_Decorated.getEffectiveManifest(Unknown
Source)
	at org.gradle.api.internal.plugins.osgi.DefaultOsgiManifest.getEffectiveManifest(DefaultOsgiManifest.java:35)
	at org.gradle.api.java.archives.internal.DefaultManifest.writeTo(DefaultManifest.java:220)
	at org.gradle.api.java.archives.internal.DefaultManifest.writeTo(DefaultManifest.java:214)
	at org.gradle.jvm.tasks.Jar$1$1.execute(Jar.java:80)
	at org.gradle.jvm.tasks.Jar$1$1.execute(Jar.java:67)
	at org.gradle.api.internal.file.collections.MapFileTree$FileVisitDetailsImpl.copyTo(MapFileTree.java:182)
	at org.gradle.api.internal.file.copy.DefaultFileCopyDetails.copyTo(DefaultFileCopyDetails.java:98)
	at org.gradle.api.internal.file.archive.ZipCopyAction$StreamAction.visitFile(ZipCopyAction.java:102)
	at org.gradle.api.internal.file.archive.ZipCopyAction$StreamAction.processFile(ZipCopyAction.java:92)
	at org.gradle.api.internal.file.copy.NormalizingCopyActionDecorator$1$1.processFile(NormalizingCopyActionDecorator.java:66)
	at org.gradle.api.internal.file.copy.DuplicateHandlingCopyActionDecorator$1$1.processFile(DuplicateHandlingCopyActionDecorator.java:60)
	at org.gradle.api.internal.file.copy.CopyFileVisitorImpl.processFile(CopyFileVisitorImpl.java:60)
	at org.gradle.api.internal.file.copy.CopyFileVisitorImpl.visitFile(CopyFileVisitorImpl.java:44)
	at org.gradle.api.internal.file.AbstractFileTree$FilteredFileTreeImpl$1.visitFile(AbstractFileTree.java:150)
	at org.gradle.api.internal.file.collections.MapFileTree$Visit.visit(MapFileTree.java:133)
	at org.gradle.api.internal.file.collections.MapFileTree.visit(MapFileTree.java:86)
	at org.gradle.api.internal.file.collections.FileTreeAdapter.visit(FileTreeAdapter.java:109)
	at org.gradle.api.internal.file.AbstractFileTree$FilteredFileTreeImpl.visit(AbstractFileTree.java:141)
	at org.gradle.api.internal.file.CompositeFileTree.visit(CompositeFileTree.java:58)
	at org.gradle.api.internal.file.copy.CopySpecActionImpl.execute(CopySpecActionImpl.java:37)
	at org.gradle.api.internal.file.copy.CopySpecActionImpl.execute(CopySpecActionImpl.java:24)
	at org.gradle.api.internal.file.copy.DefaultCopySpec$DefaultCopySpecResolver.walk(DefaultCopySpec.java:570)
	at org.gradle.api.internal.file.copy.DefaultCopySpec$DefaultCopySpecResolver.walk(DefaultCopySpec.java:572)
	at org.gradle.api.internal.file.copy.DefaultCopySpec$DefaultCopySpecResolver.walk(DefaultCopySpec.java:572)
	at org.gradle.api.internal.file.copy.DefaultCopySpec.walk(DefaultCopySpec.java:380)
	at org.gradle.api.internal.file.copy.CopySpecBackedCopyActionProcessingStream.process(CopySpecBackedCopyActionProcessingStream.java:36)
	at org.gradle.api.internal.file.copy.DuplicateHandlingCopyActionDecorator$1.process(DuplicateHandlingCopyActionDecorator.java:44)
	at org.gradle.api.internal.file.copy.NormalizingCopyActionDecorator$1.process(NormalizingCopyActionDecorator.java:57)
	at org.gradle.api.internal.file.archive.ZipCopyAction$1.execute(ZipCopyAction.java:64)
	at org.gradle.api.internal.file.archive.ZipCopyAction$1.execute(ZipCopyAction.java:62)
	at org.gradle.internal.IoActions.withResource(IoActions.java:74)
	at org.gradle.api.internal.file.archive.ZipCopyAction.execute(ZipCopyAction.java:62)
	at org.gradle.api.internal.file.copy.NormalizingCopyActionDecorator.execute(NormalizingCopyActionDecorator.java:53)
	at org.gradle.api.internal.file.copy.DuplicateHandlingCopyActionDecorator.execute(DuplicateHandlingCopyActionDecorator.java:42)
	at org.gradle.api.internal.file.copy.CopyActionExecuter.execute(CopyActionExecuter.java:38)
	at org.gradle.api.tasks.AbstractCopyTask.copy(AbstractCopyTask.java:94)
	at jdk.internal.reflect.NativeMethodAccessorImpl.invoke0(java.base@9-ea/Native Method)
	at jdk.internal.reflect.NativeMethodAccessorImpl.invoke(java.base@9-ea/NativeMethodAccessorImpl.java:62)
	at jdk.internal.reflect.DelegatingMethodAccessorImpl.invoke(java.base@9-ea/DelegatingMethodAccessorImpl.java:43)
	at java.lang.reflect.Method.invoke(java.base@9-ea/Method.java:535)
	at org.gradle.internal.reflect.JavaMethod.invoke(JavaMethod.java:75)
	at org.gradle.api.internal.project.taskfactory.DefaultTaskClassInfoStore$StandardTaskAction.doExecute(DefaultTaskClassInfoStore.java:136)
	at org.gradle.api.internal.project.taskfactory.DefaultTaskClassInfoStore$StandardTaskAction.execute(DefaultTaskClassInfoStore.java:129)
	at org.gradle.api.internal.project.taskfactory.DefaultTaskClassInfoStore$StandardTaskAction.execute(DefaultTaskClassInfoStore.java:118)
	at org.gradle.api.internal.AbstractTask$TaskActionWrapper.execute(AbstractTask.java:623)
	at org.gradle.api.internal.AbstractTask$TaskActionWrapper.execute(AbstractTask.java:606)
	at org.gradle.api.internal.tasks.execution.ExecuteActionsTaskExecuter.executeAction(ExecuteActionsTaskExecuter.java:80)
	at org.gradle.api.internal.tasks.execution.ExecuteActionsTaskExecuter.executeActions(ExecuteActionsTaskExecuter.java:61)
	at org.gradle.api.internal.tasks.execution.ExecuteActionsTaskExecuter.execute(ExecuteActionsTaskExecuter.java:46)
	at org.gradle.api.internal.tasks.execution.PostExecutionAnalysisTaskExecuter.execute(PostExecutionAnalysisTaskExecuter.java:35)
	at org.gradle.api.internal.tasks.execution.SkipUpToDateTaskExecuter.execute(SkipUpToDateTaskExecuter.java:64)
	at org.gradle.api.internal.tasks.execution.ValidatingTaskExecuter.execute(ValidatingTaskExecuter.java:58)
	at org.gradle.api.internal.tasks.execution.SkipEmptySourceFilesTaskExecuter.execute(SkipEmptySourceFilesTaskExecuter.java:52)
	at org.gradle.api.internal.tasks.execution.SkipTaskWithNoActionsExecuter.execute(SkipTaskWithNoActionsExecuter.java:52)
	at org.gradle.api.internal.tasks.execution.SkipOnlyIfTaskExecuter.execute(SkipOnlyIfTaskExecuter.java:53)
	at org.gradle.api.internal.tasks.execution.ExecuteAtMostOnceTaskExecuter.execute(ExecuteAtMostOnceTaskExecuter.java:43)
	at org.gradle.execution.taskgraph.DefaultTaskGraphExecuter$EventFiringTaskWorker.execute(DefaultTaskGraphExecuter.java:233)
	at org.gradle.execution.taskgraph.DefaultTaskGraphExecuter$EventFiringTaskWorker.execute(DefaultTaskGraphExecuter.java:215)
	at org.gradle.execution.taskgraph.AbstractTaskPlanExecutor$TaskExecutorWorker.processTask(AbstractTaskPlanExecutor.java:74)
	at org.gradle.execution.taskgraph.AbstractTaskPlanExecutor$TaskExecutorWorker.run(AbstractTaskPlanExecutor.java:55)
	at org.gradle.execution.taskgraph.DefaultTaskPlanExecutor.process(DefaultTaskPlanExecutor.java:32)
	at org.gradle.execution.taskgraph.DefaultTaskGraphExecuter.execute(DefaultTaskGraphExecuter.java:113)
	at org.gradle.execution.SelectedTaskExecutionAction.execute(SelectedTaskExecutionAction.java:37)
	at org.gradle.execution.DefaultBuildExecuter.execute(DefaultBuildExecuter.java:37)
	at org.gradle.execution.DefaultBuildExecuter.access$000(DefaultBuildExecuter.java:23)
	at org.gradle.execution.DefaultBuildExecuter$1.proceed(DefaultBuildExecuter.java:43)
	at org.gradle.execution.DryRunBuildExecutionAction.execute(DryRunBuildExecutionAction.java:32)
	at org.gradle.execution.DefaultBuildExecuter.execute(DefaultBuildExecuter.java:37)
	at org.gradle.execution.DefaultBuildExecuter.execute(DefaultBuildExecuter.java:30)
	at org.gradle.initialization.DefaultGradleLauncher$4.run(DefaultGradleLauncher.java:186)
	at org.gradle.internal.Factories$1.create(Factories.java:22)
	at org.gradle.internal.progress.DefaultBuildOperationExecutor.run(DefaultBuildOperationExecutor.java:91)
	at org.gradle.internal.progress.DefaultBuildOperationExecutor.run(DefaultBuildOperationExecutor.java:53)
	at org.gradle.initialization.DefaultGradleLauncher.doBuildStages(DefaultGradleLauncher.java:183)
	at org.gradle.initialization.DefaultGradleLauncher.access$200(DefaultGradleLauncher.java:33)
	at org.gradle.initialization.DefaultGradleLauncher$1.create(DefaultGradleLauncher.java:112)
	at org.gradle.initialization.DefaultGradleLauncher$1.create(DefaultGradleLauncher.java:106)
	at org.gradle.internal.progress.DefaultBuildOperationExecutor.run(DefaultBuildOperationExecutor.java:91)
	at org.gradle.internal.progress.DefaultBuildOperationExecutor.run(DefaultBuildOperationExecutor.java:63)
	at org.gradle.initialization.DefaultGradleLauncher.doBuild(DefaultGradleLauncher.java:106)
	at org.gradle.initialization.DefaultGradleLauncher.run(DefaultGradleLauncher.java:92)
	at org.gradle.launcher.exec.GradleBuildController.run(GradleBuildController.java:66)
	at org.gradle.tooling.internal.provider.ExecuteBuildActionRunner.run(ExecuteBuildActionRunner.java:28)
	at org.gradle.launcher.exec.ChainingBuildActionRunner.run(ChainingBuildActionRunner.java:35)
	at org.gradle.launcher.exec.InProcessBuildActionExecuter.execute(InProcessBuildActionExecuter.java:41)
	at org.gradle.launcher.exec.InProcessBuildActionExecuter.execute(InProcessBuildActionExecuter.java:26)
	at org.gradle.tooling.internal.provider.ContinuousBuildActionExecuter.execute(ContinuousBuildActionExecuter.java:79)
	at org.gradle.tooling.internal.provider.ContinuousBuildActionExecuter.execute(ContinuousBuildActionExecuter.java:51)
	at org.gradle.launcher.cli.RunBuildAction.run(RunBuildAction.java:51)
	at org.gradle.internal.Actions$RunnableActionAdapter.execute(Actions.java:173)
	at org.gradle.launcher.cli.CommandLineActionFactory$ParseAndBuildAction.execute(CommandLineActionFactory.java:244)
	at org.gradle.launcher.cli.CommandLineActionFactory$ParseAndBuildAction.execute(CommandLineActionFactory.java:217)
	at org.gradle.launcher.cli.JavaRuntimeValidationAction.execute(JavaRuntimeValidationAction.java:33)
	at org.gradle.launcher.cli.JavaRuntimeValidationAction.execute(JavaRuntimeValidationAction.java:24)
	at org.gradle.launcher.cli.ExceptionReportingAction.execute(ExceptionReportingAction.java:33)
	at org.gradle.launcher.cli.ExceptionReportingAction.execute(ExceptionReportingAction.java:22)
	at org.gradle.launcher.cli.CommandLineActionFactory$WithLogging.execute(CommandLineActionFactory.java:210)
	at org.gradle.launcher.cli.CommandLineActionFactory$WithLogging.execute(CommandLineActionFactory.java:174)
	at org.gradle.launcher.Main.doAction(Main.java:33)
	at org.gradle.launcher.bootstrap.EntryPoint.run(EntryPoint.java:45)
	at jdk.internal.reflect.NativeMethodAccessorImpl.invoke0(java.base@9-ea/Native Method)
	at jdk.internal.reflect.NativeMethodAccessorImpl.invoke(java.base@9-ea/NativeMethodAccessorImpl.java:62)
	at jdk.internal.reflect.DelegatingMethodAccessorImpl.invoke(java.base@9-ea/DelegatingMethodAccessorImpl.java:43)
	at java.lang.reflect.Method.invoke(java.base@9-ea/Method.java:535)
	at org.gradle.launcher.bootstrap.ProcessBootstrap.runNoExit(ProcessBootstrap.java:60)
	at org.gradle.launcher.bootstrap.ProcessBootstrap.run(ProcessBootstrap.java:37)
	at org.gradle.launcher.GradleMain.main(GradleMain.java:23)
	at jdk.internal.reflect.NativeMethodAccessorImpl.invoke0(java.base@9-ea/Native Method)
	at jdk.internal.reflect.NativeMethodAccessorImpl.invoke(java.base@9-ea/NativeMethodAccessorImpl.java:62)
	at jdk.internal.reflect.DelegatingMethodAccessorImpl.invoke(java.base@9-ea/DelegatingMethodAccessorImpl.java:43)
	at java.lang.reflect.Method.invoke(java.base@9-ea/Method.java:535)
	at org.gradle.wrapper.BootstrapMainStarter.start(BootstrapMainStarter.java:30)
	at org.gradle.wrapper.WrapperExecutor.execute(WrapperExecutor.java:129)
	at org.gradle.wrapper.GradleWrapperMain.main(GradleWrapperMain.java:61)

:org.apache.zest.extensions:org.apache.zest.extension.valueserialization-orgjson:makeVersionClass
:org.apache.zest.extensions:org.apache.zest.extension.valueserialization-orgjson:compileVersionJava
:org.apache.zest.extensions:org.apache.zest.extension.valueserialization-orgjson:compileJava
:org.apache.zest.extensions:org.apache.zest.extension.valueserialization-orgjson:honkerGenDependencies
:org.apache.zest.extensions:org.apache.zest.extension.valueserialization-orgjson:honkerGenLicense
:org.apache.zest.extensions:org.apache.zest.extension.valueserialization-orgjson:honkerGenNotice
:org.apache.zest.extensions:org.apache.zest.extension.valueserialization-orgjson:processResources
UP-TO-DATE
:org.apache.zest.extensions:org.apache.zest.extension.valueserialization-orgjson:classes
:org.apache.zest.extensions:org.apache.zest.extension.valueserialization-orgjson:processVersionResources
UP-TO-DATE
:org.apache.zest.extensions:org.apache.zest.extension.valueserialization-orgjson:versionClasses
:org.apache.zest.extensions:org.apache.zest.extension.valueserialization-orgjson:jarjava.lang.NullPointerException
java.lang.NullPointerException
java.lang.NullPointerException

:org.apache.zest.core:org.apache.zest.core.api:compileTestJavaNote: Some input files use unchecked
or unsafe operations.
Note: Recompile with -Xlint:unchecked for details.

:org.apache.zest.core:org.apache.zest.core.api:processTestResources
:org.apache.zest.core:org.apache.zest.core.api:testClasses
:org.apache.zest.core:org.apache.zest.core.api:test
:org.apache.zest.core:org.apache.zest.core.bootstrap:compileTestJava
:org.apache.zest.core:org.apache.zest.core.bootstrap:processTestResources UP-TO-DATE
:org.apache.zest.core:org.apache.zest.core.bootstrap:testClasses
:org.apache.zest.core:org.apache.zest.core.bootstrap:test
:org.apache.zest.core:org.apache.zest.core.functional:compileTestJava
:org.apache.zest.core:org.apache.zest.core.functional:processTestResources UP-TO-DATE
:org.apache.zest.core:org.apache.zest.core.functional:testClasses
:org.apache.zest.core:org.apache.zest.core.functional:test
:org.apache.zest.core:org.apache.zest.core.io:compileTestJava
:org.apache.zest.core:org.apache.zest.core.io:processTestResources
:org.apache.zest.core:org.apache.zest.core.io:testClasses
:org.apache.zest.core:org.apache.zest.core.io:test
:org.apache.zest.core:org.apache.zest.core.runtime:compileTestJava<https://builds.apache.org/job/Zest(JavaEdition)-develop-java9-check/ws/core/runtime/src/test/java/org/apache/zest/test/SomeMixin.java>:46:
warning: [deprecation] Double(double) in Double has been deprecated
        bar( 1.0, true, 1.0F, 'x', 0, 0L, (short) 0, (byte) 3, new Double( 4F ), new Object[
0 ], new int[ 0 ] );
                                                               ^
<https://builds.apache.org/job/Zest(JavaEdition)-develop-java9-check/ws/core/runtime/src/test/java/org/apache/zest/runtime/property/PropertyEqualityTest.java>:201:
warning: [deprecation] Character(char) in Character has been deprecated
                    new Character( 'q' ).hashCode(),
                    ^
<https://builds.apache.org/job/Zest(JavaEdition)-develop-java9-check/ws/core/runtime/src/test/java/org/apache/zest/runtime/composite/QI256Test.java>:162:
warning: [deprecation] newInstance() in Class has been deprecated
                    throw clazz.newInstance();
                               ^
  where T is a type-variable:
    T extends Object declared in class Class
<https://builds.apache.org/job/Zest(JavaEdition)-develop-java9-check/ws/core/runtime/src/test/java/org/apache/zest/runtime/composite/QI256Test.java>:178:
warning: [deprecation] newInstance() in Class has been deprecated
                    throw clazz.newInstance();
                               ^
  where T is a type-variable:
    T extends Object declared in class Class
<https://builds.apache.org/job/Zest(JavaEdition)-develop-java9-check/ws/core/runtime/src/test/java/org/apache/zest/runtime/composite/QI256Test.java>:194:
warning: [deprecation] newInstance() in Class has been deprecated
                    throw clazz.newInstance();
                               ^
  where T is a type-variable:
    T extends Object declared in class Class
<https://builds.apache.org/job/Zest(JavaEdition)-develop-java9-check/ws/core/runtime/src/test/java/org/apache/zest/runtime/injection/ServiceInjectionTest.java>:93:
warning: [deprecation] Long(long) in Long has been deprecated
        assertEquals( new Long( 1L ), user.testLongIterable() );
                      ^
Note: Some input files use unchecked or unsafe operations.
Note: Recompile with -Xlint:unchecked for details.
6 warnings

:org.apache.zest.core:org.apache.zest.core.runtime:processTestResources
:org.apache.zest.core:org.apache.zest.core.runtime:testClasses
:org.apache.zest.core:org.apache.zest.core.runtime:test

org.apache.zest.test.composite.CleanStackTraceTest > cleanStackTraceOnApplicationException
FAILED
    org.junit.ComparisonFailure at CleanStackTraceTest.java:105

org.apache.zest.test.ASMTest > generateASM FAILED
    java.lang.IllegalArgumentException at ASMTest.java:52

org.apache.zest.runtime.composite.FunctionalListTest > givenArrayListWithMapOpCapabilityWhenMappingIntegerToStringExpectCorrectResult
FAILED
    org.apache.zest.bootstrap.AssemblyException
        Caused by: java.lang.NullPointerException

org.apache.zest.runtime.mixin.JDKMixinTest > testMixinExtendsJDK FAILED
    org.apache.zest.bootstrap.AssemblyException
        Caused by: java.lang.NullPointerException

org.apache.zest.runtime.mixin.JDKMixinTest > testComposeJDKMixin FAILED
    org.apache.zest.bootstrap.AssemblyException
        Caused by: java.lang.NullPointerException

692 tests completed, 5 failed, 14 skipped
:org.apache.zest.core:org.apache.zest.core.runtime:test FAILED

FAILURE: Build failed with an exception.

* What went wrong:
Execution failed for task ':org.apache.zest.core:org.apache.zest.core.runtime:test'.
> There were failing tests. See the report at: file://<https://builds.apache.org/job/Zest(JavaEdition)-develop-java9-check/ws/core/runtime/build/reports/tests/test/index.html>

* Try:
Run with --stacktrace option to get the stack trace. Run with --info or --debug option to
get more log output.

BUILD FAILED

Total time: 2 mins 12.066 secs
Build step 'Invoke Gradle script' changed build result to FAILURE
Build step 'Invoke Gradle script' marked build as failure
Recording test results

Mime
View raw message