polygene-dev mailing list archives

Site index · List index
Message view « Date » · « Thread »
Top « Date » · « Thread »
From Apache Jenkins Server <jenk...@builds.apache.org>
Subject Build failed in Jenkins: Zest(JavaEdition)-develop-java8-check #212
Date Sun, 06 Nov 2016 19:04:45 GMT
See <https://builds.apache.org/job/Zest(JavaEdition)-develop-java8-check/212/>

------------------------------------------
[...truncated 814 lines...]
:org.apache.zest.extensions:org.apache.zest.extension.migration:honkerGenLicense
:org.apache.zest.extensions:org.apache.zest.extension.migration:honkerGenNotice
:org.apache.zest.extensions:org.apache.zest.extension.migration:processResources UP-TO-DATE
:org.apache.zest.extensions:org.apache.zest.extension.migration:classes
:org.apache.zest.extensions:org.apache.zest.extension.migration:compileTestJava
:org.apache.zest.extensions:org.apache.zest.extension.migration:processTestResources UP-TO-DATE
:org.apache.zest.extensions:org.apache.zest.extension.migration:testClasses
:org.apache.zest.extensions:org.apache.zest.extension.migration:test
:org.apache.zest.extensions:org.apache.zest.extension.indexing-rdf:processVersionResources
UP-TO-DATE
:org.apache.zest.extensions:org.apache.zest.extension.indexing-rdf:versionClasses
:org.apache.zest.extensions:org.apache.zest.extension.indexing-rdf:jar
:org.apache.zest.extensions:org.apache.zest.extension.reindexer:compileTestJava
:org.apache.zest.extensions:org.apache.zest.extension.reindexer:processTestResources
:org.apache.zest.extensions:org.apache.zest.extension.reindexer:testClasses
:org.apache.zest.extensions:org.apache.zest.extension.reindexer:test
:org.apache.zest.extensions:org.apache.zest.extension.valueserialization-jackson:makeVersionClass
:org.apache.zest.extensions:org.apache.zest.extension.valueserialization-jackson:compileVersionJava
:org.apache.zest.extensions:org.apache.zest.extension.valueserialization-jackson:compileJava
:org.apache.zest.extensions:org.apache.zest.extension.valueserialization-jackson:honkerGenDependencies
:org.apache.zest.extensions:org.apache.zest.extension.valueserialization-jackson:honkerGenLicense
:org.apache.zest.extensions:org.apache.zest.extension.valueserialization-jackson:honkerGenNotice
:org.apache.zest.extensions:org.apache.zest.extension.valueserialization-jackson:processResources
UP-TO-DATE
:org.apache.zest.extensions:org.apache.zest.extension.valueserialization-jackson:classes
:org.apache.zest.extensions:org.apache.zest.extension.valueserialization-jackson:compileTestJava
:org.apache.zest.extensions:org.apache.zest.extension.valueserialization-jackson:processTestResources
:org.apache.zest.extensions:org.apache.zest.extension.valueserialization-jackson:testClasses
:org.apache.zest.extensions:org.apache.zest.extension.valueserialization-jackson:test
:org.apache.zest.extensions:org.apache.zest.extension.valueserialization-orgjson:compileTestJava
:org.apache.zest.extensions:org.apache.zest.extension.valueserialization-orgjson:processTestResources
:org.apache.zest.extensions:org.apache.zest.extension.valueserialization-orgjson:testClasses
:org.apache.zest.extensions:org.apache.zest.extension.valueserialization-orgjson:test
:org.apache.zest.extensions:org.apache.zest.extension.valueserialization-stax:makeVersionClass
:org.apache.zest.extensions:org.apache.zest.extension.valueserialization-stax:compileVersionJava
:org.apache.zest.extensions:org.apache.zest.extension.valueserialization-stax:compileJava<https://builds.apache.org/job/Zest(JavaEdition)-develop-java8-check/ws/extensions/valueserialization-stax/src/main/java/org/apache/zest/valueserialization/stax/StaxValueSerializer.java>:124:
warning: [deprecation] escapeXml(String) in StringEscapeUtils has been deprecated
            output.writeCharacters( StringEscapeUtils.escapeXml( value.toString() ) );
                                                     ^
1 warning

:org.apache.zest.extensions:org.apache.zest.extension.valueserialization-stax:honkerGenDependencies
:org.apache.zest.extensions:org.apache.zest.extension.valueserialization-stax:honkerGenLicense
:org.apache.zest.extensions:org.apache.zest.extension.valueserialization-stax:honkerGenNotice
:org.apache.zest.extensions:org.apache.zest.extension.valueserialization-stax:processResources
UP-TO-DATE
:org.apache.zest.extensions:org.apache.zest.extension.valueserialization-stax:classes
:org.apache.zest.extensions:org.apache.zest.extension.valueserialization-stax:compileTestJava
:org.apache.zest.extensions:org.apache.zest.extension.valueserialization-stax:processTestResources
:org.apache.zest.extensions:org.apache.zest.extension.valueserialization-stax:testClasses
:org.apache.zest.extensions:org.apache.zest.extension.valueserialization-stax:test
:org.apache.zest.libraries:org.apache.zest.library.alarm:makeVersionClass
:org.apache.zest.libraries:org.apache.zest.library.alarm:compileVersionJava
:org.apache.zest.libraries:org.apache.zest.library.alarm:compileJava
:org.apache.zest.libraries:org.apache.zest.library.alarm:honkerGenDependencies
:org.apache.zest.libraries:org.apache.zest.library.alarm:honkerGenLicense
:org.apache.zest.libraries:org.apache.zest.library.alarm:honkerGenNotice
:org.apache.zest.libraries:org.apache.zest.library.alarm:processResources
:org.apache.zest.libraries:org.apache.zest.library.alarm:classes
:org.apache.zest.libraries:org.apache.zest.library.alarm:compileTestJava
:org.apache.zest.libraries:org.apache.zest.library.alarm:processTestResources
:org.apache.zest.libraries:org.apache.zest.library.alarm:testClasses
:org.apache.zest.libraries:org.apache.zest.library.alarm:test
:org.apache.zest.libraries:org.apache.zest.library.circuitbreaker:compileTestJavaNote: Some
input files use unchecked or unsafe operations.
Note: Recompile with -Xlint:unchecked for details.

:org.apache.zest.libraries:org.apache.zest.library.circuitbreaker:processTestResources UP-TO-DATE
:org.apache.zest.libraries:org.apache.zest.library.circuitbreaker:testClasses
:org.apache.zest.libraries:org.apache.zest.library.circuitbreaker:test
:org.apache.zest.libraries:org.apache.zest.library.constraints:compileTestJava
:org.apache.zest.libraries:org.apache.zest.library.constraints:processTestResources UP-TO-DATE
:org.apache.zest.libraries:org.apache.zest.library.constraints:testClasses
:org.apache.zest.libraries:org.apache.zest.library.constraints:test
:org.apache.zest.libraries:org.apache.zest.library.fileconfig:compileTestJava
:org.apache.zest.libraries:org.apache.zest.library.fileconfig:processTestResources UP-TO-DATE
:org.apache.zest.libraries:org.apache.zest.library.fileconfig:testClasses
:org.apache.zest.libraries:org.apache.zest.library.fileconfig:test
:org.apache.zest.libraries:org.apache.zest.library.http:makeVersionClass
:org.apache.zest.libraries:org.apache.zest.library.http:compileVersionJava
:org.apache.zest.libraries:org.apache.zest.library.http:compileJava
:org.apache.zest.libraries:org.apache.zest.library.http:honkerGenDependencies
:org.apache.zest.libraries:org.apache.zest.library.http:honkerGenLicense
:org.apache.zest.libraries:org.apache.zest.library.http:honkerGenNotice
:org.apache.zest.libraries:org.apache.zest.library.http:processResources UP-TO-DATE
:org.apache.zest.libraries:org.apache.zest.library.http:classes
:org.apache.zest.libraries:org.apache.zest.library.http:compileTestJava
:org.apache.zest.libraries:org.apache.zest.library.http:processTestResources
:org.apache.zest.libraries:org.apache.zest.library.http:testClasses
:org.apache.zest.libraries:org.apache.zest.library.http:test
:org.apache.zest.libraries:org.apache.zest.library.invocation-cache:makeVersionClass
:org.apache.zest.libraries:org.apache.zest.library.invocation-cache:compileVersionJava
:org.apache.zest.libraries:org.apache.zest.library.invocation-cache:compileJava
:org.apache.zest.libraries:org.apache.zest.library.invocation-cache:honkerGenDependencies
:org.apache.zest.libraries:org.apache.zest.library.invocation-cache:honkerGenLicense
:org.apache.zest.libraries:org.apache.zest.library.invocation-cache:honkerGenNotice
:org.apache.zest.libraries:org.apache.zest.library.invocation-cache:processResources UP-TO-DATE
:org.apache.zest.libraries:org.apache.zest.library.invocation-cache:classes
:org.apache.zest.libraries:org.apache.zest.library.invocation-cache:compileTestJava
:org.apache.zest.libraries:org.apache.zest.library.invocation-cache:processTestResources UP-TO-DATE
:org.apache.zest.libraries:org.apache.zest.library.invocation-cache:testClasses
:org.apache.zest.libraries:org.apache.zest.library.invocation-cache:test
:org.apache.zest.libraries:org.apache.zest.library.jmx:compileTestJava
:org.apache.zest.libraries:org.apache.zest.library.jmx:processTestResources UP-TO-DATE
:org.apache.zest.libraries:org.apache.zest.library.jmx:testClasses
:org.apache.zest.libraries:org.apache.zest.library.jmx:test
:org.apache.zest.libraries:org.apache.zest.library.lang-groovy:makeVersionClass
:org.apache.zest.libraries:org.apache.zest.library.lang-groovy:compileVersionJava
:org.apache.zest.libraries:org.apache.zest.library.lang-groovy:compileJava
:org.apache.zest.libraries:org.apache.zest.library.lang-groovy:compileGroovy UP-TO-DATE
:org.apache.zest.libraries:org.apache.zest.library.lang-groovy:honkerGenDependencies
:org.apache.zest.libraries:org.apache.zest.library.lang-groovy:honkerGenLicense
:org.apache.zest.libraries:org.apache.zest.library.lang-groovy:honkerGenNotice
:org.apache.zest.libraries:org.apache.zest.library.lang-groovy:processResources UP-TO-DATE
:org.apache.zest.libraries:org.apache.zest.library.lang-groovy:classes
:org.apache.zest.libraries:org.apache.zest.library.lang-groovy:compileTestJava UP-TO-DATE
:org.apache.zest.libraries:org.apache.zest.library.lang-groovy:compileTestGroovy
:org.apache.zest.libraries:org.apache.zest.library.lang-groovy:processTestResources
:org.apache.zest.libraries:org.apache.zest.library.lang-groovy:testClasses
:org.apache.zest.libraries:org.apache.zest.library.lang-groovy:test
:org.apache.zest.libraries:org.apache.zest.library.lang-javascript:makeVersionClass
:org.apache.zest.libraries:org.apache.zest.library.lang-javascript:compileVersionJava
:org.apache.zest.libraries:org.apache.zest.library.scripting:makeVersionClass
:org.apache.zest.libraries:org.apache.zest.library.scripting:compileVersionJava
:org.apache.zest.libraries:org.apache.zest.library.scripting:compileJava
:org.apache.zest.libraries:org.apache.zest.library.scripting:honkerGenDependencies
:org.apache.zest.libraries:org.apache.zest.library.scripting:honkerGenLicense
:org.apache.zest.libraries:org.apache.zest.library.scripting:honkerGenNotice
:org.apache.zest.libraries:org.apache.zest.library.scripting:processResources UP-TO-DATE
:org.apache.zest.libraries:org.apache.zest.library.scripting:classes
:org.apache.zest.libraries:org.apache.zest.library.scripting:processVersionResources UP-TO-DATE
:org.apache.zest.libraries:org.apache.zest.library.scripting:versionClasses
:org.apache.zest.libraries:org.apache.zest.library.scripting:jar
:org.apache.zest.libraries:org.apache.zest.library.lang-javascript:compileJava
:org.apache.zest.libraries:org.apache.zest.library.lang-javascript:honkerGenDependencies
:org.apache.zest.libraries:org.apache.zest.library.lang-javascript:honkerGenLicense
:org.apache.zest.libraries:org.apache.zest.library.lang-javascript:honkerGenNotice
:org.apache.zest.libraries:org.apache.zest.library.lang-javascript:processResources UP-TO-DATE
:org.apache.zest.libraries:org.apache.zest.library.lang-javascript:classes
:org.apache.zest.libraries:org.apache.zest.library.lang-javascript:compileTestJava
:org.apache.zest.libraries:org.apache.zest.library.lang-javascript:processTestResources
:org.apache.zest.libraries:org.apache.zest.library.lang-javascript:testClasses
:org.apache.zest.libraries:org.apache.zest.library.lang-javascript:test
:org.apache.zest.libraries:org.apache.zest.library.locking:compileTestJava
:org.apache.zest.libraries:org.apache.zest.library.locking:processTestResources UP-TO-DATE
:org.apache.zest.libraries:org.apache.zest.library.locking:testClasses
:org.apache.zest.libraries:org.apache.zest.library.locking:test
:org.apache.zest.libraries:org.apache.zest.library.logging:compileTestJava
:org.apache.zest.libraries:org.apache.zest.library.logging:processTestResources
:org.apache.zest.libraries:org.apache.zest.library.logging:testClasses
:org.apache.zest.libraries:org.apache.zest.library.logging:test
:org.apache.zest.extensions:org.apache.zest.extension.metrics-yammer:processVersionResources
UP-TO-DATE
:org.apache.zest.extensions:org.apache.zest.extension.metrics-yammer:versionClasses
:org.apache.zest.extensions:org.apache.zest.extension.metrics-yammer:jar
:org.apache.zest.libraries:org.apache.zest.library.metrics:makeVersionClass
:org.apache.zest.libraries:org.apache.zest.library.metrics:compileVersionJava
:org.apache.zest.libraries:org.apache.zest.library.metrics:compileJava
:org.apache.zest.libraries:org.apache.zest.library.metrics:honkerGenDependencies
:org.apache.zest.libraries:org.apache.zest.library.metrics:honkerGenLicense
:org.apache.zest.libraries:org.apache.zest.library.metrics:honkerGenNotice
:org.apache.zest.libraries:org.apache.zest.library.metrics:processResources UP-TO-DATE
:org.apache.zest.libraries:org.apache.zest.library.metrics:classes
:org.apache.zest.libraries:org.apache.zest.library.metrics:compileTestJava
:org.apache.zest.libraries:org.apache.zest.library.metrics:processTestResources UP-TO-DATE
:org.apache.zest.libraries:org.apache.zest.library.metrics:testClasses
:org.apache.zest.libraries:org.apache.zest.library.metrics:test
:org.apache.zest.libraries:org.apache.zest.library.osgi:makeVersionClass
:org.apache.zest.libraries:org.apache.zest.library.osgi:compileVersionJava
:org.apache.zest.libraries:org.apache.zest.library.osgi:compileJava
:org.apache.zest.libraries:org.apache.zest.library.osgi:honkerGenDependencies
:org.apache.zest.libraries:org.apache.zest.library.osgi:honkerGenLicense
:org.apache.zest.libraries:org.apache.zest.library.osgi:honkerGenNotice
:org.apache.zest.libraries:org.apache.zest.library.osgi:processResources UP-TO-DATE
:org.apache.zest.libraries:org.apache.zest.library.osgi:classes
:org.apache.zest.libraries:org.apache.zest.library.osgi:compileTestJava
Download https://repo1.maven.org/maven2/org/mockito/mockito-core/2.2.9/mockito-core-2.2.9.jar
Download https://repo1.maven.org/maven2/net/bytebuddy/byte-buddy/1.5.0/byte-buddy-1.5.0.jar
Download https://repo1.maven.org/maven2/net/bytebuddy/byte-buddy-agent/1.5.0/byte-buddy-agent-1.5.0.jar
Download https://repo1.maven.org/maven2/org/objenesis/objenesis/2.4/objenesis-2.4.jar
:org.apache.zest.libraries:org.apache.zest.library.osgi:processTestResources UP-TO-DATE
:org.apache.zest.libraries:org.apache.zest.library.osgi:testClasses
:org.apache.zest.libraries:org.apache.zest.library.osgi:test
:org.apache.zest.libraries:org.apache.zest.library.rdf:compileTestJava
:org.apache.zest.libraries:org.apache.zest.library.rdf:processTestResources
:org.apache.zest.libraries:org.apache.zest.library.rdf:testClasses
:org.apache.zest.libraries:org.apache.zest.library.rdf:test
:org.apache.zest.libraries:org.apache.zest.library.http:processVersionResources UP-TO-DATE
:org.apache.zest.libraries:org.apache.zest.library.http:versionClasses
:org.apache.zest.libraries:org.apache.zest.library.http:jar
:org.apache.zest.libraries:org.apache.zest.library.rest:makeVersionClass
:org.apache.zest.libraries:org.apache.zest.library.rest:compileVersionJava
:org.apache.zest.libraries:org.apache.zest.library.rest:compileJava<https://builds.apache.org/job/Zest(JavaEdition)-develop-java8-check/ws/libraries/rest/src/main/java/org/apache/zest/library/rest/admin/SPARQLResource.java>:145:
warning: [deprecation] QueryResultUtil in org.openrdf.query has been deprecated
                                QueryResultUtil.report( queryResult, qrWriter );
                                ^
<https://builds.apache.org/job/Zest(JavaEdition)-develop-java8-check/ws/libraries/rest/src/main/java/org/apache/zest/library/rest/admin/SPARQLResource.java>:176:
warning: [deprecation] QueryResultUtil in org.openrdf.query has been deprecated
                                QueryResultUtil.report( queryResult, qrWriter );
                                ^
<https://builds.apache.org/job/Zest(JavaEdition)-develop-java8-check/ws/libraries/rest/src/main/java/org/apache/zest/library/rest/admin/SPARQLResource.java>:207:
warning: [deprecation] QueryResultUtil in org.openrdf.query has been deprecated
                                QueryResultUtil.report( queryResult, qrWriter );
                                ^
3 warnings

:org.apache.zest.libraries:org.apache.zest.library.rest:honkerGenDependencies
:org.apache.zest.libraries:org.apache.zest.library.rest:honkerGenLicense
:org.apache.zest.libraries:org.apache.zest.library.rest:honkerGenNotice
:org.apache.zest.libraries:org.apache.zest.library.rest:processResources
:org.apache.zest.libraries:org.apache.zest.library.rest:classes
:org.apache.zest.libraries:org.apache.zest.library.rest:compileTestJava
:org.apache.zest.libraries:org.apache.zest.library.rest:processTestResources UP-TO-DATE
:org.apache.zest.libraries:org.apache.zest.library.rest:testClasses
:org.apache.zest.libraries:org.apache.zest.library.rest:test

org.apache.zest.library.rest.admin.RestTest > givenExistingEntitiesWhenExecutingGetCommandThenExpectTheCorrectRdf
FAILED
    org.apache.zest.api.activation.ActivationException at RestTest.java:125
        Caused by: org.apache.zest.api.service.ServiceUnavailableException at RestTest.java:125
            Caused by: org.apache.zest.api.activation.ActivationException at RestTest.java:125
                Caused by: java.net.BindException at RestTest.java:125

org.apache.zest.library.rest.admin.RestTest > givenExistingIdentityWhenExecutingPutCommandThenNewValuesInEntity
FAILED
    org.apache.zest.api.activation.ActivationException at RestTest.java:125
        Caused by: org.apache.zest.api.service.ServiceUnavailableException at RestTest.java:125
            Caused by: org.apache.zest.api.activation.ActivationException at RestTest.java:125
                Caused by: java.net.BindException at RestTest.java:125

org.apache.zest.library.rest.admin.RestTest > givenExistingIdentityWhenExecutingDeleteCommandThenEntityIsRemoved
FAILED
    org.apache.zest.api.activation.ActivationException at RestTest.java:125
        Caused by: org.apache.zest.api.service.ServiceUnavailableException at RestTest.java:125
            Caused by: org.apache.zest.api.activation.ActivationException at RestTest.java:125
                Caused by: java.net.BindException at RestTest.java:125

org.apache.zest.library.rest.admin.RestTest > givenAnIdentityWhenExecutingGetCommandThenExpectTheCorrectRdf
FAILED
    org.apache.zest.api.activation.ActivationException at RestTest.java:125
        Caused by: org.apache.zest.api.service.ServiceUnavailableException at RestTest.java:125
            Caused by: org.apache.zest.api.activation.ActivationException at RestTest.java:125
                Caused by: java.net.BindException at RestTest.java:125

4 tests completed, 4 failed
:org.apache.zest.libraries:org.apache.zest.library.rest:test FAILED

FAILURE: Build failed with an exception.

* What went wrong:
Execution failed for task ':org.apache.zest.libraries:org.apache.zest.library.rest:test'.
> There were failing tests. See the report at: file://<https://builds.apache.org/job/Zest(JavaEdition)-develop-java8-check/ws/libraries/rest/build/reports/tests/test/index.html>

* Try:
Run with --stacktrace option to get the stack trace. Run with --info or --debug option to
get more log output.

BUILD FAILED

Total time: 21 mins 15.777 secs
Build step 'Invoke Gradle script' changed build result to FAILURE
Build step 'Invoke Gradle script' marked build as failure
Recording test results

Mime
View raw message