polygene-dev mailing list archives

Site index · List index
Message view « Date » · « Thread »
Top « Date » · « Thread »
From Apache Jenkins Server <jenk...@builds.apache.org>
Subject Build failed in Jenkins: Zest(JavaEdition)-develop-java8-check #211
Date Sun, 06 Nov 2016 17:50:49 GMT
See <https://builds.apache.org/job/Zest(JavaEdition)-develop-java8-check/211/changes>

Changes:

[paulmerlin] Remove now unused Wicket dependency declaration

[paulmerlin] Minor libraries upgrades

[paulmerlin] build: remove idea plugin as Gradle project import works out of the box

[paulmerlin] build: remove eclipse plugin as Gradle project import works out of the

[paulmerlin] build: remove custom wrapper task, this is not needed anymore

[paulmerlin] build: prefer httpS repositories when possible

[paulmerlin] build: remove provided configuration, Gradle now provide compileOnly

[paulmerlin] build: remove old hack to continue on test failures

[paulmerlin] build: remove unused task

[paulmerlin] build: remove some now not needed groovy flags

[paulmerlin] build: fix restlet maven repository url

[paulmerlin] build: remove unused project extra property

[paulmerlin] build: groovy @CompileStatic buildSrc

[paulmerlin] build: remove unnecessary output

[paulmerlin] build: fix asciidoc snippet filter tag matching

[paulmerlin] doc: fix various snippet tags

------------------------------------------
[...truncated 793 lines...]
:org.apache.zest.extensions:org.apache.zest.extension.indexing-solr:makeVersionClass
:org.apache.zest.extensions:org.apache.zest.extension.indexing-solr:compileVersionJava
:org.apache.zest.extensions:org.apache.zest.extension.indexing-solr:compileJava<https://builds.apache.org/job/Zest(JavaEdition)-develop-java8-check/ws/extensions/indexing-solr/src/main/java/org/apache/zest/index/solr/internal/SolrEntityIndexerMixin.java>:49:
warning: [deprecation] GraphImpl in org.openrdf.model.impl has been deprecated
import org.openrdf.model.impl.GraphImpl;
                             ^
<https://builds.apache.org/job/Zest(JavaEdition)-develop-java8-check/ws/extensions/indexing-solr/src/main/java/org/apache/zest/index/solr/EmbeddedSolrService.java>:119:
warning: [deprecation] config in SolrConfig has been deprecated
         SolrConfig.config = null;
                   ^
<https://builds.apache.org/job/Zest(JavaEdition)-develop-java8-check/ws/extensions/indexing-solr/src/main/java/org/apache/zest/index/solr/internal/SolrEntityIndexerMixin.java>:156:
warning: [deprecation] GraphImpl in org.openrdf.model.impl has been deprecated
        Graph graph = new GraphImpl();
                          ^
<https://builds.apache.org/job/Zest(JavaEdition)-develop-java8-check/ws/extensions/indexing-solr/src/main/java/org/apache/zest/index/solr/internal/SolrEntityIndexerMixin.java>:201:
warning: [deprecation] match(Resource,URI,Value,Resource...) in Graph has been deprecated
                    Iterator<Statement> seq = graph.match( resource, uri, null, (Resource)
null );
                                                   ^
4 warnings

:org.apache.zest.extensions:org.apache.zest.extension.indexing-solr:honkerGenDependencies
:org.apache.zest.extensions:org.apache.zest.extension.indexing-solr:honkerGenLicense
:org.apache.zest.extensions:org.apache.zest.extension.indexing-solr:honkerGenNotice
:org.apache.zest.extensions:org.apache.zest.extension.indexing-solr:processResources UP-TO-DATE
:org.apache.zest.extensions:org.apache.zest.extension.indexing-solr:classes
:org.apache.zest.extensions:org.apache.zest.extension.indexing-solr:compileTestJava
:org.apache.zest.extensions:org.apache.zest.extension.indexing-solr:processTestResources
:org.apache.zest.extensions:org.apache.zest.extension.indexing-solr:testClasses
:org.apache.zest.extensions:org.apache.zest.extension.indexing-solr:test
:org.apache.zest.extensions:org.apache.zest.extension.indexing-sql:makeVersionClass
:org.apache.zest.extensions:org.apache.zest.extension.indexing-sql:compileVersionJava
:org.apache.zest.extensions:org.apache.zest.extension.reindexer:makeVersionClass
:org.apache.zest.extensions:org.apache.zest.extension.reindexer:compileVersionJava
:org.apache.zest.extensions:org.apache.zest.extension.reindexer:compileJava
:org.apache.zest.extensions:org.apache.zest.extension.reindexer:honkerGenDependencies
:org.apache.zest.extensions:org.apache.zest.extension.reindexer:honkerGenLicense
:org.apache.zest.extensions:org.apache.zest.extension.reindexer:honkerGenNotice
:org.apache.zest.extensions:org.apache.zest.extension.reindexer:processResources UP-TO-DATE
:org.apache.zest.extensions:org.apache.zest.extension.reindexer:classes
:org.apache.zest.extensions:org.apache.zest.extension.reindexer:processVersionResources UP-TO-DATE
:org.apache.zest.extensions:org.apache.zest.extension.reindexer:versionClasses
:org.apache.zest.extensions:org.apache.zest.extension.reindexer:jar
:org.apache.zest.extensions:org.apache.zest.extension.indexing-sql:compileJavaNote: <https://builds.apache.org/job/Zest(JavaEdition)-develop-java8-check/ws/extensions/indexing-sql/src/main/java/org/apache/zest/index/sql/support/skeletons/AbstractSQLStartup.java>
uses unchecked or unsafe operations.
Note: Recompile with -Xlint:unchecked for details.

:org.apache.zest.extensions:org.apache.zest.extension.indexing-sql:honkerGenDependencies
:org.apache.zest.extensions:org.apache.zest.extension.indexing-sql:honkerGenLicense
:org.apache.zest.extensions:org.apache.zest.extension.indexing-sql:honkerGenNotice
:org.apache.zest.extensions:org.apache.zest.extension.indexing-sql:processResources UP-TO-DATE
:org.apache.zest.extensions:org.apache.zest.extension.indexing-sql:classes
:org.apache.zest.extensions:org.apache.zest.extension.indexing-sql:compileTestJava
:org.apache.zest.extensions:org.apache.zest.extension.indexing-sql:processTestResources
:org.apache.zest.extensions:org.apache.zest.extension.indexing-sql:testClasses
:org.apache.zest.extensions:org.apache.zest.extension.indexing-sql:test
:org.apache.zest.extensions:org.apache.zest.extension.metrics-yammer:makeVersionClass
:org.apache.zest.extensions:org.apache.zest.extension.metrics-yammer:compileVersionJava
:org.apache.zest.extensions:org.apache.zest.extension.metrics-yammer:compileJava
:org.apache.zest.extensions:org.apache.zest.extension.metrics-yammer:honkerGenDependencies
:org.apache.zest.extensions:org.apache.zest.extension.metrics-yammer:honkerGenLicense
:org.apache.zest.extensions:org.apache.zest.extension.metrics-yammer:honkerGenNotice
:org.apache.zest.extensions:org.apache.zest.extension.metrics-yammer:processResources UP-TO-DATE
:org.apache.zest.extensions:org.apache.zest.extension.metrics-yammer:classes
:org.apache.zest.extensions:org.apache.zest.extension.metrics-yammer:compileTestJava
:org.apache.zest.extensions:org.apache.zest.extension.metrics-yammer:processTestResources
UP-TO-DATE
:org.apache.zest.extensions:org.apache.zest.extension.metrics-yammer:testClasses
:org.apache.zest.extensions:org.apache.zest.extension.metrics-yammer:test
:org.apache.zest.extensions:org.apache.zest.extension.migration:makeVersionClass
:org.apache.zest.extensions:org.apache.zest.extension.migration:compileVersionJava
:org.apache.zest.extensions:org.apache.zest.extension.migration:compileJava
:org.apache.zest.extensions:org.apache.zest.extension.migration:honkerGenDependencies
:org.apache.zest.extensions:org.apache.zest.extension.migration:honkerGenLicense
:org.apache.zest.extensions:org.apache.zest.extension.migration:honkerGenNotice
:org.apache.zest.extensions:org.apache.zest.extension.migration:processResources UP-TO-DATE
:org.apache.zest.extensions:org.apache.zest.extension.migration:classes
:org.apache.zest.extensions:org.apache.zest.extension.migration:compileTestJava
:org.apache.zest.extensions:org.apache.zest.extension.migration:processTestResources UP-TO-DATE
:org.apache.zest.extensions:org.apache.zest.extension.migration:testClasses
:org.apache.zest.extensions:org.apache.zest.extension.migration:test
:org.apache.zest.extensions:org.apache.zest.extension.indexing-rdf:processVersionResources
UP-TO-DATE
:org.apache.zest.extensions:org.apache.zest.extension.indexing-rdf:versionClasses
:org.apache.zest.extensions:org.apache.zest.extension.indexing-rdf:jar
:org.apache.zest.extensions:org.apache.zest.extension.reindexer:compileTestJava
:org.apache.zest.extensions:org.apache.zest.extension.reindexer:processTestResources
:org.apache.zest.extensions:org.apache.zest.extension.reindexer:testClasses
:org.apache.zest.extensions:org.apache.zest.extension.reindexer:test
:org.apache.zest.extensions:org.apache.zest.extension.valueserialization-jackson:makeVersionClass
:org.apache.zest.extensions:org.apache.zest.extension.valueserialization-jackson:compileVersionJava
:org.apache.zest.extensions:org.apache.zest.extension.valueserialization-jackson:compileJava
:org.apache.zest.extensions:org.apache.zest.extension.valueserialization-jackson:honkerGenDependencies
:org.apache.zest.extensions:org.apache.zest.extension.valueserialization-jackson:honkerGenLicense
:org.apache.zest.extensions:org.apache.zest.extension.valueserialization-jackson:honkerGenNotice
:org.apache.zest.extensions:org.apache.zest.extension.valueserialization-jackson:processResources
UP-TO-DATE
:org.apache.zest.extensions:org.apache.zest.extension.valueserialization-jackson:classes
:org.apache.zest.extensions:org.apache.zest.extension.valueserialization-jackson:compileTestJava
:org.apache.zest.extensions:org.apache.zest.extension.valueserialization-jackson:processTestResources
:org.apache.zest.extensions:org.apache.zest.extension.valueserialization-jackson:testClasses
:org.apache.zest.extensions:org.apache.zest.extension.valueserialization-jackson:test
:org.apache.zest.extensions:org.apache.zest.extension.valueserialization-orgjson:compileTestJava
:org.apache.zest.extensions:org.apache.zest.extension.valueserialization-orgjson:processTestResources
:org.apache.zest.extensions:org.apache.zest.extension.valueserialization-orgjson:testClasses
:org.apache.zest.extensions:org.apache.zest.extension.valueserialization-orgjson:test
:org.apache.zest.extensions:org.apache.zest.extension.valueserialization-stax:makeVersionClass
:org.apache.zest.extensions:org.apache.zest.extension.valueserialization-stax:compileVersionJava
:org.apache.zest.extensions:org.apache.zest.extension.valueserialization-stax:compileJava<https://builds.apache.org/job/Zest(JavaEdition)-develop-java8-check/ws/extensions/valueserialization-stax/src/main/java/org/apache/zest/valueserialization/stax/StaxValueSerializer.java>:124:
warning: [deprecation] escapeXml(String) in StringEscapeUtils has been deprecated
            output.writeCharacters( StringEscapeUtils.escapeXml( value.toString() ) );
                                                     ^
1 warning

:org.apache.zest.extensions:org.apache.zest.extension.valueserialization-stax:honkerGenDependencies
:org.apache.zest.extensions:org.apache.zest.extension.valueserialization-stax:honkerGenLicense
:org.apache.zest.extensions:org.apache.zest.extension.valueserialization-stax:honkerGenNotice
:org.apache.zest.extensions:org.apache.zest.extension.valueserialization-stax:processResources
UP-TO-DATE
:org.apache.zest.extensions:org.apache.zest.extension.valueserialization-stax:classes
:org.apache.zest.extensions:org.apache.zest.extension.valueserialization-stax:compileTestJava
:org.apache.zest.extensions:org.apache.zest.extension.valueserialization-stax:processTestResources
:org.apache.zest.extensions:org.apache.zest.extension.valueserialization-stax:testClasses
:org.apache.zest.extensions:org.apache.zest.extension.valueserialization-stax:test
:org.apache.zest.libraries:org.apache.zest.library.alarm:makeVersionClass
:org.apache.zest.libraries:org.apache.zest.library.alarm:compileVersionJava
:org.apache.zest.libraries:org.apache.zest.library.alarm:compileJava
:org.apache.zest.libraries:org.apache.zest.library.alarm:honkerGenDependencies
:org.apache.zest.libraries:org.apache.zest.library.alarm:honkerGenLicense
:org.apache.zest.libraries:org.apache.zest.library.alarm:honkerGenNotice
:org.apache.zest.libraries:org.apache.zest.library.alarm:processResources
:org.apache.zest.libraries:org.apache.zest.library.alarm:classes
:org.apache.zest.libraries:org.apache.zest.library.alarm:compileTestJava
:org.apache.zest.libraries:org.apache.zest.library.alarm:processTestResources
:org.apache.zest.libraries:org.apache.zest.library.alarm:testClasses
:org.apache.zest.libraries:org.apache.zest.library.alarm:test
:org.apache.zest.libraries:org.apache.zest.library.circuitbreaker:compileTestJavaNote: Some
input files use unchecked or unsafe operations.
Note: Recompile with -Xlint:unchecked for details.

:org.apache.zest.libraries:org.apache.zest.library.circuitbreaker:processTestResources UP-TO-DATE
:org.apache.zest.libraries:org.apache.zest.library.circuitbreaker:testClasses
:org.apache.zest.libraries:org.apache.zest.library.circuitbreaker:test
:org.apache.zest.libraries:org.apache.zest.library.constraints:compileTestJava
:org.apache.zest.libraries:org.apache.zest.library.constraints:processTestResources UP-TO-DATE
:org.apache.zest.libraries:org.apache.zest.library.constraints:testClasses
:org.apache.zest.libraries:org.apache.zest.library.constraints:test
:org.apache.zest.libraries:org.apache.zest.library.fileconfig:compileTestJava
:org.apache.zest.libraries:org.apache.zest.library.fileconfig:processTestResources UP-TO-DATE
:org.apache.zest.libraries:org.apache.zest.library.fileconfig:testClasses
:org.apache.zest.libraries:org.apache.zest.library.fileconfig:test
:org.apache.zest.libraries:org.apache.zest.library.http:makeVersionClass
:org.apache.zest.libraries:org.apache.zest.library.http:compileVersionJava
:org.apache.zest.libraries:org.apache.zest.library.http:compileJava
:org.apache.zest.libraries:org.apache.zest.library.http:honkerGenDependencies
:org.apache.zest.libraries:org.apache.zest.library.http:honkerGenLicense
:org.apache.zest.libraries:org.apache.zest.library.http:honkerGenNotice
:org.apache.zest.libraries:org.apache.zest.library.http:processResources UP-TO-DATE
:org.apache.zest.libraries:org.apache.zest.library.http:classes
:org.apache.zest.libraries:org.apache.zest.library.http:compileTestJava
:org.apache.zest.libraries:org.apache.zest.library.http:processTestResources
:org.apache.zest.libraries:org.apache.zest.library.http:testClasses
:org.apache.zest.libraries:org.apache.zest.library.http:test
:org.apache.zest.libraries:org.apache.zest.library.invocation-cache:makeVersionClass
:org.apache.zest.libraries:org.apache.zest.library.invocation-cache:compileVersionJava
:org.apache.zest.libraries:org.apache.zest.library.invocation-cache:compileJava
:org.apache.zest.libraries:org.apache.zest.library.invocation-cache:honkerGenDependencies
:org.apache.zest.libraries:org.apache.zest.library.invocation-cache:honkerGenLicense
:org.apache.zest.libraries:org.apache.zest.library.invocation-cache:honkerGenNotice
:org.apache.zest.libraries:org.apache.zest.library.invocation-cache:processResources UP-TO-DATE
:org.apache.zest.libraries:org.apache.zest.library.invocation-cache:classes
:org.apache.zest.libraries:org.apache.zest.library.invocation-cache:compileTestJava
:org.apache.zest.libraries:org.apache.zest.library.invocation-cache:processTestResources UP-TO-DATE
:org.apache.zest.libraries:org.apache.zest.library.invocation-cache:testClasses
:org.apache.zest.libraries:org.apache.zest.library.invocation-cache:test
:org.apache.zest.libraries:org.apache.zest.library.jmx:compileTestJava
:org.apache.zest.libraries:org.apache.zest.library.jmx:processTestResources UP-TO-DATE
:org.apache.zest.libraries:org.apache.zest.library.jmx:testClasses
:org.apache.zest.libraries:org.apache.zest.library.jmx:test
:org.apache.zest.libraries:org.apache.zest.library.lang-groovy:makeVersionClass
:org.apache.zest.libraries:org.apache.zest.library.lang-groovy:compileVersionJava
:org.apache.zest.libraries:org.apache.zest.library.lang-groovy:compileJava
:org.apache.zest.libraries:org.apache.zest.library.lang-groovy:compileGroovy UP-TO-DATE
:org.apache.zest.libraries:org.apache.zest.library.lang-groovy:honkerGenDependencies
:org.apache.zest.libraries:org.apache.zest.library.lang-groovy:honkerGenLicense
:org.apache.zest.libraries:org.apache.zest.library.lang-groovy:honkerGenNotice
:org.apache.zest.libraries:org.apache.zest.library.lang-groovy:processResources UP-TO-DATE
:org.apache.zest.libraries:org.apache.zest.library.lang-groovy:classes
:org.apache.zest.libraries:org.apache.zest.library.lang-groovy:compileTestJava UP-TO-DATE
:org.apache.zest.libraries:org.apache.zest.library.lang-groovy:compileTestGroovy
:org.apache.zest.libraries:org.apache.zest.library.lang-groovy:processTestResources
:org.apache.zest.libraries:org.apache.zest.library.lang-groovy:testClasses
:org.apache.zest.libraries:org.apache.zest.library.lang-groovy:test
:org.apache.zest.libraries:org.apache.zest.library.lang-javascript:makeVersionClass
:org.apache.zest.libraries:org.apache.zest.library.lang-javascript:compileVersionJava
:org.apache.zest.libraries:org.apache.zest.library.scripting:makeVersionClass
:org.apache.zest.libraries:org.apache.zest.library.scripting:compileVersionJava
:org.apache.zest.libraries:org.apache.zest.library.scripting:compileJava
:org.apache.zest.libraries:org.apache.zest.library.scripting:honkerGenDependencies
:org.apache.zest.libraries:org.apache.zest.library.scripting:honkerGenLicense
:org.apache.zest.libraries:org.apache.zest.library.scripting:honkerGenNotice
:org.apache.zest.libraries:org.apache.zest.library.scripting:processResources UP-TO-DATE
:org.apache.zest.libraries:org.apache.zest.library.scripting:classes
:org.apache.zest.libraries:org.apache.zest.library.scripting:processVersionResources UP-TO-DATE
:org.apache.zest.libraries:org.apache.zest.library.scripting:versionClasses
:org.apache.zest.libraries:org.apache.zest.library.scripting:jar
:org.apache.zest.libraries:org.apache.zest.library.lang-javascript:compileJava
:org.apache.zest.libraries:org.apache.zest.library.lang-javascript:honkerGenDependencies
:org.apache.zest.libraries:org.apache.zest.library.lang-javascript:honkerGenLicense
:org.apache.zest.libraries:org.apache.zest.library.lang-javascript:honkerGenNotice
:org.apache.zest.libraries:org.apache.zest.library.lang-javascript:processResources UP-TO-DATE
:org.apache.zest.libraries:org.apache.zest.library.lang-javascript:classes
:org.apache.zest.libraries:org.apache.zest.library.lang-javascript:compileTestJava
:org.apache.zest.libraries:org.apache.zest.library.lang-javascript:processTestResources
:org.apache.zest.libraries:org.apache.zest.library.lang-javascript:testClasses
:org.apache.zest.libraries:org.apache.zest.library.lang-javascript:test
:org.apache.zest.libraries:org.apache.zest.library.locking:compileTestJava
:org.apache.zest.libraries:org.apache.zest.library.locking:processTestResources UP-TO-DATE
:org.apache.zest.libraries:org.apache.zest.library.locking:testClasses
:org.apache.zest.libraries:org.apache.zest.library.locking:test
:org.apache.zest.libraries:org.apache.zest.library.logging:compileTestJava
:org.apache.zest.libraries:org.apache.zest.library.logging:processTestResources
:org.apache.zest.libraries:org.apache.zest.library.logging:testClasses
:org.apache.zest.libraries:org.apache.zest.library.logging:test
:org.apache.zest.extensions:org.apache.zest.extension.metrics-yammer:processVersionResources
UP-TO-DATE
:org.apache.zest.extensions:org.apache.zest.extension.metrics-yammer:versionClasses
:org.apache.zest.extensions:org.apache.zest.extension.metrics-yammer:jar
:org.apache.zest.libraries:org.apache.zest.library.metrics:makeVersionClass
:org.apache.zest.libraries:org.apache.zest.library.metrics:compileVersionJava
:org.apache.zest.libraries:org.apache.zest.library.metrics:compileJava
:org.apache.zest.libraries:org.apache.zest.library.metrics:honkerGenDependencies
:org.apache.zest.libraries:org.apache.zest.library.metrics:honkerGenLicense
:org.apache.zest.libraries:org.apache.zest.library.metrics:honkerGenNotice
:org.apache.zest.libraries:org.apache.zest.library.metrics:processResources UP-TO-DATE
:org.apache.zest.libraries:org.apache.zest.library.metrics:classes
:org.apache.zest.libraries:org.apache.zest.library.metrics:compileTestJava
:org.apache.zest.libraries:org.apache.zest.library.metrics:processTestResources UP-TO-DATE
:org.apache.zest.libraries:org.apache.zest.library.metrics:testClasses
:org.apache.zest.libraries:org.apache.zest.library.metrics:test

org.apache.zest.library.metrics.MetricsTest > givenOneMethodAnnotatedWhenCallingUpdateNameExpectReportForThatMethodOnly
FAILED
    java.lang.AssertionError at MetricsTest.java:117

3 tests completed, 1 failed
:org.apache.zest.libraries:org.apache.zest.library.metrics:test FAILED

FAILURE: Build failed with an exception.

* What went wrong:
Execution failed for task ':org.apache.zest.libraries:org.apache.zest.library.metrics:test'.
> There were failing tests. See the report at: file://<https://builds.apache.org/job/Zest(JavaEdition)-develop-java8-check/ws/libraries/metrics/build/reports/tests/test/index.html>

* Try:
Run with --stacktrace option to get the stack trace. Run with --info or --debug option to
get more log output.

BUILD FAILED

Total time: 20 mins 42.775 secs
Build step 'Invoke Gradle script' changed build result to FAILURE
Build step 'Invoke Gradle script' marked build as failure
Recording test results

Mime
View raw message