polygene-dev mailing list archives

Site index · List index
Message view « Date » · « Thread »
Top « Date » · « Thread »
From Apache Jenkins Server <jenk...@builds.apache.org>
Subject Build failed in Jenkins: Zest(JavaEdition)-develop-java8-checkDists #83
Date Mon, 12 Sep 2016 04:51:10 GMT
See <https://builds.apache.org/job/Zest(JavaEdition)-develop-java8-checkDists/83/changes>

Changes:

[paulmerlin] Minor fix in AbstractJsonDateFormatTest

[paulmerlin] Build: minor, upgrade Rat & Honker

[paulmerlin] Trivial 3rd party libraries upgrades

[paulmerlin] Upgrade Geode to 1.0.0-incubating-M3

[paulmerlin] ZEST-175 Move from commons-lang to commons-lang3

[paulmerlin] Move from commons-dbcp to commons-dbcp2 for sql-dbcp library

[paulmerlin] Upgrade MongoDB Java Driver from 2.x to 3.3.0

[paulmerlin] Some minor formatting and imports fixes

[paulmerlin] ZEST-176 Rework Riak EntityStore for Riak 2

[paulmerlin] ZEST-177 Rework ElasticSearch EntityStore for ElasticSearch 2

[paulmerlin] ZEST-175 Temporarily disable Jacoco when running with Java 9

[paulmerlin] ZEST-175 Remove -XX:MaxPermSize from the Scala compiler options

[paulmerlin] ZEST-175 Disable Scala compilation on Java 9

------------------------------------------
[...truncated 1629 lines...]
:org.apache.zest.tools:org.apache.zest.tool.envisage:test
:org.apache.zest.tools:org.apache.zest.tool.model-detail:compileTestJavaNote: <https://builds.apache.org/job/Zest(JavaEdition)-develop-java8-checkDists/ws/tools/model-detail/src/test/java/org/apache/zest/tools/model/VisitableDetailTest.java>
uses unchecked or unsafe operations.
Note: Recompile with -Xlint:unchecked for details.

:org.apache.zest.tools:org.apache.zest.tool.model-detail:processTestResources UP-TO-DATE
:org.apache.zest.tools:org.apache.zest.tool.model-detail:testClasses
:org.apache.zest.tools:org.apache.zest.tool.model-detail:test
:org.apache.zest.tools:org.apache.zest.tool.shell:makeVersionClass
:org.apache.zest.tools:org.apache.zest.tool.shell:compileVersionJava
:org.apache.zest.tools:org.apache.zest.tool.shell:compileJava
:org.apache.zest.tools:org.apache.zest.tool.shell:honkerGenDependencies
:org.apache.zest.tools:org.apache.zest.tool.shell:honkerGenLicense
:org.apache.zest.tools:org.apache.zest.tool.shell:honkerGenNotice
:org.apache.zest.tools:org.apache.zest.tool.shell:processResources UP-TO-DATE
:org.apache.zest.tools:org.apache.zest.tool.shell:classes
:org.apache.zest.tools:org.apache.zest.tool.shell:compileTestJava
:org.apache.zest.tools:org.apache.zest.tool.shell:processTestResources UP-TO-DATE
:org.apache.zest.tools:org.apache.zest.tool.shell:testClasses
:org.apache.zest.tools:org.apache.zest.tool.shell:test
:org.apache.zest.tutorials:org.apache.zest.tutorial.cargo:makeVersionClass
:org.apache.zest.tutorials:org.apache.zest.tutorial.cargo:compileVersionJava
:org.apache.zest.tutorials:org.apache.zest.tutorial.cargo:compileJava
:org.apache.zest.tutorials:org.apache.zest.tutorial.cargo:honkerGenDependencies
:org.apache.zest.tutorials:org.apache.zest.tutorial.cargo:honkerGenLicense
:org.apache.zest.tutorials:org.apache.zest.tutorial.cargo:honkerGenNotice
:org.apache.zest.tutorials:org.apache.zest.tutorial.cargo:processResources UP-TO-DATE
:org.apache.zest.tutorials:org.apache.zest.tutorial.cargo:classes
:org.apache.zest.tutorials:org.apache.zest.tutorial.cargo:compileTestJavaNote: <https://builds.apache.org/job/Zest(JavaEdition)-develop-java8-checkDists/ws/tutorials/cargo/src/test/java/org/apache/zest/tutorials/cargo/step2/SequencingConcernTest.java>
uses unchecked or unsafe operations.
Note: Recompile with -Xlint:unchecked for details.

:org.apache.zest.tutorials:org.apache.zest.tutorial.cargo:processTestResources UP-TO-DATE
:org.apache.zest.tutorials:org.apache.zest.tutorial.cargo:testClasses
:org.apache.zest.tutorials:org.apache.zest.tutorial.cargo:test
:org.apache.zest.tutorials:org.apache.zest.tutorial.composites:makeVersionClass
:org.apache.zest.tutorials:org.apache.zest.tutorial.composites:compileVersionJava
:org.apache.zest.tutorials:org.apache.zest.tutorial.composites:compileJava
:org.apache.zest.tutorials:org.apache.zest.tutorial.composites:honkerGenDependencies
:org.apache.zest.tutorials:org.apache.zest.tutorial.composites:honkerGenLicense
:org.apache.zest.tutorials:org.apache.zest.tutorial.composites:honkerGenNotice
:org.apache.zest.tutorials:org.apache.zest.tutorial.composites:processResources UP-TO-DATE
:org.apache.zest.tutorials:org.apache.zest.tutorial.composites:classes
:org.apache.zest.tutorials:org.apache.zest.tutorial.composites:compileTestJava
:org.apache.zest.tutorials:org.apache.zest.tutorial.composites:processTestResources UP-TO-DATE
:org.apache.zest.tutorials:org.apache.zest.tutorial.composites:testClasses
:org.apache.zest.tutorials:org.apache.zest.tutorial.composites:test
:org.apache.zest.tutorials:org.apache.zest.tutorial.hello:makeVersionClass
:org.apache.zest.tutorials:org.apache.zest.tutorial.hello:compileVersionJava
:org.apache.zest.tutorials:org.apache.zest.tutorial.hello:compileJava
:org.apache.zest.tutorials:org.apache.zest.tutorial.hello:honkerGenDependencies
:org.apache.zest.tutorials:org.apache.zest.tutorial.hello:honkerGenLicense
:org.apache.zest.tutorials:org.apache.zest.tutorial.hello:honkerGenNotice
:org.apache.zest.tutorials:org.apache.zest.tutorial.hello:processResources UP-TO-DATE
:org.apache.zest.tutorials:org.apache.zest.tutorial.hello:classes
:org.apache.zest.tutorials:org.apache.zest.tutorial.hello:compileTestJava
:org.apache.zest.tutorials:org.apache.zest.tutorial.hello:processTestResources UP-TO-DATE
:org.apache.zest.tutorials:org.apache.zest.tutorial.hello:testClasses
:org.apache.zest.tutorials:org.apache.zest.tutorial.hello:test
:org.apache.zest.tutorials:org.apache.zest.tutorial.introduction:makeVersionClass
:org.apache.zest.tutorials:org.apache.zest.tutorial.introduction:compileVersionJava
:org.apache.zest.tutorials:org.apache.zest.tutorial.introduction:compileJava
:org.apache.zest.tutorials:org.apache.zest.tutorial.introduction:honkerGenDependencies
:org.apache.zest.tutorials:org.apache.zest.tutorial.introduction:honkerGenLicense
:org.apache.zest.tutorials:org.apache.zest.tutorial.introduction:honkerGenNotice
:org.apache.zest.tutorials:org.apache.zest.tutorial.introduction:processResources UP-TO-DATE
:org.apache.zest.tutorials:org.apache.zest.tutorial.introduction:classes
:org.apache.zest.tutorials:org.apache.zest.tutorial.introduction:compileTestJava UP-TO-DATE
:org.apache.zest.tutorials:org.apache.zest.tutorial.introduction:processTestResources UP-TO-DATE
:org.apache.zest.tutorials:org.apache.zest.tutorial.introduction:testClasses UP-TO-DATE
:org.apache.zest.tutorials:org.apache.zest.tutorial.introduction:test UP-TO-DATE
:org.apache.zest.tutorials:org.apache.zest.tutorial.services:makeVersionClass
:org.apache.zest.tutorials:org.apache.zest.tutorial.services:compileVersionJava
:org.apache.zest.tutorials:org.apache.zest.tutorial.services:compileJava
:org.apache.zest.tutorials:org.apache.zest.tutorial.services:honkerGenDependencies
:org.apache.zest.tutorials:org.apache.zest.tutorial.services:honkerGenLicense
:org.apache.zest.tutorials:org.apache.zest.tutorial.services:honkerGenNotice
:org.apache.zest.tutorials:org.apache.zest.tutorial.services:processResources
:org.apache.zest.tutorials:org.apache.zest.tutorial.services:classes
:org.apache.zest.tutorials:org.apache.zest.tutorial.services:compileTestJava
:org.apache.zest.tutorials:org.apache.zest.tutorial.services:processTestResources UP-TO-DATE
:org.apache.zest.tutorials:org.apache.zest.tutorial.services:testClasses
:org.apache.zest.tutorials:org.apache.zest.tutorial.services:test
:org.apache.zest.tools:org.apache.zest.tool.envisage:processVersionResources UP-TO-DATE
:org.apache.zest.tools:org.apache.zest.tool.envisage:versionClasses
:org.apache.zest.tools:org.apache.zest.tool.envisage:jar
:org.apache.zest.samples:org.apache.zest.sample.dci-cargo:org.apache.zest.sample.dci-cargo.dcisample_a:makeVersionClass
:org.apache.zest.samples:org.apache.zest.sample.dci-cargo:org.apache.zest.sample.dci-cargo.dcisample_a:compileVersionJava
:org.apache.zest.samples:org.apache.zest.sample.dci-cargo:org.apache.zest.sample.dci-cargo.dcisample_a:compileJava
:org.apache.zest.samples:org.apache.zest.sample.dci-cargo:org.apache.zest.sample.dci-cargo.dcisample_a:honkerGenDependencies
:org.apache.zest.samples:org.apache.zest.sample.dci-cargo:org.apache.zest.sample.dci-cargo.dcisample_a:honkerGenLicense
:org.apache.zest.samples:org.apache.zest.sample.dci-cargo:org.apache.zest.sample.dci-cargo.dcisample_a:honkerGenNotice
:org.apache.zest.samples:org.apache.zest.sample.dci-cargo:org.apache.zest.sample.dci-cargo.dcisample_a:processResources
:org.apache.zest.samples:org.apache.zest.sample.dci-cargo:org.apache.zest.sample.dci-cargo.dcisample_a:classes
:org.apache.zest.samples:org.apache.zest.sample.dci-cargo:org.apache.zest.sample.dci-cargo.dcisample_a:compileTestJava
:org.apache.zest.samples:org.apache.zest.sample.dci-cargo:org.apache.zest.sample.dci-cargo.dcisample_a:processTestResources
UP-TO-DATE
:org.apache.zest.samples:org.apache.zest.sample.dci-cargo:org.apache.zest.sample.dci-cargo.dcisample_a:testClasses
:org.apache.zest.samples:org.apache.zest.sample.dci-cargo:org.apache.zest.sample.dci-cargo.dcisample_a:test
:org.apache.zest.samples:org.apache.zest.sample.dci-cargo:org.apache.zest.sample.dci-cargo.dcisample_b:makeVersionClass
:org.apache.zest.samples:org.apache.zest.sample.dci-cargo:org.apache.zest.sample.dci-cargo.dcisample_b:compileVersionJava
:org.apache.zest.samples:org.apache.zest.sample.dci-cargo:org.apache.zest.sample.dci-cargo.dcisample_b:compileJava
:org.apache.zest.samples:org.apache.zest.sample.dci-cargo:org.apache.zest.sample.dci-cargo.dcisample_b:honkerGenDependencies
:org.apache.zest.samples:org.apache.zest.sample.dci-cargo:org.apache.zest.sample.dci-cargo.dcisample_b:honkerGenLicense
:org.apache.zest.samples:org.apache.zest.sample.dci-cargo:org.apache.zest.sample.dci-cargo.dcisample_b:honkerGenNotice
:org.apache.zest.samples:org.apache.zest.sample.dci-cargo:org.apache.zest.sample.dci-cargo.dcisample_b:processResources
:org.apache.zest.samples:org.apache.zest.sample.dci-cargo:org.apache.zest.sample.dci-cargo.dcisample_b:classes
:org.apache.zest.samples:org.apache.zest.sample.dci-cargo:org.apache.zest.sample.dci-cargo.dcisample_b:compileTestJava
:org.apache.zest.samples:org.apache.zest.sample.dci-cargo:org.apache.zest.sample.dci-cargo.dcisample_b:processTestResources
UP-TO-DATE
:org.apache.zest.samples:org.apache.zest.sample.dci-cargo:org.apache.zest.sample.dci-cargo.dcisample_b:testClasses
:org.apache.zest.samples:org.apache.zest.sample.dci-cargo:org.apache.zest.sample.dci-cargo.dcisample_b:test
:org.apache.zest.tutorials:org.apache.zest.tutorial.introduction:org.apache.zest.tutorial.introduction.tenminutes:makeVersionClass
:org.apache.zest.tutorials:org.apache.zest.tutorial.introduction:org.apache.zest.tutorial.introduction.tenminutes:compileVersionJava
:org.apache.zest.tutorials:org.apache.zest.tutorial.introduction:org.apache.zest.tutorial.introduction.tenminutes:compileJava
:org.apache.zest.tutorials:org.apache.zest.tutorial.introduction:org.apache.zest.tutorial.introduction.tenminutes:honkerGenDependencies
:org.apache.zest.tutorials:org.apache.zest.tutorial.introduction:org.apache.zest.tutorial.introduction.tenminutes:honkerGenLicense
:org.apache.zest.tutorials:org.apache.zest.tutorial.introduction:org.apache.zest.tutorial.introduction.tenminutes:honkerGenNotice
:org.apache.zest.tutorials:org.apache.zest.tutorial.introduction:org.apache.zest.tutorial.introduction.tenminutes:processResources
UP-TO-DATE
:org.apache.zest.tutorials:org.apache.zest.tutorial.introduction:org.apache.zest.tutorial.introduction.tenminutes:classes
:org.apache.zest.tutorials:org.apache.zest.tutorial.introduction:org.apache.zest.tutorial.introduction.tenminutes:compileTestJava
UP-TO-DATE
:org.apache.zest.tutorials:org.apache.zest.tutorial.introduction:org.apache.zest.tutorial.introduction.tenminutes:processTestResources
UP-TO-DATE
:org.apache.zest.tutorials:org.apache.zest.tutorial.introduction:org.apache.zest.tutorial.introduction.tenminutes:testClasses
UP-TO-DATE
:org.apache.zest.tutorials:org.apache.zest.tutorial.introduction:org.apache.zest.tutorial.introduction.tenminutes:test
UP-TO-DATE
:org.apache.zest.tutorials:org.apache.zest.tutorial.introduction:org.apache.zest.tutorial.introduction.tenminutes:processVersionResources
UP-TO-DATE
:org.apache.zest.tutorials:org.apache.zest.tutorial.introduction:org.apache.zest.tutorial.introduction.tenminutes:versionClasses
:org.apache.zest.tutorials:org.apache.zest.tutorial.introduction:org.apache.zest.tutorial.introduction.tenminutes:jar
:org.apache.zest.tutorials:org.apache.zest.tutorial.introduction:org.apache.zest.tutorial.introduction.thirtyminutes:makeVersionClass
:org.apache.zest.tutorials:org.apache.zest.tutorial.introduction:org.apache.zest.tutorial.introduction.thirtyminutes:compileVersionJava
:org.apache.zest.tutorials:org.apache.zest.tutorial.introduction:org.apache.zest.tutorial.introduction.thirtyminutes:compileJavaNote:
<https://builds.apache.org/job/Zest(JavaEdition)-develop-java8-checkDists/ws/tutorials/introduction/thirtyminutes/src/main/java/org/apache/zest/demo/thirtyminutes/ThirtyMinutesDocs.java>
uses unchecked or unsafe operations.
Note: Recompile with -Xlint:unchecked for details.

:org.apache.zest.tutorials:org.apache.zest.tutorial.introduction:org.apache.zest.tutorial.introduction.thirtyminutes:honkerGenDependencies
:org.apache.zest.tutorials:org.apache.zest.tutorial.introduction:org.apache.zest.tutorial.introduction.thirtyminutes:honkerGenLicense
:org.apache.zest.tutorials:org.apache.zest.tutorial.introduction:org.apache.zest.tutorial.introduction.thirtyminutes:honkerGenNotice
:org.apache.zest.tutorials:org.apache.zest.tutorial.introduction:org.apache.zest.tutorial.introduction.thirtyminutes:processResources
UP-TO-DATE
:org.apache.zest.tutorials:org.apache.zest.tutorial.introduction:org.apache.zest.tutorial.introduction.thirtyminutes:classes
:org.apache.zest.tutorials:org.apache.zest.tutorial.introduction:org.apache.zest.tutorial.introduction.thirtyminutes:compileTestJava
UP-TO-DATE
:org.apache.zest.tutorials:org.apache.zest.tutorial.introduction:org.apache.zest.tutorial.introduction.thirtyminutes:processTestResources
UP-TO-DATE
:org.apache.zest.tutorials:org.apache.zest.tutorial.introduction:org.apache.zest.tutorial.introduction.thirtyminutes:testClasses
UP-TO-DATE
:org.apache.zest.tutorials:org.apache.zest.tutorial.introduction:org.apache.zest.tutorial.introduction.thirtyminutes:test
UP-TO-DATE
:org.apache.zest.tutorials:org.apache.zest.tutorial.introduction:org.apache.zest.tutorial.introduction.twominutes:makeVersionClass
:org.apache.zest.tutorials:org.apache.zest.tutorial.introduction:org.apache.zest.tutorial.introduction.twominutes:compileVersionJava
:org.apache.zest.tutorials:org.apache.zest.tutorial.introduction:org.apache.zest.tutorial.introduction.twominutes:compileJava
:org.apache.zest.tutorials:org.apache.zest.tutorial.introduction:org.apache.zest.tutorial.introduction.twominutes:honkerGenDependencies
:org.apache.zest.tutorials:org.apache.zest.tutorial.introduction:org.apache.zest.tutorial.introduction.twominutes:honkerGenLicense
:org.apache.zest.tutorials:org.apache.zest.tutorial.introduction:org.apache.zest.tutorial.introduction.twominutes:honkerGenNotice
:org.apache.zest.tutorials:org.apache.zest.tutorial.introduction:org.apache.zest.tutorial.introduction.twominutes:processResources
UP-TO-DATE
:org.apache.zest.tutorials:org.apache.zest.tutorial.introduction:org.apache.zest.tutorial.introduction.twominutes:classes
:org.apache.zest.tutorials:org.apache.zest.tutorial.introduction:org.apache.zest.tutorial.introduction.twominutes:compileTestJava
UP-TO-DATE
:org.apache.zest.tutorials:org.apache.zest.tutorial.introduction:org.apache.zest.tutorial.introduction.twominutes:processTestResources
UP-TO-DATE
:org.apache.zest.tutorials:org.apache.zest.tutorial.introduction:org.apache.zest.tutorial.introduction.twominutes:testClasses
UP-TO-DATE
:org.apache.zest.tutorials:org.apache.zest.tutorial.introduction:org.apache.zest.tutorial.introduction.twominutes:test
UP-TO-DATE
:coverageReport
Download https://jcenter.bintray.com/org/ow2/asm/asm-debug-all/5.1/asm-debug-all-5.1.pom
Download https://jcenter.bintray.com/org/ow2/asm/asm-debug-all/5.1/asm-debug-all-5.1.jar
:honkerCheck
:rat
Download https://jcenter.bintray.com/org/apache/rat/apache-rat-tasks/0.12/apache-rat-tasks-0.12.pom
Download https://jcenter.bintray.com/org/apache/rat/apache-rat-tasks/0.12/apache-rat-tasks-0.12.jar
:rat FAILED

FAILURE: Build failed with an exception.

* What went wrong:
Execution failed for task ':rat'.
> Found 29 files with unapproved/unknown licenses. See <https://builds.apache.org/job/Zest(JavaEdition)-develop-java8-checkDists/ws/build/reports/rat/index.html>

* Try:
Run with --info or --debug option to get more log output.

* Exception is:
org.gradle.api.tasks.TaskExecutionException: Execution failed for task ':rat'.
	at org.gradle.api.internal.tasks.execution.ExecuteActionsTaskExecuter.executeActions(ExecuteActionsTaskExecuter.java:69)
	at org.gradle.api.internal.tasks.execution.ExecuteActionsTaskExecuter.execute(ExecuteActionsTaskExecuter.java:46)
	at org.gradle.api.internal.tasks.execution.PostExecutionAnalysisTaskExecuter.execute(PostExecutionAnalysisTaskExecuter.java:35)
	at org.gradle.api.internal.tasks.execution.SkipUpToDateTaskExecuter.execute(SkipUpToDateTaskExecuter.java:64)
	at org.gradle.api.internal.tasks.execution.ValidatingTaskExecuter.execute(ValidatingTaskExecuter.java:58)
	at org.gradle.api.internal.tasks.execution.SkipEmptySourceFilesTaskExecuter.execute(SkipEmptySourceFilesTaskExecuter.java:52)
	at org.gradle.api.internal.tasks.execution.SkipTaskWithNoActionsExecuter.execute(SkipTaskWithNoActionsExecuter.java:52)
	at org.gradle.api.internal.tasks.execution.SkipOnlyIfTaskExecuter.execute(SkipOnlyIfTaskExecuter.java:53)
	at org.gradle.api.internal.tasks.execution.ExecuteAtMostOnceTaskExecuter.execute(ExecuteAtMostOnceTaskExecuter.java:43)
	at org.gradle.execution.taskgraph.DefaultTaskGraphExecuter$EventFiringTaskWorker.execute(DefaultTaskGraphExecuter.java:203)
	at org.gradle.execution.taskgraph.DefaultTaskGraphExecuter$EventFiringTaskWorker.execute(DefaultTaskGraphExecuter.java:185)
	at org.gradle.execution.taskgraph.AbstractTaskPlanExecutor$TaskExecutorWorker.processTask(AbstractTaskPlanExecutor.java:74)
	at org.gradle.execution.taskgraph.AbstractTaskPlanExecutor$TaskExecutorWorker.run(AbstractTaskPlanExecutor.java:55)
	at org.gradle.execution.taskgraph.DefaultTaskPlanExecutor.process(DefaultTaskPlanExecutor.java:32)
	at org.gradle.execution.taskgraph.DefaultTaskGraphExecuter.execute(DefaultTaskGraphExecuter.java:110)
	at org.gradle.execution.SelectedTaskExecutionAction.execute(SelectedTaskExecutionAction.java:37)
	at org.gradle.execution.DefaultBuildExecuter.execute(DefaultBuildExecuter.java:37)
	at org.gradle.execution.DefaultBuildExecuter.access$000(DefaultBuildExecuter.java:23)
	at org.gradle.execution.DefaultBuildExecuter$1.proceed(DefaultBuildExecuter.java:43)
	at org.gradle.execution.DryRunBuildExecutionAction.execute(DryRunBuildExecutionAction.java:32)
	at org.gradle.execution.DefaultBuildExecuter.execute(DefaultBuildExecuter.java:37)
	at org.gradle.execution.DefaultBuildExecuter.execute(DefaultBuildExecuter.java:30)
	at org.gradle.initialization.DefaultGradleLauncher$4.run(DefaultGradleLauncher.java:153)
	at org.gradle.internal.Factories$1.create(Factories.java:22)
	at org.gradle.internal.progress.DefaultBuildOperationExecutor.run(DefaultBuildOperationExecutor.java:91)
	at org.gradle.internal.progress.DefaultBuildOperationExecutor.run(DefaultBuildOperationExecutor.java:53)
	at org.gradle.initialization.DefaultGradleLauncher.doBuildStages(DefaultGradleLauncher.java:150)
	at org.gradle.initialization.DefaultGradleLauncher.access$200(DefaultGradleLauncher.java:32)
	at org.gradle.initialization.DefaultGradleLauncher$1.create(DefaultGradleLauncher.java:98)
	at org.gradle.initialization.DefaultGradleLauncher$1.create(DefaultGradleLauncher.java:92)
	at org.gradle.internal.progress.DefaultBuildOperationExecutor.run(DefaultBuildOperationExecutor.java:91)
	at org.gradle.internal.progress.DefaultBuildOperationExecutor.run(DefaultBuildOperationExecutor.java:63)
	at org.gradle.initialization.DefaultGradleLauncher.doBuild(DefaultGradleLauncher.java:92)
	at org.gradle.initialization.DefaultGradleLauncher.run(DefaultGradleLauncher.java:83)
	at org.gradle.launcher.exec.InProcessBuildActionExecuter$DefaultBuildController.run(InProcessBuildActionExecuter.java:94)
	at org.gradle.tooling.internal.provider.ExecuteBuildActionRunner.run(ExecuteBuildActionRunner.java:28)
	at org.gradle.launcher.exec.ChainingBuildActionRunner.run(ChainingBuildActionRunner.java:35)
	at org.gradle.launcher.exec.InProcessBuildActionExecuter.execute(InProcessBuildActionExecuter.java:43)
	at org.gradle.launcher.exec.InProcessBuildActionExecuter.execute(InProcessBuildActionExecuter.java:28)
	at org.gradle.launcher.exec.ContinuousBuildActionExecuter.execute(ContinuousBuildActionExecuter.java:82)
	at org.gradle.launcher.exec.ContinuousBuildActionExecuter.execute(ContinuousBuildActionExecuter.java:49)
	at org.gradle.launcher.cli.RunBuildAction.run(RunBuildAction.java:43)
	at org.gradle.internal.Actions$RunnableActionAdapter.execute(Actions.java:173)
	at org.gradle.launcher.cli.CommandLineActionFactory$ParseAndBuildAction.execute(CommandLineActionFactory.java:244)
	at org.gradle.launcher.cli.CommandLineActionFactory$ParseAndBuildAction.execute(CommandLineActionFactory.java:217)
	at org.gradle.launcher.cli.JavaRuntimeValidationAction.execute(JavaRuntimeValidationAction.java:33)
	at org.gradle.launcher.cli.JavaRuntimeValidationAction.execute(JavaRuntimeValidationAction.java:24)
	at org.gradle.launcher.cli.ExceptionReportingAction.execute(ExceptionReportingAction.java:33)
	at org.gradle.launcher.cli.ExceptionReportingAction.execute(ExceptionReportingAction.java:22)
	at org.gradle.launcher.cli.CommandLineActionFactory$WithLogging.execute(CommandLineActionFactory.java:210)
	at org.gradle.launcher.cli.CommandLineActionFactory$WithLogging.execute(CommandLineActionFactory.java:174)
	at org.gradle.launcher.Main.doAction(Main.java:33)
	at org.gradle.launcher.bootstrap.EntryPoint.run(EntryPoint.java:45)
	at org.gradle.launcher.bootstrap.ProcessBootstrap.runNoExit(ProcessBootstrap.java:60)
	at org.gradle.launcher.bootstrap.ProcessBootstrap.run(ProcessBootstrap.java:37)
	at org.gradle.launcher.GradleMain.main(GradleMain.java:23)
	at org.gradle.wrapper.BootstrapMainStarter.start(BootstrapMainStarter.java:30)
	at org.gradle.wrapper.WrapperExecutor.execute(WrapperExecutor.java:129)
	at org.gradle.wrapper.GradleWrapperMain.main(GradleWrapperMain.java:61)
Caused by: org.gradle.api.GradleException: Found 29 files with unapproved/unknown licenses.
See <https://builds.apache.org/job/Zest(JavaEdition)-develop-java8-checkDists/ws/build/reports/rat/index.html>
	at org.apache.rat.gradle.RatTask.rat(RatTask.groovy:83)
	at org.gradle.internal.reflect.JavaMethod.invoke(JavaMethod.java:75)
	at org.gradle.api.internal.project.taskfactory.DefaultTaskClassInfoStore$StandardTaskAction.doExecute(DefaultTaskClassInfoStore.java:133)
	at org.gradle.api.internal.project.taskfactory.DefaultTaskClassInfoStore$StandardTaskAction.execute(DefaultTaskClassInfoStore.java:126)
	at org.gradle.api.internal.project.taskfactory.DefaultTaskClassInfoStore$StandardTaskAction.execute(DefaultTaskClassInfoStore.java:115)
	at org.gradle.api.internal.AbstractTask$TaskActionWrapper.execute(AbstractTask.java:623)
	at org.gradle.api.internal.AbstractTask$TaskActionWrapper.execute(AbstractTask.java:606)
	at org.gradle.api.internal.tasks.execution.ExecuteActionsTaskExecuter.executeAction(ExecuteActionsTaskExecuter.java:80)
	at org.gradle.api.internal.tasks.execution.ExecuteActionsTaskExecuter.executeActions(ExecuteActionsTaskExecuter.java:61)
	... 58 more


BUILD FAILED

Total time: 15 mins 3.137 secs
Build step 'Invoke Gradle script' changed build result to FAILURE
Build step 'Invoke Gradle script' marked build as failure
Archiving artifacts
Recording test results
Publishing Javadoc

Mime
View raw message