polygene-dev mailing list archives

Site index · List index
Message view « Date » · « Thread »
Top « Date » · « Thread »
From Apache Jenkins Server <jenk...@builds.apache.org>
Subject Build failed in Jenkins: Zest(JavaEdition)-develop-java9-check #3
Date Mon, 12 Sep 2016 02:27:45 GMT
See <https://builds.apache.org/job/Zest(JavaEdition)-develop-java9-check/3/changes>

Changes:

[paulmerlin] ZEST-175 Temporarily disable Jacoco when running with Java 9

[paulmerlin] ZEST-175 Remove -XX:MaxPermSize from the Scala compiler options

------------------------------------------
[...truncated 4852 lines...]
:org.apache.zest.libraries:org.apache.zest.library.circuitbreaker:compileTestJava
Download https://repo1.maven.org/maven2/org/awaitility/awaitility/2.0.0/awaitility-2.0.0.jar
Note: Some input files use unchecked or unsafe operations.
Note: Recompile with -Xlint:unchecked for details.
:org.apache.zest.libraries:org.apache.zest.library.circuitbreaker:processTestResources UP-TO-DATE
:org.apache.zest.libraries:org.apache.zest.library.circuitbreaker:testClasses
:org.apache.zest.libraries:org.apache.zest.library.circuitbreaker:test
:org.apache.zest.libraries:org.apache.zest.library.constraints:compileTestJava
:org.apache.zest.libraries:org.apache.zest.library.constraints:processTestResources UP-TO-DATE
:org.apache.zest.libraries:org.apache.zest.library.constraints:testClasses
:org.apache.zest.libraries:org.apache.zest.library.constraints:test
:org.apache.zest.libraries:org.apache.zest.library.eventsourcing:makeVersionClass
:org.apache.zest.libraries:org.apache.zest.library.eventsourcing:compileVersionJava
:org.apache.zest.libraries:org.apache.zest.library.eventsourcing:compileJavaNote: Some input
files use unchecked or unsafe operations.
Note: Recompile with -Xlint:unchecked for details.

:org.apache.zest.libraries:org.apache.zest.library.eventsourcing:honkerGenDependencies
:org.apache.zest.libraries:org.apache.zest.library.eventsourcing:honkerGenLicense
:org.apache.zest.libraries:org.apache.zest.library.eventsourcing:honkerGenNotice
:org.apache.zest.libraries:org.apache.zest.library.eventsourcing:processResources UP-TO-DATE
:org.apache.zest.libraries:org.apache.zest.library.eventsourcing:classes
:org.apache.zest.libraries:org.apache.zest.library.eventsourcing:compileTestJavaNote: <https://builds.apache.org/job/Zest(JavaEdition)-develop-java9-check/ws/libraries/eventsourcing/src/test/java/org/apache/zest/library/eventsourcing/application/ApplicationEventTest.java>
uses unchecked or unsafe operations.
Note: Recompile with -Xlint:unchecked for details.

:org.apache.zest.libraries:org.apache.zest.library.eventsourcing:processTestResources UP-TO-DATE
:org.apache.zest.libraries:org.apache.zest.library.eventsourcing:testClasses
:org.apache.zest.libraries:org.apache.zest.library.eventsourcing:test
:org.apache.zest.libraries:org.apache.zest.library.eventsourcing:processVersionResources UP-TO-DATE
:org.apache.zest.libraries:org.apache.zest.library.eventsourcing:versionClasses
:org.apache.zest.libraries:org.apache.zest.library.eventsourcing:jarjava.lang.NullPointerException
java.lang.NullPointerException
java.lang.NullPointerException

:org.apache.zest.libraries:org.apache.zest.library.eventsourcing-jdbm:makeVersionClass
:org.apache.zest.libraries:org.apache.zest.library.eventsourcing-jdbm:compileVersionJava
:org.apache.zest.libraries:org.apache.zest.library.eventsourcing-jdbm:compileJavaNote: <https://builds.apache.org/job/Zest(JavaEdition)-develop-java9-check/ws/libraries/eventsourcing-jdbm/src/main/java/org/apache/zest/library/eventsourcing/domain/source/jdbm/JdbmEventStoreService.java>
uses unchecked or unsafe operations.
Note: Recompile with -Xlint:unchecked for details.

:org.apache.zest.libraries:org.apache.zest.library.eventsourcing-jdbm:honkerGenDependencies
:org.apache.zest.libraries:org.apache.zest.library.eventsourcing-jdbm:honkerGenLicense
:org.apache.zest.libraries:org.apache.zest.library.eventsourcing-jdbm:honkerGenNotice
:org.apache.zest.libraries:org.apache.zest.library.eventsourcing-jdbm:processResources UP-TO-DATE
:org.apache.zest.libraries:org.apache.zest.library.eventsourcing-jdbm:classes
:org.apache.zest.libraries:org.apache.zest.library.eventsourcing-jdbm:compileTestJava
:org.apache.zest.libraries:org.apache.zest.library.eventsourcing-jdbm:processTestResources
UP-TO-DATE
:org.apache.zest.libraries:org.apache.zest.library.eventsourcing-jdbm:testClasses
:org.apache.zest.libraries:org.apache.zest.library.eventsourcing-jdbm:test
:org.apache.zest.libraries:org.apache.zest.library.eventsourcing-rest:makeVersionClass
:org.apache.zest.libraries:org.apache.zest.library.eventsourcing-rest:compileVersionJava
:org.apache.zest.libraries:org.apache.zest.library.eventsourcing-rest:compileJava
Download http://maven.restlet.org/org/restlet/jee/org.restlet/2.3.7/org.restlet-2.3.7.jar
Download http://maven.restlet.org/org/restlet/jee/org.restlet.ext.atom/2.3.7/org.restlet.ext.atom-2.3.7.jar
Download http://maven.restlet.org/org/restlet/jee/org.restlet.ext.servlet/2.3.7/org.restlet.ext.servlet-2.3.7.jar
Download http://maven.restlet.org/org/restlet/jee/org.restlet.ext.slf4j/2.3.7/org.restlet.ext.slf4j-2.3.7.jar
Download http://maven.restlet.org/org/restlet/jee/org.restlet.ext.xml/2.3.7/org.restlet.ext.xml-2.3.7.jar
:org.apache.zest.libraries:org.apache.zest.library.eventsourcing-rest:honkerGenDependencies
:org.apache.zest.libraries:org.apache.zest.library.eventsourcing-rest:honkerGenLicense
:org.apache.zest.libraries:org.apache.zest.library.eventsourcing-rest:honkerGenNotice
:org.apache.zest.libraries:org.apache.zest.library.eventsourcing-rest:processResources UP-TO-DATE
:org.apache.zest.libraries:org.apache.zest.library.eventsourcing-rest:classes
:org.apache.zest.libraries:org.apache.zest.library.eventsourcing-rest:compileTestJava
:org.apache.zest.libraries:org.apache.zest.library.eventsourcing-rest:processTestResources
UP-TO-DATE
:org.apache.zest.libraries:org.apache.zest.library.eventsourcing-rest:testClasses
:org.apache.zest.libraries:org.apache.zest.library.eventsourcing-rest:test
:org.apache.zest.libraries:org.apache.zest.library.fileconfig:compileTestJava
:org.apache.zest.libraries:org.apache.zest.library.fileconfig:processTestResources UP-TO-DATE
:org.apache.zest.libraries:org.apache.zest.library.fileconfig:testClasses
:org.apache.zest.libraries:org.apache.zest.library.fileconfig:test
:org.apache.zest.libraries:org.apache.zest.library.http:makeVersionClass
:org.apache.zest.libraries:org.apache.zest.library.http:compileVersionJava
:org.apache.zest.libraries:org.apache.zest.library.http:compileJava<https://builds.apache.org/job/Zest(JavaEdition)-develop-java9-check/ws/libraries/http/src/main/java/org/apache/zest/library/http/JettyConfigurationHelper.java>:255:
warning: [deprecation] newInstance() in Class has been deprecated
                    Security.addProvider( (Provider) Class.forName( "org.bouncycastle.jce.provider.BouncyCastleProvider"
).newInstance() );
                                                                                         
                                ^
  where T is a type-variable:
    T extends Object declared in class Class
1 warning

:org.apache.zest.libraries:org.apache.zest.library.http:honkerGenDependencies
:org.apache.zest.libraries:org.apache.zest.library.http:honkerGenLicense
:org.apache.zest.libraries:org.apache.zest.library.http:honkerGenNotice
:org.apache.zest.libraries:org.apache.zest.library.http:processResources UP-TO-DATE
:org.apache.zest.libraries:org.apache.zest.library.http:classes
:org.apache.zest.libraries:org.apache.zest.library.http:compileTestJava
:org.apache.zest.libraries:org.apache.zest.library.http:processTestResources
:org.apache.zest.libraries:org.apache.zest.library.http:testClasses
:org.apache.zest.libraries:org.apache.zest.library.http:test
:org.apache.zest.libraries:org.apache.zest.library.invocation-cache:makeVersionClass
:org.apache.zest.libraries:org.apache.zest.library.invocation-cache:compileVersionJava
:org.apache.zest.libraries:org.apache.zest.library.invocation-cache:compileJava
:org.apache.zest.libraries:org.apache.zest.library.invocation-cache:honkerGenDependencies
:org.apache.zest.libraries:org.apache.zest.library.invocation-cache:honkerGenLicense
:org.apache.zest.libraries:org.apache.zest.library.invocation-cache:honkerGenNotice
:org.apache.zest.libraries:org.apache.zest.library.invocation-cache:processResources UP-TO-DATE
:org.apache.zest.libraries:org.apache.zest.library.invocation-cache:classes
:org.apache.zest.libraries:org.apache.zest.library.invocation-cache:compileTestJava
:org.apache.zest.libraries:org.apache.zest.library.invocation-cache:processTestResources UP-TO-DATE
:org.apache.zest.libraries:org.apache.zest.library.invocation-cache:testClasses
:org.apache.zest.libraries:org.apache.zest.library.invocation-cache:test
:org.apache.zest.libraries:org.apache.zest.library.jmx:compileTestJava
:org.apache.zest.libraries:org.apache.zest.library.jmx:processTestResources UP-TO-DATE
:org.apache.zest.libraries:org.apache.zest.library.jmx:testClasses
:org.apache.zest.libraries:org.apache.zest.library.jmx:test
:org.apache.zest.libraries:org.apache.zest.library.lang-groovy:makeVersionClass
:org.apache.zest.libraries:org.apache.zest.library.lang-groovy:compileVersionJava
:org.apache.zest.libraries:org.apache.zest.library.lang-groovy:compileJava<https://builds.apache.org/job/Zest(JavaEdition)-develop-java9-check/ws/libraries/lang-groovy/src/main/java/org/apache/zest/library/groovy/GroovyMixin.java>:124:
warning: [deprecation] newInstance() in Class has been deprecated
                groovyObject = (GroovyObject) groovyClass.newInstance();
                                                         ^
  where T is a type-variable:
    T extends Object declared in class Class
1 warning

:org.apache.zest.libraries:org.apache.zest.library.lang-groovy:compileGroovy UP-TO-DATE
:org.apache.zest.libraries:org.apache.zest.library.lang-groovy:honkerGenDependencies
:org.apache.zest.libraries:org.apache.zest.library.lang-groovy:honkerGenLicense
:org.apache.zest.libraries:org.apache.zest.library.lang-groovy:honkerGenNotice
:org.apache.zest.libraries:org.apache.zest.library.lang-groovy:processResources UP-TO-DATE
:org.apache.zest.libraries:org.apache.zest.library.lang-groovy:classes
:org.apache.zest.libraries:org.apache.zest.library.lang-groovy:compileTestJava UP-TO-DATE
:org.apache.zest.libraries:org.apache.zest.library.lang-groovy:compileTestGroovy
:org.apache.zest.libraries:org.apache.zest.library.lang-groovy:processTestResources
:org.apache.zest.libraries:org.apache.zest.library.lang-groovy:testClasses
:org.apache.zest.libraries:org.apache.zest.library.lang-groovy:test
:org.apache.zest.libraries:org.apache.zest.library.lang-javascript:makeVersionClass
:org.apache.zest.libraries:org.apache.zest.library.lang-javascript:compileVersionJava
:org.apache.zest.libraries:org.apache.zest.library.scripting:makeVersionClass
:org.apache.zest.libraries:org.apache.zest.library.scripting:compileVersionJava
:org.apache.zest.libraries:org.apache.zest.library.scripting:compileJava
:org.apache.zest.libraries:org.apache.zest.library.scripting:honkerGenDependencies
:org.apache.zest.libraries:org.apache.zest.library.scripting:honkerGenLicense
:org.apache.zest.libraries:org.apache.zest.library.scripting:honkerGenNotice
:org.apache.zest.libraries:org.apache.zest.library.scripting:processResources UP-TO-DATE
:org.apache.zest.libraries:org.apache.zest.library.scripting:classes
:org.apache.zest.libraries:org.apache.zest.library.scripting:processVersionResources UP-TO-DATE
:org.apache.zest.libraries:org.apache.zest.library.scripting:versionClasses
:org.apache.zest.libraries:org.apache.zest.library.scripting:jarjava.lang.NullPointerException
java.lang.NullPointerException
java.lang.NullPointerException

:org.apache.zest.libraries:org.apache.zest.library.lang-javascript:compileJava
Download https://repo1.maven.org/maven2/org/mozilla/rhino/1.7.7.1/rhino-1.7.7.1.jar
:org.apache.zest.libraries:org.apache.zest.library.lang-javascript:honkerGenDependencies
:org.apache.zest.libraries:org.apache.zest.library.lang-javascript:honkerGenLicense
:org.apache.zest.libraries:org.apache.zest.library.lang-javascript:honkerGenNotice
:org.apache.zest.libraries:org.apache.zest.library.lang-javascript:processResources UP-TO-DATE
:org.apache.zest.libraries:org.apache.zest.library.lang-javascript:classes
:org.apache.zest.libraries:org.apache.zest.library.lang-javascript:compileTestJava
:org.apache.zest.libraries:org.apache.zest.library.lang-javascript:processTestResources
:org.apache.zest.libraries:org.apache.zest.library.lang-javascript:testClasses
:org.apache.zest.libraries:org.apache.zest.library.lang-javascript:test
:org.apache.zest.libraries:org.apache.zest.library.lang-scala:makeVersionClass
:org.apache.zest.libraries:org.apache.zest.library.lang-scala:compileVersionJava
:org.apache.zest.libraries:org.apache.zest.library.lang-scala:compileJavaNote: <https://builds.apache.org/job/Zest(JavaEdition)-develop-java9-check/ws/libraries/lang-scala/src/main/java/org/apache/zest/library/scala/ScalaTraitMixin.java>
uses unchecked or unsafe operations.
Note: Recompile with -Xlint:unchecked for details.

:org.apache.zest.libraries:org.apache.zest.library.lang-scala:compileScala UP-TO-DATE
:org.apache.zest.libraries:org.apache.zest.library.lang-scala:honkerGenDependencies
:org.apache.zest.libraries:org.apache.zest.library.lang-scala:honkerGenLicense
:org.apache.zest.libraries:org.apache.zest.library.lang-scala:honkerGenNotice
:org.apache.zest.libraries:org.apache.zest.library.lang-scala:processResources UP-TO-DATE
:org.apache.zest.libraries:org.apache.zest.library.lang-scala:classes
:org.apache.zest.libraries:org.apache.zest.library.lang-scala:compileTestJava UP-TO-DATE
:org.apache.zest.libraries:org.apache.zest.library.lang-scala:compileTestScalaerror: scala.reflect.internal.MissingRequirementError:
object java.lang.Object in compiler mirror not found.
	at scala.reflect.internal.MissingRequirementError$.signal(MissingRequirementError.scala:17)
	at scala.reflect.internal.MissingRequirementError$.notFound(MissingRequirementError.scala:18)
	at scala.reflect.internal.Mirrors$RootsBase.getModuleOrClass(Mirrors.scala:53)
	at scala.reflect.internal.Mirrors$RootsBase.getModuleOrClass(Mirrors.scala:45)
	at scala.reflect.internal.Mirrors$RootsBase.getModuleOrClass(Mirrors.scala:45)
	at scala.reflect.internal.Mirrors$RootsBase.getModuleOrClass(Mirrors.scala:66)
	at scala.reflect.internal.Mirrors$RootsBase.getClassByName(Mirrors.scala:102)
	at scala.reflect.internal.Mirrors$RootsBase.getRequiredClass(Mirrors.scala:105)
	at scala.reflect.internal.Definitions$DefinitionsClass.ObjectClass$lzycompute(Definitions.scala:257)
	at scala.reflect.internal.Definitions$DefinitionsClass.ObjectClass(Definitions.scala:257)
	at scala.reflect.internal.Definitions$DefinitionsClass.init(Definitions.scala:1394)
	at scala.tools.nsc.Global$Run.<init>(Global.scala:1215)
	at scala.tools.nsc.Driver.doCompile(Driver.scala:31)
	at scala.tools.nsc.MainClass.doCompile(Main.scala:23)
	at scala.tools.nsc.Driver.process(Driver.scala:51)
	at scala.tools.nsc.Main.process(Main.scala)
	at jdk.internal.reflect.NativeMethodAccessorImpl.invoke0(java.base@9-ea/Native Method)
	at jdk.internal.reflect.NativeMethodAccessorImpl.invoke(java.base@9-ea/NativeMethodAccessorImpl.java:62)
	at jdk.internal.reflect.DelegatingMethodAccessorImpl.invoke(java.base@9-ea/DelegatingMethodAccessorImpl.java:43)
	at java.lang.reflect.Method.invoke(java.base@9-ea/Method.java:535)
	at sbt.compiler.RawCompiler.apply(RawCompiler.scala:26)
	at sbt.compiler.AnalyzingCompiler$$anonfun$compileSources$1$$anonfun$apply$2.apply(AnalyzingCompiler.scala:146)
	at sbt.compiler.AnalyzingCompiler$$anonfun$compileSources$1$$anonfun$apply$2.apply(AnalyzingCompiler.scala:142)
	at sbt.IO$.withTemporaryDirectory(IO.scala:291)
	at sbt.compiler.AnalyzingCompiler$$anonfun$compileSources$1.apply(AnalyzingCompiler.scala:142)
	at sbt.compiler.AnalyzingCompiler$$anonfun$compileSources$1.apply(AnalyzingCompiler.scala:139)
	at sbt.IO$.withTemporaryDirectory(IO.scala:291)
	at sbt.compiler.AnalyzingCompiler$.compileSources(AnalyzingCompiler.scala:139)
	at sbt.compiler.IC$.compileInterfaceJar(IncrementalCompiler.scala:30)
	at com.typesafe.zinc.Compiler$.compilerInterface(Compiler.scala:148)
	at com.typesafe.zinc.Compiler$.create(Compiler.scala:53)
	at com.typesafe.zinc.Compiler$$anonfun$apply$1.apply(Compiler.scala:40)
	at com.typesafe.zinc.Compiler$$anonfun$apply$1.apply(Compiler.scala:40)
	at com.typesafe.zinc.Cache.get(Cache.scala:41)
	at com.typesafe.zinc.Compiler$.apply(Compiler.scala:40)
	at com.typesafe.zinc.Compiler$.getOrCreate(Compiler.scala:46)
	at com.typesafe.zinc.Compiler.getOrCreate(Compiler.scala)
	at org.gradle.api.internal.tasks.scala.ZincScalaCompiler$Compiler.createCompiler(ZincScalaCompiler.java:125)
	at org.gradle.api.internal.tasks.scala.ZincScalaCompiler$Compiler$1$1.create(ZincScalaCompiler.java:149)
	at org.gradle.api.internal.tasks.scala.ZincScalaCompiler$Compiler$1$1.create(ZincScalaCompiler.java:146)
	at org.gradle.cache.internal.DefaultCacheAccess.useCache(DefaultCacheAccess.java:192)
	at org.gradle.cache.internal.DefaultPersistentDirectoryStore.useCache(DefaultPersistentDirectoryStore.java:102)
	at org.gradle.cache.internal.DefaultCacheFactory$ReferenceTrackingCache.useCache(DefaultCacheFactory.java:183)
	at org.gradle.api.internal.tasks.scala.ZincScalaCompiler$Compiler$1.create(ZincScalaCompiler.java:146)
	at org.gradle.api.internal.tasks.scala.ZincScalaCompiler$Compiler$1.create(ZincScalaCompiler.java:143)
	at org.gradle.internal.SystemProperties.withSystemProperty(SystemProperties.java:138)
	at org.gradle.api.internal.tasks.scala.ZincScalaCompiler$Compiler.createParallelSafeCompiler(ZincScalaCompiler.java:143)
	at org.gradle.api.internal.tasks.scala.ZincScalaCompiler$Compiler.execute(ZincScalaCompiler.java:77)
	at org.gradle.api.internal.tasks.scala.ZincScalaCompiler.execute(ZincScalaCompiler.java:66)
	at org.gradle.api.internal.tasks.scala.ZincScalaCompiler.execute(ZincScalaCompiler.java:48)
	at org.gradle.api.internal.tasks.compile.daemon.CompilerDaemonServer.execute(CompilerDaemonServer.java:31)
	at jdk.internal.reflect.NativeMethodAccessorImpl.invoke0(java.base@9-ea/Native Method)
	at jdk.internal.reflect.NativeMethodAccessorImpl.invoke(java.base@9-ea/NativeMethodAccessorImpl.java:62)
	at jdk.internal.reflect.DelegatingMethodAccessorImpl.invoke(java.base@9-ea/DelegatingMethodAccessorImpl.java:43)
	at java.lang.reflect.Method.invoke(java.base@9-ea/Method.java:535)
	at org.gradle.process.internal.worker.request.WorkerAction.run(WorkerAction.java:87)
	at jdk.internal.reflect.NativeMethodAccessorImpl.invoke0(java.base@9-ea/Native Method)
	at jdk.internal.reflect.NativeMethodAccessorImpl.invoke(java.base@9-ea/NativeMethodAccessorImpl.java:62)
	at jdk.internal.reflect.DelegatingMethodAccessorImpl.invoke(java.base@9-ea/DelegatingMethodAccessorImpl.java:43)
	at java.lang.reflect.Method.invoke(java.base@9-ea/Method.java:535)
	at org.gradle.internal.dispatch.ReflectionDispatch.dispatch(ReflectionDispatch.java:35)
	at org.gradle.internal.dispatch.ReflectionDispatch.dispatch(ReflectionDispatch.java:24)
	at org.gradle.internal.remote.internal.hub.MessageHub$Handler.run(MessageHub.java:377)
	at org.gradle.internal.concurrent.ExecutorPolicy$CatchAndRecordFailures.onExecute(ExecutorPolicy.java:54)
	at org.gradle.internal.concurrent.StoppableExecutorImpl$1.run(StoppableExecutorImpl.java:40)
	at java.util.concurrent.ThreadPoolExecutor.runWorker(java.base@9-ea/ThreadPoolExecutor.java:1158)
	at java.util.concurrent.ThreadPoolExecutor$Worker.run(java.base@9-ea/ThreadPoolExecutor.java:632)
	at java.lang.Thread.run(java.base@9-ea/Thread.java:843)
 FAILED

FAILURE: Build failed with an exception.

* What went wrong:
Execution failed for task ':org.apache.zest.libraries:org.apache.zest.library.lang-scala:compileTestScala'.
> org.gradle.internal.serialize.PlaceholderException (no error message)

* Try:
Run with --stacktrace option to get the stack trace. Run with --info or --debug option to
get more log output.

BUILD FAILED

Total time: 10 mins 13.753 secs
Build step 'Invoke Gradle script' changed build result to FAILURE
Build step 'Invoke Gradle script' marked build as failure
Recording test results
ERROR: Step ?Publish JUnit test result report? failed: No test report files were found. Configuration
error?


Mime
View raw message