polygene-dev mailing list archives

Site index · List index
Message view « Date » · « Thread »
Top « Date » · « Thread »
From Apache Jenkins Server <jenk...@builds.apache.org>
Subject Build failed in Jenkins: Zest(JavaEdition)-develop-java9-check #2
Date Mon, 12 Sep 2016 01:56:37 GMT
See <https://builds.apache.org/job/Zest(JavaEdition)-develop-java9-check/2/changes>

Changes:

[paulmerlin] Minor fix in AbstractJsonDateFormatTest

[paulmerlin] Build: minor, upgrade Rat & Honker

[paulmerlin] Trivial 3rd party libraries upgrades

[paulmerlin] Upgrade Geode to 1.0.0-incubating-M3

[paulmerlin] ZEST-175 Move from commons-lang to commons-lang3

[paulmerlin] Move from commons-dbcp to commons-dbcp2 for sql-dbcp library

[paulmerlin] Upgrade MongoDB Java Driver from 2.x to 3.3.0

[paulmerlin] Some minor formatting and imports fixes

[paulmerlin] ZEST-176 Rework Riak EntityStore for Riak 2

[paulmerlin] ZEST-177 Rework ElasticSearch EntityStore for ElasticSearch 2

------------------------------------------
[...truncated 4114 lines...]
	at org.gradle.internal.dispatch.FailureHandlingDispatch.dispatch(FailureHandlingDispatch.java:29)
	at org.gradle.internal.dispatch.AsyncDispatch.dispatchMessages(AsyncDispatch.java:132)
	at org.gradle.internal.dispatch.AsyncDispatch.access$000(AsyncDispatch.java:33)
	at org.gradle.internal.dispatch.AsyncDispatch$1.run(AsyncDispatch.java:72)
	at org.gradle.internal.concurrent.ExecutorPolicy$CatchAndRecordFailures.onExecute(ExecutorPolicy.java:54)
	at org.gradle.internal.concurrent.StoppableExecutorImpl$1.run(StoppableExecutorImpl.java:40)
	at java.util.concurrent.ThreadPoolExecutor.runWorker(java.base@9-ea/ThreadPoolExecutor.java:1158)
	at java.util.concurrent.ThreadPoolExecutor$Worker.run(java.base@9-ea/ThreadPoolExecutor.java:632)
	at java.lang.Thread.run(java.base@9-ea/Thread.java:843)
Cannot nest operations in the same thread. Each nested operation must run in its own thread.
java.lang.UnsupportedOperationException: Cannot nest operations in the same thread. Each nested
operation must run in its own thread.
	at org.gradle.internal.operations.DefaultBuildOperationWorkerRegistry.doStartOperation(DefaultBuildOperationWorkerRegistry.java:65)
	at org.gradle.internal.operations.DefaultBuildOperationWorkerRegistry.access$400(DefaultBuildOperationWorkerRegistry.java:30)
	at org.gradle.internal.operations.DefaultBuildOperationWorkerRegistry$DefaultOperation.operationStart(DefaultBuildOperationWorkerRegistry.java:163)
	at org.gradle.api.internal.tasks.testing.worker.ForkingTestClassProcessor.processTestClass(ForkingTestClassProcessor.java:68)
	at org.gradle.api.internal.tasks.testing.processors.RestartEveryNTestClassProcessor.processTestClass(RestartEveryNTestClassProcessor.java:47)
	at jdk.internal.reflect.NativeMethodAccessorImpl.invoke0(java.base@9-ea/Native Method)
	at jdk.internal.reflect.NativeMethodAccessorImpl.invoke(java.base@9-ea/NativeMethodAccessorImpl.java:62)
	at jdk.internal.reflect.DelegatingMethodAccessorImpl.invoke(java.base@9-ea/DelegatingMethodAccessorImpl.java:43)
	at java.lang.reflect.Method.invoke(java.base@9-ea/Method.java:535)
	at org.gradle.internal.dispatch.ReflectionDispatch.dispatch(ReflectionDispatch.java:35)
	at org.gradle.internal.dispatch.ReflectionDispatch.dispatch(ReflectionDispatch.java:24)
	at org.gradle.internal.dispatch.FailureHandlingDispatch.dispatch(FailureHandlingDispatch.java:29)
	at org.gradle.internal.dispatch.AsyncDispatch.dispatchMessages(AsyncDispatch.java:132)
	at org.gradle.internal.dispatch.AsyncDispatch.access$000(AsyncDispatch.java:33)
	at org.gradle.internal.dispatch.AsyncDispatch$1.run(AsyncDispatch.java:72)
	at org.gradle.internal.concurrent.ExecutorPolicy$CatchAndRecordFailures.onExecute(ExecutorPolicy.java:54)
	at org.gradle.internal.concurrent.StoppableExecutorImpl$1.run(StoppableExecutorImpl.java:40)
	at java.util.concurrent.ThreadPoolExecutor.runWorker(java.base@9-ea/ThreadPoolExecutor.java:1158)
	at java.util.concurrent.ThreadPoolExecutor$Worker.run(java.base@9-ea/ThreadPoolExecutor.java:632)
	at java.lang.Thread.run(java.base@9-ea/Thread.java:843)
Cannot nest operations in the same thread. Each nested operation must run in its own thread.
java.lang.UnsupportedOperationException: Cannot nest operations in the same thread. Each nested
operation must run in its own thread.
	at org.gradle.internal.operations.DefaultBuildOperationWorkerRegistry.doStartOperation(DefaultBuildOperationWorkerRegistry.java:65)
	at org.gradle.internal.operations.DefaultBuildOperationWorkerRegistry.access$400(DefaultBuildOperationWorkerRegistry.java:30)
	at org.gradle.internal.operations.DefaultBuildOperationWorkerRegistry$DefaultOperation.operationStart(DefaultBuildOperationWorkerRegistry.java:163)
	at org.gradle.api.internal.tasks.testing.worker.ForkingTestClassProcessor.processTestClass(ForkingTestClassProcessor.java:68)
	at org.gradle.api.internal.tasks.testing.processors.RestartEveryNTestClassProcessor.processTestClass(RestartEveryNTestClassProcessor.java:47)
	at jdk.internal.reflect.NativeMethodAccessorImpl.invoke0(java.base@9-ea/Native Method)
	at jdk.internal.reflect.NativeMethodAccessorImpl.invoke(java.base@9-ea/NativeMethodAccessorImpl.java:62)
	at jdk.internal.reflect.DelegatingMethodAccessorImpl.invoke(java.base@9-ea/DelegatingMethodAccessorImpl.java:43)
	at java.lang.reflect.Method.invoke(java.base@9-ea/Method.java:535)
	at org.gradle.internal.dispatch.ReflectionDispatch.dispatch(ReflectionDispatch.java:35)
	at org.gradle.internal.dispatch.ReflectionDispatch.dispatch(ReflectionDispatch.java:24)
	at org.gradle.internal.dispatch.FailureHandlingDispatch.dispatch(FailureHandlingDispatch.java:29)
	at org.gradle.internal.dispatch.AsyncDispatch.dispatchMessages(AsyncDispatch.java:132)
	at org.gradle.internal.dispatch.AsyncDispatch.access$000(AsyncDispatch.java:33)
	at org.gradle.internal.dispatch.AsyncDispatch$1.run(AsyncDispatch.java:72)
	at org.gradle.internal.concurrent.ExecutorPolicy$CatchAndRecordFailures.onExecute(ExecutorPolicy.java:54)
	at org.gradle.internal.concurrent.StoppableExecutorImpl$1.run(StoppableExecutorImpl.java:40)
	at java.util.concurrent.ThreadPoolExecutor.runWorker(java.base@9-ea/ThreadPoolExecutor.java:1158)
	at java.util.concurrent.ThreadPoolExecutor$Worker.run(java.base@9-ea/ThreadPoolExecutor.java:632)
	at java.lang.Thread.run(java.base@9-ea/Thread.java:843)
Cannot nest operations in the same thread. Each nested operation must run in its own thread.
java.lang.UnsupportedOperationException: Cannot nest operations in the same thread. Each nested
operation must run in its own thread.
	at org.gradle.internal.operations.DefaultBuildOperationWorkerRegistry.doStartOperation(DefaultBuildOperationWorkerRegistry.java:65)
	at org.gradle.internal.operations.DefaultBuildOperationWorkerRegistry.access$400(DefaultBuildOperationWorkerRegistry.java:30)
	at org.gradle.internal.operations.DefaultBuildOperationWorkerRegistry$DefaultOperation.operationStart(DefaultBuildOperationWorkerRegistry.java:163)
	at org.gradle.api.internal.tasks.testing.worker.ForkingTestClassProcessor.processTestClass(ForkingTestClassProcessor.java:68)
	at org.gradle.api.internal.tasks.testing.processors.RestartEveryNTestClassProcessor.processTestClass(RestartEveryNTestClassProcessor.java:47)
	at jdk.internal.reflect.NativeMethodAccessorImpl.invoke0(java.base@9-ea/Native Method)
	at jdk.internal.reflect.NativeMethodAccessorImpl.invoke(java.base@9-ea/NativeMethodAccessorImpl.java:62)
	at jdk.internal.reflect.DelegatingMethodAccessorImpl.invoke(java.base@9-ea/DelegatingMethodAccessorImpl.java:43)
	at java.lang.reflect.Method.invoke(java.base@9-ea/Method.java:535)
	at org.gradle.internal.dispatch.ReflectionDispatch.dispatch(ReflectionDispatch.java:35)
	at org.gradle.internal.dispatch.ReflectionDispatch.dispatch(ReflectionDispatch.java:24)
	at org.gradle.internal.dispatch.FailureHandlingDispatch.dispatch(FailureHandlingDispatch.java:29)
	at org.gradle.internal.dispatch.AsyncDispatch.dispatchMessages(AsyncDispatch.java:132)
	at org.gradle.internal.dispatch.AsyncDispatch.access$000(AsyncDispatch.java:33)
	at org.gradle.internal.dispatch.AsyncDispatch$1.run(AsyncDispatch.java:72)
	at org.gradle.internal.concurrent.ExecutorPolicy$CatchAndRecordFailures.onExecute(ExecutorPolicy.java:54)
	at org.gradle.internal.concurrent.StoppableExecutorImpl$1.run(StoppableExecutorImpl.java:40)
	at java.util.concurrent.ThreadPoolExecutor.runWorker(java.base@9-ea/ThreadPoolExecutor.java:1158)
	at java.util.concurrent.ThreadPoolExecutor$Worker.run(java.base@9-ea/ThreadPoolExecutor.java:632)
	at java.lang.Thread.run(java.base@9-ea/Thread.java:843)
Cannot nest operations in the same thread. Each nested operation must run in its own thread.
java.lang.UnsupportedOperationException: Cannot nest operations in the same thread. Each nested
operation must run in its own thread.
	at org.gradle.internal.operations.DefaultBuildOperationWorkerRegistry.doStartOperation(DefaultBuildOperationWorkerRegistry.java:65)
	at org.gradle.internal.operations.DefaultBuildOperationWorkerRegistry.access$400(DefaultBuildOperationWorkerRegistry.java:30)
	at org.gradle.internal.operations.DefaultBuildOperationWorkerRegistry$DefaultOperation.operationStart(DefaultBuildOperationWorkerRegistry.java:163)
	at org.gradle.api.internal.tasks.testing.worker.ForkingTestClassProcessor.processTestClass(ForkingTestClassProcessor.java:68)
	at org.gradle.api.internal.tasks.testing.processors.RestartEveryNTestClassProcessor.processTestClass(RestartEveryNTestClassProcessor.java:47)
	at jdk.internal.reflect.NativeMethodAccessorImpl.invoke0(java.base@9-ea/Native Method)
	at jdk.internal.reflect.NativeMethodAccessorImpl.invoke(java.base@9-ea/NativeMethodAccessorImpl.java:62)
	at jdk.internal.reflect.DelegatingMethodAccessorImpl.invoke(java.base@9-ea/DelegatingMethodAccessorImpl.java:43)
	at java.lang.reflect.Method.invoke(java.base@9-ea/Method.java:535)
	at org.gradle.internal.dispatch.ReflectionDispatch.dispatch(ReflectionDispatch.java:35)
	at org.gradle.internal.dispatch.ReflectionDispatch.dispatch(ReflectionDispatch.java:24)
	at org.gradle.internal.dispatch.FailureHandlingDispatch.dispatch(FailureHandlingDispatch.java:29)
	at org.gradle.internal.dispatch.AsyncDispatch.dispatchMessages(AsyncDispatch.java:132)
	at org.gradle.internal.dispatch.AsyncDispatch.access$000(AsyncDispatch.java:33)
	at org.gradle.internal.dispatch.AsyncDispatch$1.run(AsyncDispatch.java:72)
	at org.gradle.internal.concurrent.ExecutorPolicy$CatchAndRecordFailures.onExecute(ExecutorPolicy.java:54)
	at org.gradle.internal.concurrent.StoppableExecutorImpl$1.run(StoppableExecutorImpl.java:40)
	at java.util.concurrent.ThreadPoolExecutor.runWorker(java.base@9-ea/ThreadPoolExecutor.java:1158)
	at java.util.concurrent.ThreadPoolExecutor$Worker.run(java.base@9-ea/ThreadPoolExecutor.java:632)
	at java.lang.Thread.run(java.base@9-ea/Thread.java:843)
Cannot nest operations in the same thread. Each nested operation must run in its own thread.
java.lang.UnsupportedOperationException: Cannot nest operations in the same thread. Each nested
operation must run in its own thread.
	at org.gradle.internal.operations.DefaultBuildOperationWorkerRegistry.doStartOperation(DefaultBuildOperationWorkerRegistry.java:65)
	at org.gradle.internal.operations.DefaultBuildOperationWorkerRegistry.access$400(DefaultBuildOperationWorkerRegistry.java:30)
	at org.gradle.internal.operations.DefaultBuildOperationWorkerRegistry$DefaultOperation.operationStart(DefaultBuildOperationWorkerRegistry.java:163)
	at org.gradle.api.internal.tasks.testing.worker.ForkingTestClassProcessor.processTestClass(ForkingTestClassProcessor.java:68)
	at org.gradle.api.internal.tasks.testing.processors.RestartEveryNTestClassProcessor.processTestClass(RestartEveryNTestClassProcessor.java:47)
	at jdk.internal.reflect.GeneratedMethodAccessor466.invoke(Unknown Source)
	at jdk.internal.reflect.DelegatingMethodAccessorImpl.invoke(java.base@9-ea/DelegatingMethodAccessorImpl.java:43)
	at java.lang.reflect.Method.invoke(java.base@9-ea/Method.java:535)
	at org.gradle.internal.dispatch.ReflectionDispatch.dispatch(ReflectionDispatch.java:35)
	at org.gradle.internal.dispatch.ReflectionDispatch.dispatch(ReflectionDispatch.java:24)
	at org.gradle.internal.dispatch.FailureHandlingDispatch.dispatch(FailureHandlingDispatch.java:29)
	at org.gradle.internal.dispatch.AsyncDispatch.dispatchMessages(AsyncDispatch.java:132)
	at org.gradle.internal.dispatch.AsyncDispatch.access$000(AsyncDispatch.java:33)
	at org.gradle.internal.dispatch.AsyncDispatch$1.run(AsyncDispatch.java:72)
	at org.gradle.internal.concurrent.ExecutorPolicy$CatchAndRecordFailures.onExecute(ExecutorPolicy.java:54)
	at org.gradle.internal.concurrent.StoppableExecutorImpl$1.run(StoppableExecutorImpl.java:40)
	at java.util.concurrent.ThreadPoolExecutor.runWorker(java.base@9-ea/ThreadPoolExecutor.java:1158)
	at java.util.concurrent.ThreadPoolExecutor$Worker.run(java.base@9-ea/ThreadPoolExecutor.java:632)
	at java.lang.Thread.run(java.base@9-ea/Thread.java:843)
Cannot nest operations in the same thread. Each nested operation must run in its own thread.
java.lang.UnsupportedOperationException: Cannot nest operations in the same thread. Each nested
operation must run in its own thread.
	at org.gradle.internal.operations.DefaultBuildOperationWorkerRegistry.doStartOperation(DefaultBuildOperationWorkerRegistry.java:65)
	at org.gradle.internal.operations.DefaultBuildOperationWorkerRegistry.access$400(DefaultBuildOperationWorkerRegistry.java:30)
	at org.gradle.internal.operations.DefaultBuildOperationWorkerRegistry$DefaultOperation.operationStart(DefaultBuildOperationWorkerRegistry.java:163)
	at org.gradle.api.internal.tasks.testing.worker.ForkingTestClassProcessor.processTestClass(ForkingTestClassProcessor.java:68)
	at org.gradle.api.internal.tasks.testing.processors.RestartEveryNTestClassProcessor.processTestClass(RestartEveryNTestClassProcessor.java:47)
	at jdk.internal.reflect.GeneratedMethodAccessor466.invoke(Unknown Source)
	at jdk.internal.reflect.DelegatingMethodAccessorImpl.invoke(java.base@9-ea/DelegatingMethodAccessorImpl.java:43)
	at java.lang.reflect.Method.invoke(java.base@9-ea/Method.java:535)
	at org.gradle.internal.dispatch.ReflectionDispatch.dispatch(ReflectionDispatch.java:35)
	at org.gradle.internal.dispatch.ReflectionDispatch.dispatch(ReflectionDispatch.java:24)
	at org.gradle.internal.dispatch.FailureHandlingDispatch.dispatch(FailureHandlingDispatch.java:29)
	at org.gradle.internal.dispatch.AsyncDispatch.dispatchMessages(AsyncDispatch.java:132)
	at org.gradle.internal.dispatch.AsyncDispatch.access$000(AsyncDispatch.java:33)
	at org.gradle.internal.dispatch.AsyncDispatch$1.run(AsyncDispatch.java:72)
	at org.gradle.internal.concurrent.ExecutorPolicy$CatchAndRecordFailures.onExecute(ExecutorPolicy.java:54)
	at org.gradle.internal.concurrent.StoppableExecutorImpl$1.run(StoppableExecutorImpl.java:40)
	at java.util.concurrent.ThreadPoolExecutor.runWorker(java.base@9-ea/ThreadPoolExecutor.java:1158)
	at java.util.concurrent.ThreadPoolExecutor$Worker.run(java.base@9-ea/ThreadPoolExecutor.java:632)
	at java.lang.Thread.run(java.base@9-ea/Thread.java:843)
Cannot nest operations in the same thread. Each nested operation must run in its own thread.
java.lang.UnsupportedOperationException: Cannot nest operations in the same thread. Each nested
operation must run in its own thread.
	at org.gradle.internal.operations.DefaultBuildOperationWorkerRegistry.doStartOperation(DefaultBuildOperationWorkerRegistry.java:65)
	at org.gradle.internal.operations.DefaultBuildOperationWorkerRegistry.access$400(DefaultBuildOperationWorkerRegistry.java:30)
	at org.gradle.internal.operations.DefaultBuildOperationWorkerRegistry$DefaultOperation.operationStart(DefaultBuildOperationWorkerRegistry.java:163)
	at org.gradle.api.internal.tasks.testing.worker.ForkingTestClassProcessor.processTestClass(ForkingTestClassProcessor.java:68)
	at org.gradle.api.internal.tasks.testing.processors.RestartEveryNTestClassProcessor.processTestClass(RestartEveryNTestClassProcessor.java:47)
	at jdk.internal.reflect.GeneratedMethodAccessor466.invoke(Unknown Source)
	at jdk.internal.reflect.DelegatingMethodAccessorImpl.invoke(java.base@9-ea/DelegatingMethodAccessorImpl.java:43)
	at java.lang.reflect.Method.invoke(java.base@9-ea/Method.java:535)
	at org.gradle.internal.dispatch.ReflectionDispatch.dispatch(ReflectionDispatch.java:35)
	at org.gradle.internal.dispatch.ReflectionDispatch.dispatch(ReflectionDispatch.java:24)
	at org.gradle.internal.dispatch.FailureHandlingDispatch.dispatch(FailureHandlingDispatch.java:29)
	at org.gradle.internal.dispatch.AsyncDispatch.dispatchMessages(AsyncDispatch.java:132)
	at org.gradle.internal.dispatch.AsyncDispatch.access$000(AsyncDispatch.java:33)
	at org.gradle.internal.dispatch.AsyncDispatch$1.run(AsyncDispatch.java:72)
	at org.gradle.internal.concurrent.ExecutorPolicy$CatchAndRecordFailures.onExecute(ExecutorPolicy.java:54)
	at org.gradle.internal.concurrent.StoppableExecutorImpl$1.run(StoppableExecutorImpl.java:40)
	at java.util.concurrent.ThreadPoolExecutor.runWorker(java.base@9-ea/ThreadPoolExecutor.java:1158)
	at java.util.concurrent.ThreadPoolExecutor$Worker.run(java.base@9-ea/ThreadPoolExecutor.java:632)
	at java.lang.Thread.run(java.base@9-ea/Thread.java:843)
Cannot nest operations in the same thread. Each nested operation must run in its own thread.
java.lang.UnsupportedOperationException: Cannot nest operations in the same thread. Each nested
operation must run in its own thread.
	at org.gradle.internal.operations.DefaultBuildOperationWorkerRegistry.doStartOperation(DefaultBuildOperationWorkerRegistry.java:65)
	at org.gradle.internal.operations.DefaultBuildOperationWorkerRegistry.access$400(DefaultBuildOperationWorkerRegistry.java:30)
	at org.gradle.internal.operations.DefaultBuildOperationWorkerRegistry$DefaultOperation.operationStart(DefaultBuildOperationWorkerRegistry.java:163)
	at org.gradle.api.internal.tasks.testing.worker.ForkingTestClassProcessor.processTestClass(ForkingTestClassProcessor.java:68)
	at org.gradle.api.internal.tasks.testing.processors.RestartEveryNTestClassProcessor.processTestClass(RestartEveryNTestClassProcessor.java:47)
	at jdk.internal.reflect.GeneratedMethodAccessor466.invoke(Unknown Source)
	at jdk.internal.reflect.DelegatingMethodAccessorImpl.invoke(java.base@9-ea/DelegatingMethodAccessorImpl.java:43)
	at java.lang.reflect.Method.invoke(java.base@9-ea/Method.java:535)
	at org.gradle.internal.dispatch.ReflectionDispatch.dispatch(ReflectionDispatch.java:35)
	at org.gradle.internal.dispatch.ReflectionDispatch.dispatch(ReflectionDispatch.java:24)
	at org.gradle.internal.dispatch.FailureHandlingDispatch.dispatch(FailureHandlingDispatch.java:29)
	at org.gradle.internal.dispatch.AsyncDispatch.dispatchMessages(AsyncDispatch.java:132)
	at org.gradle.internal.dispatch.AsyncDispatch.access$000(AsyncDispatch.java:33)
	at org.gradle.internal.dispatch.AsyncDispatch$1.run(AsyncDispatch.java:72)
	at org.gradle.internal.concurrent.ExecutorPolicy$CatchAndRecordFailures.onExecute(ExecutorPolicy.java:54)
	at org.gradle.internal.concurrent.StoppableExecutorImpl$1.run(StoppableExecutorImpl.java:40)
	at java.util.concurrent.ThreadPoolExecutor.runWorker(java.base@9-ea/ThreadPoolExecutor.java:1158)
	at java.util.concurrent.ThreadPoolExecutor$Worker.run(java.base@9-ea/ThreadPoolExecutor.java:632)
	at java.lang.Thread.run(java.base@9-ea/Thread.java:843)
Cannot nest operations in the same thread. Each nested operation must run in its own thread.
java.lang.UnsupportedOperationException: Cannot nest operations in the same thread. Each nested
operation must run in its own thread.
	at org.gradle.internal.operations.DefaultBuildOperationWorkerRegistry.doStartOperation(DefaultBuildOperationWorkerRegistry.java:65)
	at org.gradle.internal.operations.DefaultBuildOperationWorkerRegistry.access$400(DefaultBuildOperationWorkerRegistry.java:30)
	at org.gradle.internal.operations.DefaultBuildOperationWorkerRegistry$DefaultOperation.operationStart(DefaultBuildOperationWorkerRegistry.java:163)
	at org.gradle.api.internal.tasks.testing.worker.ForkingTestClassProcessor.processTestClass(ForkingTestClassProcessor.java:68)
	at org.gradle.api.internal.tasks.testing.processors.RestartEveryNTestClassProcessor.processTestClass(RestartEveryNTestClassProcessor.java:47)
	at jdk.internal.reflect.GeneratedMethodAccessor466.invoke(Unknown Source)
	at jdk.internal.reflect.DelegatingMethodAccessorImpl.invoke(java.base@9-ea/DelegatingMethodAccessorImpl.java:43)
	at java.lang.reflect.Method.invoke(java.base@9-ea/Method.java:535)
	at org.gradle.internal.dispatch.ReflectionDispatch.dispatch(ReflectionDispatch.java:35)
	at org.gradle.internal.dispatch.ReflectionDispatch.dispatch(ReflectionDispatch.java:24)
	at org.gradle.internal.dispatch.FailureHandlingDispatch.dispatch(FailureHandlingDispatch.java:29)
	at org.gradle.internal.dispatch.AsyncDispatch.dispatchMessages(AsyncDispatch.java:132)
	at org.gradle.internal.dispatch.AsyncDispatch.access$000(AsyncDispatch.java:33)
	at org.gradle.internal.dispatch.AsyncDispatch$1.run(AsyncDispatch.java:72)
	at org.gradle.internal.concurrent.ExecutorPolicy$CatchAndRecordFailures.onExecute(ExecutorPolicy.java:54)
	at org.gradle.internal.concurrent.StoppableExecutorImpl$1.run(StoppableExecutorImpl.java:40)
	at java.util.concurrent.ThreadPoolExecutor.runWorker(java.base@9-ea/ThreadPoolExecutor.java:1158)
	at java.util.concurrent.ThreadPoolExecutor$Worker.run(java.base@9-ea/ThreadPoolExecutor.java:632)
	at java.lang.Thread.run(java.base@9-ea/Thread.java:843)
Cannot nest operations in the same thread. Each nested operation must run in its own thread.
java.lang.UnsupportedOperationException: Cannot nest operations in the same thread. Each nested
operation must run in its own thread.
	at org.gradle.internal.operations.DefaultBuildOperationWorkerRegistry.doStartOperation(DefaultBuildOperationWorkerRegistry.java:65)
	at org.gradle.internal.operations.DefaultBuildOperationWorkerRegistry.access$400(DefaultBuildOperationWorkerRegistry.java:30)
	at org.gradle.internal.operations.DefaultBuildOperationWorkerRegistry$DefaultOperation.operationStart(DefaultBuildOperationWorkerRegistry.java:163)
	at org.gradle.api.internal.tasks.testing.worker.ForkingTestClassProcessor.processTestClass(ForkingTestClassProcessor.java:68)
	at org.gradle.api.internal.tasks.testing.processors.RestartEveryNTestClassProcessor.processTestClass(RestartEveryNTestClassProcessor.java:47)
	at jdk.internal.reflect.GeneratedMethodAccessor466.invoke(Unknown Source)
	at jdk.internal.reflect.DelegatingMethodAccessorImpl.invoke(java.base@9-ea/DelegatingMethodAccessorImpl.java:43)
	at java.lang.reflect.Method.invoke(java.base@9-ea/Method.java:535)
	at org.gradle.internal.dispatch.ReflectionDispatch.dispatch(ReflectionDispatch.java:35)
	at org.gradle.internal.dispatch.ReflectionDispatch.dispatch(ReflectionDispatch.java:24)
	at org.gradle.internal.dispatch.FailureHandlingDispatch.dispatch(FailureHandlingDispatch.java:29)
	at org.gradle.internal.dispatch.AsyncDispatch.dispatchMessages(AsyncDispatch.java:132)
	at org.gradle.internal.dispatch.AsyncDispatch.access$000(AsyncDispatch.java:33)
	at org.gradle.internal.dispatch.AsyncDispatch$1.run(AsyncDispatch.java:72)
	at org.gradle.internal.concurrent.ExecutorPolicy$CatchAndRecordFailures.onExecute(ExecutorPolicy.java:54)
	at org.gradle.internal.concurrent.StoppableExecutorImpl$1.run(StoppableExecutorImpl.java:40)
	at java.util.concurrent.ThreadPoolExecutor.runWorker(java.base@9-ea/ThreadPoolExecutor.java:1158)
	at java.util.concurrent.ThreadPoolExecutor$Worker.run(java.base@9-ea/ThreadPoolExecutor.java:632)
	at java.lang.Thread.run(java.base@9-ea/Thread.java:843)
:org.apache.zest.core:org.apache.zest.core.api:test FAILED

FAILURE: Build failed with an exception.

* What went wrong:
Some child operations have not yet completed.

* Try:
Run with --stacktrace option to get the stack trace. Run with --info or --debug option to
get more log output.

BUILD FAILED

Total time: 1 mins 51.091 secs

FAILURE: Build failed with an exception.

* What went wrong:
Some build operations have not been marked as completed.

* Try:
Run with --stacktrace option to get the stack trace. Run with --info or --debug option to
get more log output.
Build step 'Invoke Gradle script' changed build result to FAILURE
Build step 'Invoke Gradle script' marked build as failure
Recording test results
ERROR: Step ?Publish JUnit test result report? failed: No test report files were found. Configuration
error?


Mime
View raw message