polygene-dev mailing list archives

Site index · List index
Message view « Date » · « Thread »
Top « Date » · « Thread »
From Apache Jenkins Server <jenk...@builds.apache.org>
Subject Build failed in Jenkins: Zest(JavaEdition)-develop-java8-checkDists #86
Date Tue, 27 Sep 2016 11:47:49 GMT
See <https://builds.apache.org/job/Zest(JavaEdition)-develop-java8-checkDists/86/changes>

Changes:

[paulmerlin] Minor changes to UnitOfWorkInstance

[paulmerlin] Minor edits in Metrics API/SPI

[paulmerlin] Upgrade Gradle to 3.1

[paulmerlin] ZEST-177 ElasticSearch 2.x does not support in-memory indices

[paulmerlin] JMX: fix and enable tests

[paulmerlin] Explicit Hamcrest testCompile dependency

------------------------------------------
[...truncated 7917 lines...]
:org.apache.zest:org.apache.zest.tutorials:org.apache.zest.tutorial.cargo:signArchives SKIPPED
:org.apache.zest:org.apache.zest.tutorials:org.apache.zest.tutorial.cargo:assemble
:org.apache.zest:org.apache.zest.tutorials:org.apache.zest.tutorial.cargo:dependencyReport
:org.apache.zest:org.apache.zest.tutorials:org.apache.zest.tutorial.composites:processVersionResources
UP-TO-DATE
:org.apache.zest:org.apache.zest.tutorials:org.apache.zest.tutorial.composites:versionClasses
:org.apache.zest:org.apache.zest.tutorials:org.apache.zest.tutorial.composites:jar
:org.apache.zest:org.apache.zest.tutorials:org.apache.zest.tutorial.composites:javadoc
:org.apache.zest:org.apache.zest.tutorials:org.apache.zest.tutorial.composites:javadocJar
:org.apache.zest:org.apache.zest.tutorials:org.apache.zest.tutorial.composites:sourceJar
:org.apache.zest:org.apache.zest.tutorials:org.apache.zest.tutorial.composites:testSourceJar
:org.apache.zest:org.apache.zest.tutorials:org.apache.zest.tutorial.composites:signArchives
SKIPPED
:org.apache.zest:org.apache.zest.tutorials:org.apache.zest.tutorial.composites:assemble
:org.apache.zest:org.apache.zest.tutorials:org.apache.zest.tutorial.composites:dependencyReport
:org.apache.zest:org.apache.zest.tutorials:org.apache.zest.tutorial.hello:processVersionResources
UP-TO-DATE
:org.apache.zest:org.apache.zest.tutorials:org.apache.zest.tutorial.hello:versionClasses
:org.apache.zest:org.apache.zest.tutorials:org.apache.zest.tutorial.hello:jar
:org.apache.zest:org.apache.zest.tutorials:org.apache.zest.tutorial.hello:javadoc
:org.apache.zest:org.apache.zest.tutorials:org.apache.zest.tutorial.hello:javadocJar
:org.apache.zest:org.apache.zest.tutorials:org.apache.zest.tutorial.hello:sourceJar
:org.apache.zest:org.apache.zest.tutorials:org.apache.zest.tutorial.hello:testSourceJar
:org.apache.zest:org.apache.zest.tutorials:org.apache.zest.tutorial.hello:signArchives SKIPPED
:org.apache.zest:org.apache.zest.tutorials:org.apache.zest.tutorial.hello:assemble
:org.apache.zest:org.apache.zest.tutorials:org.apache.zest.tutorial.hello:dependencyReport
:org.apache.zest:org.apache.zest.tutorials:org.apache.zest.tutorial.introduction:processVersionResources
UP-TO-DATE
:org.apache.zest:org.apache.zest.tutorials:org.apache.zest.tutorial.introduction:versionClasses
:org.apache.zest:org.apache.zest.tutorials:org.apache.zest.tutorial.introduction:jar
:org.apache.zest:org.apache.zest.tutorials:org.apache.zest.tutorial.introduction:javadoc
:org.apache.zest:org.apache.zest.tutorials:org.apache.zest.tutorial.introduction:javadocJar
:org.apache.zest:org.apache.zest.tutorials:org.apache.zest.tutorial.introduction:sourceJar
:org.apache.zest:org.apache.zest.tutorials:org.apache.zest.tutorial.introduction:testSourceJar
:org.apache.zest:org.apache.zest.tutorials:org.apache.zest.tutorial.introduction:signArchives
SKIPPED
:org.apache.zest:org.apache.zest.tutorials:org.apache.zest.tutorial.introduction:assemble
:org.apache.zest:org.apache.zest.tutorials:org.apache.zest.tutorial.introduction:dependencyReport
:org.apache.zest:org.apache.zest.tutorials:org.apache.zest.tutorial.services:processVersionResources
UP-TO-DATE
:org.apache.zest:org.apache.zest.tutorials:org.apache.zest.tutorial.services:versionClasses
:org.apache.zest:org.apache.zest.tutorials:org.apache.zest.tutorial.services:jar
:org.apache.zest:org.apache.zest.tutorials:org.apache.zest.tutorial.services:javadoc
:org.apache.zest:org.apache.zest.tutorials:org.apache.zest.tutorial.services:javadocJar
:org.apache.zest:org.apache.zest.tutorials:org.apache.zest.tutorial.services:sourceJar
:org.apache.zest:org.apache.zest.tutorials:org.apache.zest.tutorial.services:testSourceJar
:org.apache.zest:org.apache.zest.tutorials:org.apache.zest.tutorial.services:signArchives
SKIPPED
:org.apache.zest:org.apache.zest.tutorials:org.apache.zest.tutorial.services:assemble
:org.apache.zest:org.apache.zest.tutorials:org.apache.zest.tutorial.services:dependencyReport
:org.apache.zest:org.apache.zest.samples:org.apache.zest.sample.dci-cargo:org.apache.zest.sample.dci-cargo.dcisample_a:processVersionResources
UP-TO-DATE
:org.apache.zest:org.apache.zest.samples:org.apache.zest.sample.dci-cargo:org.apache.zest.sample.dci-cargo.dcisample_a:versionClasses
:org.apache.zest:org.apache.zest.samples:org.apache.zest.sample.dci-cargo:org.apache.zest.sample.dci-cargo.dcisample_a:jar
:org.apache.zest:org.apache.zest.samples:org.apache.zest.sample.dci-cargo:org.apache.zest.sample.dci-cargo.dcisample_a:javadoc<https://builds.apache.org/job/Zest(JavaEdition)-develop-java8-checkDists/ws/build/unpacked-distributions/src/apache-zest-java-3.0-SNAPSHOT-src/samples/dci-cargo/dcisample_a/src/main/java/org/apache/zest/sample/dcicargo/sample_a/infrastructure/dci/RoleMixin.java>:51:
warning: no @param for context
    public void setContext( T context )
                ^
<https://builds.apache.org/job/Zest(JavaEdition)-develop-java8-checkDists/ws/build/unpacked-distributions/src/apache-zest-java-3.0-SNAPSHOT-src/samples/dci-cargo/dcisample_a/src/main/java/org/apache/zest/sample/dcicargo/sample_a/data/shipping/delivery/Delivery.java>:113:
warning: no @return
    Property<ExpectedHandlingEvent> nextExpectedHandlingEvent();
                                    ^
<https://builds.apache.org/job/Zest(JavaEdition)-develop-java8-checkDists/ws/build/unpacked-distributions/src/apache-zest-java-3.0-SNAPSHOT-src/samples/dci-cargo/dcisample_a/src/main/java/org/apache/zest/sample/dcicargo/sample_a/infrastructure/WicketZestApplication.java>:93:
warning: no @return
    protected ApplicationAssembler getAssembler()
                                   ^
<https://builds.apache.org/job/Zest(JavaEdition)-develop-java8-checkDists/ws/build/unpacked-distributions/src/apache-zest-java-3.0-SNAPSHOT-src/samples/dci-cargo/dcisample_a/src/main/java/org/apache/zest/sample/dcicargo/sample_a/infrastructure/WicketZestApplication.java>:93:
warning: no @throws for java.lang.Exception
    protected ApplicationAssembler getAssembler()
                                   ^
<https://builds.apache.org/job/Zest(JavaEdition)-develop-java8-checkDists/ws/build/unpacked-distributions/src/apache-zest-java-3.0-SNAPSHOT-src/samples/dci-cargo/dcisample_a/src/main/java/org/apache/zest/sample/dcicargo/pathfinder_a/api/TransitEdge.java>:41:
warning: no description for @param
     * @param voyageNumber
       ^
<https://builds.apache.org/job/Zest(JavaEdition)-develop-java8-checkDists/ws/build/unpacked-distributions/src/apache-zest-java-3.0-SNAPSHOT-src/samples/dci-cargo/dcisample_a/src/main/java/org/apache/zest/sample/dcicargo/pathfinder_a/api/TransitEdge.java>:42:
warning: no description for @param
     * @param fromUnLocode
       ^
<https://builds.apache.org/job/Zest(JavaEdition)-develop-java8-checkDists/ws/build/unpacked-distributions/src/apache-zest-java-3.0-SNAPSHOT-src/samples/dci-cargo/dcisample_a/src/main/java/org/apache/zest/sample/dcicargo/pathfinder_a/api/TransitEdge.java>:43:
warning: no description for @param
     * @param toUnLocode
       ^
<https://builds.apache.org/job/Zest(JavaEdition)-develop-java8-checkDists/ws/build/unpacked-distributions/src/apache-zest-java-3.0-SNAPSHOT-src/samples/dci-cargo/dcisample_a/src/main/java/org/apache/zest/sample/dcicargo/pathfinder_a/api/TransitEdge.java>:44:
warning: no description for @param
     * @param fromDate
       ^
<https://builds.apache.org/job/Zest(JavaEdition)-develop-java8-checkDists/ws/build/unpacked-distributions/src/apache-zest-java-3.0-SNAPSHOT-src/samples/dci-cargo/dcisample_a/src/main/java/org/apache/zest/sample/dcicargo/pathfinder_a/api/TransitEdge.java>:45:
warning: no description for @param
     * @param toDate
       ^
<https://builds.apache.org/job/Zest(JavaEdition)-develop-java8-checkDists/ws/build/unpacked-distributions/src/apache-zest-java-3.0-SNAPSHOT-src/samples/dci-cargo/dcisample_a/src/main/java/org/apache/zest/sample/dcicargo/sample_a/infrastructure/model/ReadOnlyModel.java>:44:
warning: no description for @throws
     * @throws UnsupportedOperationException
       ^
<https://builds.apache.org/job/Zest(JavaEdition)-develop-java8-checkDists/ws/build/unpacked-distributions/src/apache-zest-java-3.0-SNAPSHOT-src/samples/dci-cargo/dcisample_a/src/main/java/org/apache/zest/sample/dcicargo/sample_a/context/support/RoutingService.java>:61:
warning: no @throws for org.apache.zest.sample.dcicargo.sample_a.context.support.FoundNoRoutesException
    List<Itinerary> fetchRoutesForSpecification( RouteSpecification routeSpecification
)
                    ^

11 warnings
:org.apache.zest:org.apache.zest.samples:org.apache.zest.sample.dci-cargo:org.apache.zest.sample.dci-cargo.dcisample_a:javadocJar
:org.apache.zest:org.apache.zest.samples:org.apache.zest.sample.dci-cargo:org.apache.zest.sample.dci-cargo.dcisample_a:sourceJar
:org.apache.zest:org.apache.zest.samples:org.apache.zest.sample.dci-cargo:org.apache.zest.sample.dci-cargo.dcisample_a:testSourceJar
:org.apache.zest:org.apache.zest.samples:org.apache.zest.sample.dci-cargo:org.apache.zest.sample.dci-cargo.dcisample_a:signArchives
SKIPPED
:org.apache.zest:org.apache.zest.samples:org.apache.zest.sample.dci-cargo:org.apache.zest.sample.dci-cargo.dcisample_a:assemble
:org.apache.zest:org.apache.zest.samples:org.apache.zest.sample.dci-cargo:org.apache.zest.sample.dci-cargo.dcisample_a:dependencyReport
:org.apache.zest:org.apache.zest.samples:org.apache.zest.sample.dci-cargo:org.apache.zest.sample.dci-cargo.dcisample_b:processVersionResources
UP-TO-DATE
:org.apache.zest:org.apache.zest.samples:org.apache.zest.sample.dci-cargo:org.apache.zest.sample.dci-cargo.dcisample_b:versionClasses
:org.apache.zest:org.apache.zest.samples:org.apache.zest.sample.dci-cargo:org.apache.zest.sample.dci-cargo.dcisample_b:jar
:org.apache.zest:org.apache.zest.samples:org.apache.zest.sample.dci-cargo:org.apache.zest.sample.dci-cargo.dcisample_b:javadoc<https://builds.apache.org/job/Zest(JavaEdition)-develop-java8-checkDists/ws/build/unpacked-distributions/src/apache-zest-java-3.0-SNAPSHOT-src/samples/dci-cargo/dcisample_b/src/main/java/org/apache/zest/sample/dcicargo/pathfinder_b/api/GraphTraversalService.java>:35:
warning: no description for @param
     * @param departureDate
       ^
<https://builds.apache.org/job/Zest(JavaEdition)-develop-java8-checkDists/ws/build/unpacked-distributions/src/apache-zest-java-3.0-SNAPSHOT-src/samples/dci-cargo/dcisample_b/src/main/java/org/apache/zest/sample/dcicargo/sample_b/infrastructure/dci/RoleMixin.java>:62:
warning: no @param for context
    public void setContext( T context )
                ^
<https://builds.apache.org/job/Zest(JavaEdition)-develop-java8-checkDists/ws/build/unpacked-distributions/src/apache-zest-java-3.0-SNAPSHOT-src/samples/dci-cargo/dcisample_b/src/main/java/org/apache/zest/sample/dcicargo/sample_b/infrastructure/model/ReadOnlyModel.java>:51:
warning: no description for @throws
     * @throws UnsupportedOperationException
       ^
<https://builds.apache.org/job/Zest(JavaEdition)-develop-java8-checkDists/ws/build/unpacked-distributions/src/apache-zest-java-3.0-SNAPSHOT-src/samples/dci-cargo/dcisample_b/src/main/java/org/apache/zest/sample/dcicargo/sample_b/infrastructure/WicketZestApplication.java>:95:
warning: no @return
    protected ApplicationAssembler getAssembler()
                                   ^
<https://builds.apache.org/job/Zest(JavaEdition)-develop-java8-checkDists/ws/build/unpacked-distributions/src/apache-zest-java-3.0-SNAPSHOT-src/samples/dci-cargo/dcisample_b/src/main/java/org/apache/zest/sample/dcicargo/sample_b/infrastructure/WicketZestApplication.java>:95:
warning: no @throws for java.lang.Exception
    protected ApplicationAssembler getAssembler()
                                   ^
<https://builds.apache.org/job/Zest(JavaEdition)-develop-java8-checkDists/ws/build/unpacked-distributions/src/apache-zest-java-3.0-SNAPSHOT-src/samples/dci-cargo/dcisample_b/src/main/java/org/apache/zest/sample/dcicargo/sample_b/context/service/routing/RoutingService.java>:62:
warning: no @throws for org.apache.zest.sample.dcicargo.sample_b.context.service.routing.exception.FoundNoRoutesException
    List<Itinerary> fetchRoutesForSpecification( RouteSpecification routeSpecification
)
                    ^

6 warnings
:org.apache.zest:org.apache.zest.samples:org.apache.zest.sample.dci-cargo:org.apache.zest.sample.dci-cargo.dcisample_b:javadocJar
:org.apache.zest:org.apache.zest.samples:org.apache.zest.sample.dci-cargo:org.apache.zest.sample.dci-cargo.dcisample_b:sourceJar
:org.apache.zest:org.apache.zest.samples:org.apache.zest.sample.dci-cargo:org.apache.zest.sample.dci-cargo.dcisample_b:testSourceJar
:org.apache.zest:org.apache.zest.samples:org.apache.zest.sample.dci-cargo:org.apache.zest.sample.dci-cargo.dcisample_b:signArchives
SKIPPED
:org.apache.zest:org.apache.zest.samples:org.apache.zest.sample.dci-cargo:org.apache.zest.sample.dci-cargo.dcisample_b:assemble
:org.apache.zest:org.apache.zest.samples:org.apache.zest.sample.dci-cargo:org.apache.zest.sample.dci-cargo.dcisample_b:dependencyReport
:org.apache.zest:org.apache.zest.tutorials:org.apache.zest.tutorial.introduction:org.apache.zest.tutorial.introduction.tenminutes:javadoc
:org.apache.zest:org.apache.zest.tutorials:org.apache.zest.tutorial.introduction:org.apache.zest.tutorial.introduction.tenminutes:javadocJar
:org.apache.zest:org.apache.zest.tutorials:org.apache.zest.tutorial.introduction:org.apache.zest.tutorial.introduction.tenminutes:sourceJar
:org.apache.zest:org.apache.zest.tutorials:org.apache.zest.tutorial.introduction:org.apache.zest.tutorial.introduction.tenminutes:testSourceJar
:org.apache.zest:org.apache.zest.tutorials:org.apache.zest.tutorial.introduction:org.apache.zest.tutorial.introduction.tenminutes:signArchives
SKIPPED
:org.apache.zest:org.apache.zest.tutorials:org.apache.zest.tutorial.introduction:org.apache.zest.tutorial.introduction.tenminutes:assemble
:org.apache.zest:org.apache.zest.tutorials:org.apache.zest.tutorial.introduction:org.apache.zest.tutorial.introduction.tenminutes:dependencyReport
:org.apache.zest:org.apache.zest.tutorials:org.apache.zest.tutorial.introduction:org.apache.zest.tutorial.introduction.thirtyminutes:processVersionResources
UP-TO-DATE
:org.apache.zest:org.apache.zest.tutorials:org.apache.zest.tutorial.introduction:org.apache.zest.tutorial.introduction.thirtyminutes:versionClasses
:org.apache.zest:org.apache.zest.tutorials:org.apache.zest.tutorial.introduction:org.apache.zest.tutorial.introduction.thirtyminutes:jar
:org.apache.zest:org.apache.zest.tutorials:org.apache.zest.tutorial.introduction:org.apache.zest.tutorial.introduction.thirtyminutes:javadoc
:org.apache.zest:org.apache.zest.tutorials:org.apache.zest.tutorial.introduction:org.apache.zest.tutorial.introduction.thirtyminutes:javadocJar
:org.apache.zest:org.apache.zest.tutorials:org.apache.zest.tutorial.introduction:org.apache.zest.tutorial.introduction.thirtyminutes:sourceJar
:org.apache.zest:org.apache.zest.tutorials:org.apache.zest.tutorial.introduction:org.apache.zest.tutorial.introduction.thirtyminutes:testSourceJar
:org.apache.zest:org.apache.zest.tutorials:org.apache.zest.tutorial.introduction:org.apache.zest.tutorial.introduction.thirtyminutes:signArchives
SKIPPED
:org.apache.zest:org.apache.zest.tutorials:org.apache.zest.tutorial.introduction:org.apache.zest.tutorial.introduction.thirtyminutes:assemble
:org.apache.zest:org.apache.zest.tutorials:org.apache.zest.tutorial.introduction:org.apache.zest.tutorial.introduction.thirtyminutes:dependencyReport
:org.apache.zest:org.apache.zest.tutorials:org.apache.zest.tutorial.introduction:org.apache.zest.tutorial.introduction.twominutes:processVersionResources
UP-TO-DATE
:org.apache.zest:org.apache.zest.tutorials:org.apache.zest.tutorial.introduction:org.apache.zest.tutorial.introduction.twominutes:versionClasses
:org.apache.zest:org.apache.zest.tutorials:org.apache.zest.tutorial.introduction:org.apache.zest.tutorial.introduction.twominutes:jar
:org.apache.zest:org.apache.zest.tutorials:org.apache.zest.tutorial.introduction:org.apache.zest.tutorial.introduction.twominutes:javadoc
:org.apache.zest:org.apache.zest.tutorials:org.apache.zest.tutorial.introduction:org.apache.zest.tutorial.introduction.twominutes:javadocJar
:org.apache.zest:org.apache.zest.tutorials:org.apache.zest.tutorial.introduction:org.apache.zest.tutorial.introduction.twominutes:sourceJar
:org.apache.zest:org.apache.zest.tutorials:org.apache.zest.tutorial.introduction:org.apache.zest.tutorial.introduction.twominutes:testSourceJar
:org.apache.zest:org.apache.zest.tutorials:org.apache.zest.tutorial.introduction:org.apache.zest.tutorial.introduction.twominutes:signArchives
SKIPPED
:org.apache.zest:org.apache.zest.tutorials:org.apache.zest.tutorial.introduction:org.apache.zest.tutorial.introduction.twominutes:assemble
:org.apache.zest:org.apache.zest.tutorials:org.apache.zest.tutorial.introduction:org.apache.zest.tutorial.introduction.twominutes:dependencyReport
:org.apache.zest:buildAll
:org.apache.zest:generateBinDistGoOfflineHelpers
:org.apache.zest:tarBinaries
:org.apache.zest:srcDistFilteredFiles
:org.apache.zest:tarSources
:org.apache.zest:zipBinaries
:org.apache.zest:zipSources
:org.apache.zest:signArchives SKIPPED
:org.apache.zest:assemble
:checkDists

Test failures in:
  org.apache.zest.library.metrics

:checkDists FAILED

FAILURE: Build failed with an exception.

* Where:
Build file '<https://builds.apache.org/job/Zest(JavaEdition)-develop-java8-checkDists/ws/build.gradle'>
line: 467

* What went wrong:
Execution failed for task ':checkDists'.
> There was TEST FAILURES!! See list above.

* Try:
Run with --info or --debug option to get more log output.

* Exception is:
org.gradle.api.tasks.TaskExecutionException: Execution failed for task ':checkDists'.
	at org.gradle.api.internal.tasks.execution.ExecuteActionsTaskExecuter.executeActions(ExecuteActionsTaskExecuter.java:69)
	at org.gradle.api.internal.tasks.execution.ExecuteActionsTaskExecuter.execute(ExecuteActionsTaskExecuter.java:46)
	at org.gradle.api.internal.tasks.execution.PostExecutionAnalysisTaskExecuter.execute(PostExecutionAnalysisTaskExecuter.java:35)
	at org.gradle.api.internal.tasks.execution.SkipUpToDateTaskExecuter.execute(SkipUpToDateTaskExecuter.java:64)
	at org.gradle.api.internal.tasks.execution.ValidatingTaskExecuter.execute(ValidatingTaskExecuter.java:58)
	at org.gradle.api.internal.tasks.execution.SkipEmptySourceFilesTaskExecuter.execute(SkipEmptySourceFilesTaskExecuter.java:52)
	at org.gradle.api.internal.tasks.execution.SkipTaskWithNoActionsExecuter.execute(SkipTaskWithNoActionsExecuter.java:52)
	at org.gradle.api.internal.tasks.execution.SkipOnlyIfTaskExecuter.execute(SkipOnlyIfTaskExecuter.java:53)
	at org.gradle.api.internal.tasks.execution.ExecuteAtMostOnceTaskExecuter.execute(ExecuteAtMostOnceTaskExecuter.java:43)
	at org.gradle.execution.taskgraph.DefaultTaskGraphExecuter$EventFiringTaskWorker.execute(DefaultTaskGraphExecuter.java:233)
	at org.gradle.execution.taskgraph.DefaultTaskGraphExecuter$EventFiringTaskWorker.execute(DefaultTaskGraphExecuter.java:215)
	at org.gradle.execution.taskgraph.AbstractTaskPlanExecutor$TaskExecutorWorker.processTask(AbstractTaskPlanExecutor.java:74)
	at org.gradle.execution.taskgraph.AbstractTaskPlanExecutor$TaskExecutorWorker.run(AbstractTaskPlanExecutor.java:55)
	at org.gradle.execution.taskgraph.DefaultTaskPlanExecutor.process(DefaultTaskPlanExecutor.java:32)
	at org.gradle.execution.taskgraph.DefaultTaskGraphExecuter.execute(DefaultTaskGraphExecuter.java:113)
	at org.gradle.execution.SelectedTaskExecutionAction.execute(SelectedTaskExecutionAction.java:37)
	at org.gradle.execution.DefaultBuildExecuter.execute(DefaultBuildExecuter.java:37)
	at org.gradle.execution.DefaultBuildExecuter.access$000(DefaultBuildExecuter.java:23)
	at org.gradle.execution.DefaultBuildExecuter$1.proceed(DefaultBuildExecuter.java:43)
	at org.gradle.execution.DryRunBuildExecutionAction.execute(DryRunBuildExecutionAction.java:32)
	at org.gradle.execution.DefaultBuildExecuter.execute(DefaultBuildExecuter.java:37)
	at org.gradle.execution.DefaultBuildExecuter.execute(DefaultBuildExecuter.java:30)
	at org.gradle.initialization.DefaultGradleLauncher$4.run(DefaultGradleLauncher.java:186)
	at org.gradle.internal.Factories$1.create(Factories.java:22)
	at org.gradle.internal.progress.DefaultBuildOperationExecutor.run(DefaultBuildOperationExecutor.java:91)
	at org.gradle.internal.progress.DefaultBuildOperationExecutor.run(DefaultBuildOperationExecutor.java:53)
	at org.gradle.initialization.DefaultGradleLauncher.doBuildStages(DefaultGradleLauncher.java:183)
	at org.gradle.initialization.DefaultGradleLauncher.access$200(DefaultGradleLauncher.java:33)
	at org.gradle.initialization.DefaultGradleLauncher$1.create(DefaultGradleLauncher.java:112)
	at org.gradle.initialization.DefaultGradleLauncher$1.create(DefaultGradleLauncher.java:106)
	at org.gradle.internal.progress.DefaultBuildOperationExecutor.run(DefaultBuildOperationExecutor.java:91)
	at org.gradle.internal.progress.DefaultBuildOperationExecutor.run(DefaultBuildOperationExecutor.java:63)
	at org.gradle.initialization.DefaultGradleLauncher.doBuild(DefaultGradleLauncher.java:106)
	at org.gradle.initialization.DefaultGradleLauncher.run(DefaultGradleLauncher.java:92)
	at org.gradle.launcher.exec.GradleBuildController.run(GradleBuildController.java:66)
	at org.gradle.tooling.internal.provider.ExecuteBuildActionRunner.run(ExecuteBuildActionRunner.java:28)
	at org.gradle.launcher.exec.ChainingBuildActionRunner.run(ChainingBuildActionRunner.java:35)
	at org.gradle.launcher.exec.InProcessBuildActionExecuter.execute(InProcessBuildActionExecuter.java:41)
	at org.gradle.launcher.exec.InProcessBuildActionExecuter.execute(InProcessBuildActionExecuter.java:26)
	at org.gradle.tooling.internal.provider.ContinuousBuildActionExecuter.execute(ContinuousBuildActionExecuter.java:79)
	at org.gradle.tooling.internal.provider.ContinuousBuildActionExecuter.execute(ContinuousBuildActionExecuter.java:51)
	at org.gradle.launcher.cli.RunBuildAction.run(RunBuildAction.java:51)
	at org.gradle.internal.Actions$RunnableActionAdapter.execute(Actions.java:173)
	at org.gradle.launcher.cli.CommandLineActionFactory$ParseAndBuildAction.execute(CommandLineActionFactory.java:244)
	at org.gradle.launcher.cli.CommandLineActionFactory$ParseAndBuildAction.execute(CommandLineActionFactory.java:217)
	at org.gradle.launcher.cli.JavaRuntimeValidationAction.execute(JavaRuntimeValidationAction.java:33)
	at org.gradle.launcher.cli.JavaRuntimeValidationAction.execute(JavaRuntimeValidationAction.java:24)
	at org.gradle.launcher.cli.ExceptionReportingAction.execute(ExceptionReportingAction.java:33)
	at org.gradle.launcher.cli.ExceptionReportingAction.execute(ExceptionReportingAction.java:22)
	at org.gradle.launcher.cli.CommandLineActionFactory$WithLogging.execute(CommandLineActionFactory.java:210)
	at org.gradle.launcher.cli.CommandLineActionFactory$WithLogging.execute(CommandLineActionFactory.java:174)
	at org.gradle.launcher.Main.doAction(Main.java:33)
	at org.gradle.launcher.bootstrap.EntryPoint.run(EntryPoint.java:45)
	at org.gradle.launcher.bootstrap.ProcessBootstrap.runNoExit(ProcessBootstrap.java:60)
	at org.gradle.launcher.bootstrap.ProcessBootstrap.run(ProcessBootstrap.java:37)
	at org.gradle.launcher.GradleMain.main(GradleMain.java:23)
	at org.gradle.wrapper.BootstrapMainStarter.start(BootstrapMainStarter.java:30)
	at org.gradle.wrapper.WrapperExecutor.execute(WrapperExecutor.java:129)
	at org.gradle.wrapper.GradleWrapperMain.main(GradleWrapperMain.java:61)
Caused by: java.lang.RuntimeException: There was TEST FAILURES!! See list above.
	at build_1dgf3dq1ijbylpkvrcquzmne9$_run_closure7$_closure101.doCall(<https://builds.apache.org/job/Zest(JavaEdition)-develop-java8-checkDists/ws/build.gradle>:467)
	at org.gradle.api.internal.AbstractTask$ClosureTaskAction.execute(AbstractTask.java:587)
	at org.gradle.api.internal.AbstractTask$ClosureTaskAction.execute(AbstractTask.java:568)
	at org.gradle.api.internal.tasks.execution.ExecuteActionsTaskExecuter.executeAction(ExecuteActionsTaskExecuter.java:80)
	at org.gradle.api.internal.tasks.execution.ExecuteActionsTaskExecuter.executeActions(ExecuteActionsTaskExecuter.java:61)
	... 58 more


BUILD FAILED

Total time: 30 mins 59.569 secs
Build step 'Invoke Gradle script' changed build result to FAILURE
Build step 'Invoke Gradle script' marked build as failure
Archiving artifacts
Recording test results
Publishing Javadoc

Mime
View raw message