polygene-dev mailing list archives

Site index · List index
Message view « Date » · « Thread »
Top « Date » · « Thread »
From Apache Jenkins Server <jenk...@builds.apache.org>
Subject Build failed in Jenkins: Zest(JavaEdition)-develop-java8-checkDists #72
Date Sun, 12 Jun 2016 11:08:20 GMT
See <https://builds.apache.org/job/Zest(JavaEdition)-develop-java8-checkDists/72/changes>

Changes:

[niclas] ZEST-124 - Replaced Joda Time API with Java Time API, and I also removed

[niclas] ZEST-124 - Fixed some of the refactoring bugs.

[niclas] ZEST-124 - Fixed Solr Time API refactoring bug. java.util.Date is needed

[niclas] ZEST-124 - Added more asserts in Entity Store test suite.

[niclas] ZEST-151 : Removed Conversion Library

------------------------------------------
[...truncated 60 lines...]
Project: org.apache.zest.library.eventsourcing-jdbm
Project: org.apache.zest.library.eventsourcing-rest
Project: org.apache.zest.library.fileconfig
Project: org.apache.zest.library.http
Project: org.apache.zest.library.invocation-cache
Project: org.apache.zest.library.lang-groovy
Project: org.apache.zest.library.lang-javascript
Project: org.apache.zest.library.lang-scala
Project: org.apache.zest.library.jmx
Project: org.apache.zest.library.locking
Project: org.apache.zest.library.logging
Project: org.apache.zest.library.metrics
Project: org.apache.zest.library.osgi
Project: org.apache.zest.library.rdf
Project: org.apache.zest.library.rest
Project: org.apache.zest.library.rest-client
Project: org.apache.zest.library.rest-common
Project: org.apache.zest.library.rest-server
Project: org.apache.zest.library.restlet
Project: org.apache.zest.library.scheduler
Project: org.apache.zest.library.scripting
Project: org.apache.zest.library.servlet
Project: org.apache.zest.library.shiro-core
Project: org.apache.zest.library.shiro-web
Project: org.apache.zest.library.spring
Project: org.apache.zest.library.sql
Project: org.apache.zest.library.sql-bonecp
Project: org.apache.zest.library.sql-dbcp
Project: org.apache.zest.library.sql-liquibase
Project: org.apache.zest.library.uid
Project: org.apache.zest.library.uowfile
Project: org.apache.zest.extensions
Project: org.apache.zest.extension.cache-ehcache
Project: org.apache.zest.extension.cache-memcache
Project: org.apache.zest.extension.entitystore-memory
Project: org.apache.zest.extension.entitystore-file
Project: org.apache.zest.extension.entitystore-hazelcast
Project: org.apache.zest.extension.entitystore-jclouds
Project: org.apache.zest.extension.entitystore-jdbm
Project: org.apache.zest.extension.entitystore-leveldb
Project: org.apache.zest.extension.entitystore-mongodb
Project: org.apache.zest.extension.entitystore-preferences
Project: org.apache.zest.extension.entitystore-redis
Project: org.apache.zest.extension.entitystore-riak
Project: org.apache.zest.extension.entitystore-sql
Project: org.apache.zest.extension.indexing-elasticsearch
Project: org.apache.zest.extension.indexing-rdf
Project: org.apache.zest.extension.indexing-solr
Project: org.apache.zest.extension.indexing-sql
Project: org.apache.zest.extension.metrics-yammer
Project: org.apache.zest.extension.migration
Project: org.apache.zest.extension.reindexer
Project: org.apache.zest.extension.valueserialization-orgjson
Project: org.apache.zest.extension.valueserialization-jackson
Project: org.apache.zest.extension.valueserialization-stax
Project: org.apache.zest.manual
Project: org.apache.zest.samples
Project: org.apache.zest.sample.dci
Project: org.apache.zest.sample.dci-cargo
Project: org.apache.zest.sample.dci-cargo.dcisample_a
Project: org.apache.zest.sample.dci-cargo.dcisample_b
Project: org.apache.zest.sample.forum
Project: org.apache.zest.sample.rental
Project: org.apache.zest.sample.sql-support
Project: org.apache.zest.sample.swing
Project: org.apache.zest.tools
Project: org.apache.zest.tool.model-detail
Project: org.apache.zest.tool.envisage
Project: org.apache.zest.tool.shell
Project: org.apache.zest.tutorials
Project: org.apache.zest.tutorial.cargo
Project: org.apache.zest.tutorial.composites
Project: org.apache.zest.tutorial.hello
Project: org.apache.zest.tutorial.introduction
Project: org.apache.zest.tutorial.introduction.twominutes
Project: org.apache.zest.tutorial.introduction.tenminutes
Project: org.apache.zest.tutorial.introduction.thirtyminutes
Project: org.apache.zest.tutorial.services
Project: org.apache.zest.tests
Project: org.apache.zest.test.regression
Project: org.apache.zest.test.performance
org.apache.zest.core.api(true) -> stable, good, good
org.apache.zest.core.bootstrap(true) -> stable, brief, good
org.apache.zest.core.functional(true) -> beta, good, good
org.apache.zest.core.io(true) -> beta, good, good
org.apache.zest.core.runtime(true) -> stable, brief, good
org.apache.zest.core.spi(true) -> stable, brief, good
org.apache.zest.core.testsupport(true) -> stable, brief, none
org.apache.zest.extension.cache-ehcache(true) -> beta, brief, some
org.apache.zest.extension.cache-memcache(true) -> beta, brief, some
org.apache.zest.extension.entitystore-file(true) -> stable, good, good
org.apache.zest.extension.entitystore-hazelcast(true) -> stable, brief, good
org.apache.zest.extension.entitystore-jclouds(true) -> stable, brief, good
org.apache.zest.extension.entitystore-jdbm(true) -> stable, brief, good
org.apache.zest.extension.entitystore-leveldb(true) -> beta, brief, good
org.apache.zest.extension.entitystore-memory(true) -> stable, good, good
org.apache.zest.extension.entitystore-mongodb(true) -> stable, brief, good
org.apache.zest.extension.entitystore-preferences(true) -> stable, brief, good
org.apache.zest.extension.entitystore-redis(true) -> beta, good, good
org.apache.zest.extension.entitystore-riak(true) -> beta, good, good
org.apache.zest.extension.entitystore-sql(true) -> stable, good, good
org.apache.zest.extension.indexing-elasticsearch(true) -> beta, good, good
org.apache.zest.extension.indexing-rdf(true) -> stable, brief, good
org.apache.zest.extension.indexing-solr(true) -> stable, brief, some
org.apache.zest.extension.indexing-sql(true) -> stable, brief, good
org.apache.zest.extension.metrics-yammer(true) -> stable, none, some
org.apache.zest.extension.migration(true) -> stable, none, some
org.apache.zest.extension.reindexer(true) -> stable, none, some
org.apache.zest.extension.valueserialization-jackson(true) -> beta, good, complete
org.apache.zest.extension.valueserialization-orgjson(true) -> stable, good, complete
org.apache.zest.extension.valueserialization-stax(true) -> beta, good, complete
org.apache.zest.library.alarm(true) -> stable, brief, some
org.apache.zest.library.circuitbreaker(true) -> stable, good, good
org.apache.zest.library.constraints(true) -> stable, good, good
org.apache.zest.library.eventsourcing(true) -> beta, brief, some
org.apache.zest.library.eventsourcing-jdbm(true) -> beta, brief, some
org.apache.zest.library.eventsourcing-rest(true) -> beta, brief, some
org.apache.zest.library.fileconfig(true) -> stable, good, good
org.apache.zest.library.http(true) -> stable, good, good
org.apache.zest.library.invocation-cache(true) -> stable, brief, none
org.apache.zest.library.jmx(true) -> stable, brief, some
org.apache.zest.library.lang-groovy(true) -> beta, good, good
org.apache.zest.library.lang-javascript(true) -> beta, brief, some
org.apache.zest.library.lang-scala(true) -> beta, brief, some
org.apache.zest.library.locking(true) -> stable, brief, some
org.apache.zest.library.logging(true) -> stable, good, good
org.apache.zest.library.metrics(true) -> beta, brief, some
org.apache.zest.library.osgi(true) -> stable, brief, some
org.apache.zest.library.rdf(true) -> stable, none, some
org.apache.zest.library.rest(true) -> stable, none, none
org.apache.zest.library.rest-client(true) -> stable, good, some
org.apache.zest.library.rest-common(true) -> stable, none, none
org.apache.zest.library.rest-server(true) -> stable, none, none
org.apache.zest.library.restlet(false) -> beta, brief, none
org.apache.zest.library.scheduler(true) -> early, good, good
org.apache.zest.library.scripting(true) -> stable, none, complete
org.apache.zest.library.servlet(true) -> stable, good, good
org.apache.zest.library.shiro-core(true) -> stable, good, good
org.apache.zest.library.shiro-web(true) -> stable, good, good
org.apache.zest.library.spring(true) -> beta, brief, some
org.apache.zest.library.sql(true) -> stable, good, good
org.apache.zest.library.sql-bonecp(true) -> stable, good, good
org.apache.zest.library.sql-dbcp(true) -> stable, good, good
org.apache.zest.library.sql-liquibase(true) -> stable, good, good
org.apache.zest.library.uid(true) -> stable, good, good
org.apache.zest.library.uowfile(true) -> stable, good, complete
org.apache.zest.tool.envisage(true) -> stable, brief, none
org.apache.zest.tool.model-detail(true) -> stable, brief, none
org.apache.zest.tool.shell(true) -> beta, brief, good
useAnt has been deprecated and is scheduled to be removed in Gradle 3.0. The Ant-Based Scala
compiler is deprecated, please see https://docs.gradle.org/current/userguide/scala_plugin.html.
fork has been deprecated and is scheduled to be removed in Gradle 3.0. The fork option for
the scala compiler is deprecated, please see https://docs.gradle.org/current/userguide/scala_plugin.html.

FAILURE: Build failed with an exception.

* Where:
Build file '<https://builds.apache.org/job/Zest(JavaEdition)-develop-java8-checkDists/ws/libraries/sql/build.gradle'>
line: 28

* What went wrong:
A problem occurred evaluating project ':org.apache.zest.libraries:org.apache.zest.library.sql'.
> Project with path ':org.apache.zest.libraries:org.apache.zest.library.conversion' could
not be found in project ':org.apache.zest.libraries:org.apache.zest.library.sql'.

* Try:
Run with --info or --debug option to get more log output.

* Exception is:
org.gradle.api.GradleScriptException: A problem occurred evaluating project ':org.apache.zest.libraries:org.apache.zest.library.sql'.
	at org.gradle.groovy.scripts.internal.DefaultScriptRunnerFactory$ScriptRunnerImpl.run(DefaultScriptRunnerFactory.java:93)
	at org.gradle.configuration.DefaultScriptPluginFactory$ScriptPluginImpl$2.run(DefaultScriptPluginFactory.java:155)
	at org.gradle.configuration.ProjectScriptTarget.addConfiguration(ProjectScriptTarget.java:72)
	at org.gradle.configuration.DefaultScriptPluginFactory$ScriptPluginImpl.apply(DefaultScriptPluginFactory.java:160)
	at org.gradle.configuration.project.BuildScriptProcessor.execute(BuildScriptProcessor.java:38)
	at org.gradle.configuration.project.BuildScriptProcessor.execute(BuildScriptProcessor.java:25)
	at org.gradle.configuration.project.ConfigureActionsProjectEvaluator.evaluate(ConfigureActionsProjectEvaluator.java:34)
	at org.gradle.configuration.project.LifecycleProjectEvaluator.evaluate(LifecycleProjectEvaluator.java:55)
	at org.gradle.api.internal.project.AbstractProject.evaluate(AbstractProject.java:532)
	at org.gradle.api.internal.project.AbstractProject.evaluate(AbstractProject.java:93)
	at org.gradle.execution.TaskPathProjectEvaluator.configureHierarchy(TaskPathProjectEvaluator.java:47)
	at org.gradle.configuration.DefaultBuildConfigurer.configure(DefaultBuildConfigurer.java:35)
	at org.gradle.initialization.DefaultGradleLauncher$2.run(DefaultGradleLauncher.java:125)
	at org.gradle.internal.Factories$1.create(Factories.java:22)
	at org.gradle.internal.progress.DefaultBuildOperationExecutor.run(DefaultBuildOperationExecutor.java:90)
	at org.gradle.internal.progress.DefaultBuildOperationExecutor.run(DefaultBuildOperationExecutor.java:52)
	at org.gradle.initialization.DefaultGradleLauncher.doBuildStages(DefaultGradleLauncher.java:122)
	at org.gradle.initialization.DefaultGradleLauncher.access$200(DefaultGradleLauncher.java:32)
	at org.gradle.initialization.DefaultGradleLauncher$1.create(DefaultGradleLauncher.java:99)
	at org.gradle.initialization.DefaultGradleLauncher$1.create(DefaultGradleLauncher.java:93)
	at org.gradle.internal.progress.DefaultBuildOperationExecutor.run(DefaultBuildOperationExecutor.java:90)
	at org.gradle.internal.progress.DefaultBuildOperationExecutor.run(DefaultBuildOperationExecutor.java:62)
	at org.gradle.initialization.DefaultGradleLauncher.doBuild(DefaultGradleLauncher.java:93)
	at org.gradle.initialization.DefaultGradleLauncher.run(DefaultGradleLauncher.java:82)
	at org.gradle.launcher.exec.InProcessBuildActionExecuter$DefaultBuildController.run(InProcessBuildActionExecuter.java:94)
	at org.gradle.tooling.internal.provider.ExecuteBuildActionRunner.run(ExecuteBuildActionRunner.java:28)
	at org.gradle.launcher.exec.ChainingBuildActionRunner.run(ChainingBuildActionRunner.java:35)
	at org.gradle.launcher.exec.InProcessBuildActionExecuter.execute(InProcessBuildActionExecuter.java:43)
	at org.gradle.launcher.exec.InProcessBuildActionExecuter.execute(InProcessBuildActionExecuter.java:28)
	at org.gradle.launcher.exec.ContinuousBuildActionExecuter.execute(ContinuousBuildActionExecuter.java:75)
	at org.gradle.launcher.exec.ContinuousBuildActionExecuter.execute(ContinuousBuildActionExecuter.java:45)
	at org.gradle.launcher.exec.DaemonUsageSuggestingBuildActionExecuter.execute(DaemonUsageSuggestingBuildActionExecuter.java:51)
	at org.gradle.launcher.exec.DaemonUsageSuggestingBuildActionExecuter.execute(DaemonUsageSuggestingBuildActionExecuter.java:28)
	at org.gradle.launcher.cli.RunBuildAction.run(RunBuildAction.java:43)
	at org.gradle.internal.Actions$RunnableActionAdapter.execute(Actions.java:170)
	at org.gradle.launcher.cli.CommandLineActionFactory$ParseAndBuildAction.execute(CommandLineActionFactory.java:237)
	at org.gradle.launcher.cli.CommandLineActionFactory$ParseAndBuildAction.execute(CommandLineActionFactory.java:210)
	at org.gradle.launcher.cli.JavaRuntimeValidationAction.execute(JavaRuntimeValidationAction.java:35)
	at org.gradle.launcher.cli.JavaRuntimeValidationAction.execute(JavaRuntimeValidationAction.java:24)
	at org.gradle.launcher.cli.CommandLineActionFactory$WithLogging.execute(CommandLineActionFactory.java:206)
	at org.gradle.launcher.cli.CommandLineActionFactory$WithLogging.execute(CommandLineActionFactory.java:169)
	at org.gradle.launcher.cli.ExceptionReportingAction.execute(ExceptionReportingAction.java:33)
	at org.gradle.launcher.cli.ExceptionReportingAction.execute(ExceptionReportingAction.java:22)
	at org.gradle.launcher.Main.doAction(Main.java:33)
	at org.gradle.launcher.bootstrap.EntryPoint.run(EntryPoint.java:45)
	at org.gradle.launcher.bootstrap.ProcessBootstrap.runNoExit(ProcessBootstrap.java:54)
	at org.gradle.launcher.bootstrap.ProcessBootstrap.run(ProcessBootstrap.java:35)
	at org.gradle.launcher.GradleMain.main(GradleMain.java:23)
	at org.gradle.wrapper.BootstrapMainStarter.start(BootstrapMainStarter.java:30)
	at org.gradle.wrapper.WrapperExecutor.execute(WrapperExecutor.java:127)
	at org.gradle.wrapper.GradleWrapperMain.main(GradleWrapperMain.java:55)
Caused by: org.gradle.api.UnknownProjectException: Project with path ':org.apache.zest.libraries:org.apache.zest.library.conversion'
could not be found in project ':org.apache.zest.libraries:org.apache.zest.library.sql'.
	at org.gradle.api.internal.project.AbstractProject.project(AbstractProject.java:478)
	at org.gradle.api.internal.BeanDynamicObject$MetaClassAdapter.invokeMethod(BeanDynamicObject.java:236)
	at org.gradle.api.internal.BeanDynamicObject.invokeMethod(BeanDynamicObject.java:130)
	at org.gradle.api.internal.CompositeDynamicObject.invokeMethod(CompositeDynamicObject.java:150)
	at org.gradle.groovy.scripts.BasicScript.methodMissing(BasicScript.java:79)
	at build_rfan8buomadwre2cexy5u6xc$_run_closure2.doCall(<https://builds.apache.org/job/Zest(JavaEdition)-develop-java8-checkDists/ws/libraries/sql/build.gradle>:28)
	at org.gradle.api.internal.ClosureBackedAction.execute(ClosureBackedAction.java:67)
	at org.gradle.util.ConfigureUtil.configure(ConfigureUtil.java:130)
	at org.gradle.util.ConfigureUtil.configure(ConfigureUtil.java:91)
	at org.gradle.api.internal.project.AbstractProject.dependencies(AbstractProject.java:887)
	at org.gradle.api.internal.BeanDynamicObject$MetaClassAdapter.invokeMethod(BeanDynamicObject.java:236)
	at org.gradle.api.internal.BeanDynamicObject.invokeMethod(BeanDynamicObject.java:130)
	at org.gradle.api.internal.CompositeDynamicObject.invokeMethod(CompositeDynamicObject.java:150)
	at org.gradle.groovy.scripts.BasicScript.methodMissing(BasicScript.java:79)
	at build_rfan8buomadwre2cexy5u6xc.run(<https://builds.apache.org/job/Zest(JavaEdition)-develop-java8-checkDists/ws/libraries/sql/build.gradle>:25)
	at org.gradle.groovy.scripts.internal.DefaultScriptRunnerFactory$ScriptRunnerImpl.run(DefaultScriptRunnerFactory.java:91)
	... 50 more


BUILD FAILED

Total time: 27.682 secs
Build step 'Invoke Gradle script' changed build result to FAILURE
Build step 'Invoke Gradle script' marked build as failure
Xvfb stopping
Archiving artifacts
Recording test results
ERROR: Step ?Publish JUnit test result report? failed: Test reports were found but none of
them are new. Did tests run? 
For example, <https://builds.apache.org/job/Zest(JavaEdition)-develop-java8-checkDists/ws/core/api/build/test-results/TEST-org.apache.zest.api.OperatorsTest.xml>
is 1 day 23 hr old

Publishing Javadoc

Mime
View raw message